Ticket #34374: main.log

File main.log, 53.8 KB (added by ryandesign (Ryan Carsten Schmidt), 12 years ago)
Line 
1version:1
2:msg:main --->  Computing dependencies for ppl:info:main .:debug:main Searching for dependency: m4
3:debug:main Found Dependency: receipt exists for m4
4:debug:main Searching for dependency: gmp
5:debug:main Found Dependency: receipt exists for gmp
6:msg:main
7:debug:main Executing org.macports.main (ppl)
8:debug:main changing euid/egid - current euid: 0 - current egid: 0
9:debug:main egid changed to: 502
10:debug:main euid changed to: 502
11:debug:archivefetch archivefetch phase started at Wed May  9 01:26:26 CDT 2012
12:msg:archivefetch --->  Fetching archive for ppl
13:debug:archivefetch Executing org.macports.archivefetch (ppl)
14:debug:archivefetch euid/egid changed to: 0/0
15:debug:archivefetch chowned /mp/var/macports/software/ppl to macports
16:debug:archivefetch euid/egid changed to: 502/502
17:debug:archivefetch euid/egid changed to: 0/0
18:debug:archivefetch chowned /mp/var/macports/incoming to macports
19:debug:archivefetch euid/egid changed to: 502/502
20:info:archivefetch --->  ppl-0.12.1_1.darwin_9.ppc.tbz2 doesn't seem to exist in /mp/var/macports/software/ppl
21:debug:archivefetch Privilege de-escalation not attempted as not running as root.
22:debug:fetch fetch phase started at Wed May  9 01:26:26 CDT 2012
23:notice:fetch --->  Fetching ppl
24:debug:fetch euid/egid changed to: 0/0
25:debug:fetch chowned /mp/var/macports/distfiles/ppl to macports
26:debug:fetch euid/egid changed to: 502/502
27:debug:fetch Executing org.macports.fetch (ppl)
28:debug:fetch Privilege de-escalation not attempted as not running as root.
29:debug:checksum checksum phase started at Wed May  9 01:26:26 CDT 2012
30:notice:checksum --->  Verifying checksum(s) for ppl
31:debug:checksum Executing org.macports.checksum (ppl)
32:info:checksum --->  Checksumming ppl-0.12.1.tar.bz2
33:debug:checksum Correct (md5) checksum for ppl-0.12.1.tar.bz2
34:debug:checksum Correct (sha1) checksum for ppl-0.12.1.tar.bz2
35:debug:checksum Correct (rmd160) checksum for ppl-0.12.1.tar.bz2
36:debug:checksum Privilege de-escalation not attempted as not running as root.
37:debug:extract extract phase started at Wed May  9 01:26:29 CDT 2012
38:notice:extract --->  Extracting ppl
39:debug:extract setting option extract.cmd to /usr/bin/bzip2
40:debug:extract Executing org.macports.extract (ppl)
41:info:extract --->  Extracting ppl-0.12.1.tar.bz2
42:debug:extract setting option extract.args to '/mp/var/macports/distfiles/ppl/ppl-0.12.1.tar.bz2'
43:debug:extract Environment: CPATH='/mp/include' CC_PRINT_OPTIONS_FILE='/mp/var/macports/build/_Volumes_data_macports_ports_devel_ppl/ppl/work/.CC_PRINT_OPTIONS' LIBRARY_PATH='/mp/lib' CC_PRINT_OPTIONS='YES' MACOSX_DEPLOYMENT_TARGET='10.5' GI_SCANNER_DISABLE_CACHE='1'
44:debug:extract Assembled command: 'cd "/mp/var/macports/build/_Volumes_data_macports_ports_devel_ppl/ppl/work" && /usr/bin/bzip2 -dc '/mp/var/macports/distfiles/ppl/ppl-0.12.1.tar.bz2' | /usr/bin/gnutar --no-same-owner -xf -'
45:debug:extract Executing command line:  cd "/mp/var/macports/build/_Volumes_data_macports_ports_devel_ppl/ppl/work" && /usr/bin/bzip2 -dc '/mp/var/macports/distfiles/ppl/ppl-0.12.1.tar.bz2' | /usr/bin/gnutar --no-same-owner -xf -
46:debug:extract euid/egid changed to: 0/0
47:debug:extract chowned /mp/var/macports/build/_Volumes_data_macports_ports_devel_ppl/ppl/work to macports
48:debug:extract euid/egid changed to: 502/502
49:debug:extract Privilege de-escalation not attempted as not running as root.
50:debug:patch patch phase started at Wed May  9 01:26:52 CDT 2012
51:debug:patch Executing org.macports.patch (ppl)
52:debug:patch Privilege de-escalation not attempted as not running as root.
53:debug:configure configure phase started at Wed May  9 01:26:52 CDT 2012
54:notice:configure --->  Configuring ppl
55:debug:configure Using compiler 'Mac OS X gcc 4.0'
56:debug:configure Executing org.macports.configure (ppl)
57:debug:configure Environment: CPATH='/mp/include' CFLAGS='-pipe -O2 -arch ppc' CPPFLAGS='-I/mp/include' CXXFLAGS='-pipe -O2 -arch ppc' LIBRARY_PATH='/mp/lib' MACOSX_DEPLOYMENT_TARGET='10.5' CXX='/usr/bin/g++-4.0' CC_PRINT_OPTIONS_FILE='/mp/var/macports/build/_Volumes_data_macports_ports_devel_ppl/ppl/work/.CC_PRINT_OPTIONS' F90FLAGS='-pipe -O2 -m32' LDFLAGS='-L/mp/lib -arch ppc' OBJC='/usr/bin/gcc-4.0' FCFLAGS='-pipe -O2 -m32' GI_SCANNER_DISABLE_CACHE='1' INSTALL='/usr/bin/install -c' OBJCFLAGS='-pipe -O2 -arch ppc' FFLAGS='-pipe -O2 -m32' CC_PRINT_OPTIONS='YES' CC='/usr/bin/gcc-4.0'
58:debug:configure Assembled command: 'cd "/mp/var/macports/build/_Volumes_data_macports_ports_devel_ppl/ppl/work/ppl-0.12.1" && ./configure --prefix=/mp'
59:debug:configure Executing command line:  cd "/mp/var/macports/build/_Volumes_data_macports_ports_devel_ppl/ppl/work/ppl-0.12.1" && ./configure --prefix=/mp
60:info:configure checking build system type... powerpc-apple-darwin9.8.0
61:info:configure checking host system type... powerpc-apple-darwin9.8.0
62:info:configure checking for a BSD-compatible install... /usr/bin/install -c
63:info:configure checking whether build environment is sane... yes
64:info:configure checking for a thread-safe mkdir -p... /mp/bin/gmkdir -p
65:info:configure checking for gawk... gawk
66:info:configure checking whether make sets $(MAKE)... yes
67:info:configure checking whether make supports nested variables... yes
68:info:configure checking how to create a ustar tar archive... gnutar
69:info:configure checking for gcc... /usr/bin/gcc-4.0
70:info:configure checking whether the C compiler works... yes
71:info:configure checking for C compiler default output file name... a.out
72:info:configure checking for suffix of executables...
73:info:configure checking whether we are cross compiling... no
74:info:configure checking for suffix of object files... o
75:info:configure checking whether we are using the GNU C compiler... yes
76:info:configure checking whether /usr/bin/gcc-4.0 accepts -g... yes
77:info:configure checking for /usr/bin/gcc-4.0 option to accept ISO C89... none needed
78:info:configure checking for style of include used by make... GNU
79:info:configure checking dependency style of /usr/bin/gcc-4.0... gcc3
80:info:configure checking whether we are actually using the Intel C compiler... no
81:info:configure checking whether we are actually using Clang... no
82:info:configure checking whether we are using the GNU C++ compiler... yes
83:info:configure checking whether /usr/bin/g++-4.0 accepts -g... yes
84:info:configure checking dependency style of /usr/bin/g++-4.0... gcc3
85:info:configure checking whether we are actually using the Intel C++ compiler... no
86:info:configure checking whether we are actually using clang++... no
87:info:configure checking for grep that handles long lines and -e... /usr/bin/grep
88:info:configure checking for fgrep... /usr/bin/grep -F
89:info:configure checking for egrep... /usr/bin/grep -E
90:info:configure checking for a sed that does not truncate output... /mp/bin/gsed
91:info:configure checking how to run the C++ preprocessor... /usr/bin/g++-4.0 -E
92:info:configure checking whether make sets $(MAKE)... (cached) yes
93:info:configure checking whether to compile with debug info... yes
94:info:configure checking whether to compile for profiling... no
95:info:configure checking whether to compile for test coverage... no
96:info:configure checking whether to enable checking of run-time assertions... no
97:info:configure checking whether to enable even more run-time assertions... no
98:info:configure checking whether to enable optimizations... standard
99:info:configure checking for which architecture to optimize... default
100:info:configure checking whether to use (a specific) floating point arithmetic... default
101:info:configure checking whether to use precompiled headers... no
102:info:configure checking the type of integral values to use as coefficients... GMP mpz
103:info:configure checking for an ANSI C-conforming const... yes
104:info:configure checking for inline... inline
105:info:configure checking how to run the C preprocessor... /usr/bin/gcc-4.0 -E
106:info:configure checking for ANSI C header files... yes
107:info:configure checking for sys/types.h... yes
108:info:configure checking for sys/stat.h... yes
109:info:configure checking for stdlib.h... yes
110:info:configure checking for string.h... yes
111:info:configure checking for memory.h... yes
112:info:configure checking for strings.h... yes
113:info:configure checking for inttypes.h... yes
114:info:configure checking for stdint.h... yes
115:info:configure checking for unistd.h... yes
116:info:configure checking whether byte ordering is bigendian... yes
117:info:configure checking for typeof syntax and keyword spelling... typeof
118:info:configure checking size of char... 1
119:info:configure checking size of short... 2
120:info:configure checking size of int... 4
121:info:configure checking size of long... 4
122:info:configure checking size of long long... 8
123:info:configure checking size of size_t... 4
124:info:configure checking size of float... 4
125:info:configure checking size of double... 8
126:info:configure checking size of long double... 16
127:info:configure checking size of int*... 4
128:info:configure checking size of fp... 4
129:info:configure checking for perl... /mp/bin/perl
130:info:configure checking for library containing sqrt... none required
131:info:configure checking fenv.h usability... yes
132:info:configure checking fenv.h presence... yes
133:info:configure checking for fenv.h... yes
134:info:configure checking ieeefp.h usability... no
135:info:configure checking ieeefp.h presence... no
136:info:configure checking for ieeefp.h... no
137:info:configure checking if it is possible to control the FPU... yes
138:info:configure checking whether the plain char type is signed... yes
139:info:configure checking whether the C++ compiler provides proper long doubles... yes
140:info:configure checking the binary format of C++ floats... IEEE754 Single Precision
141:info:configure checking whether C++ provides exact output for floats... yes
142:info:configure checking the binary format of C++ doubles... IEEE754 Double Precision
143:info:configure checking whether C++ provides exact output for doubles... yes
144:info:configure checking the binary format of C++ long doubles... unknown
145:info:configure checking whether C++ provides exact output for long doubles... no
146:info:configure checking whether the C++ compiler supports zero-length arrays... yes
147:info:configure checking whether the IEEE inexact flag is supported in C++... yes
148:info:configure checking whether the C++ compiler supports __attribute__ ((weak))... yes
149:info:configure checking for fenv.h... (cached) yes
150:info:configure checking for ieeefp.h... (cached) no
151:info:configure checking getopt.h usability... yes
152:info:configure checking getopt.h presence... yes
153:info:configure checking for getopt.h... yes
154:info:configure checking signal.h usability... yes
155:info:configure checking signal.h presence... yes
156:info:configure checking for signal.h... yes
157:info:configure checking for string.h... (cached) yes
158:info:configure checking for strings.h... (cached) yes
159:info:configure checking sys/resource.h usability... yes
160:info:configure checking sys/resource.h presence... yes
161:info:configure checking for sys/resource.h... yes
162:info:configure checking sys/time.h usability... yes
163:info:configure checking sys/time.h presence... yes
164:info:configure checking for sys/time.h... yes
165:info:configure checking for sys/types.h... (cached) yes
166:info:configure checking for unistd.h... (cached) yes
167:info:configure checking whether ffs is declared... yes
168:info:configure checking whether getenv is declared... yes
169:info:configure checking whether strtof is declared... yes
170:info:configure checking whether strtod is declared... yes
171:info:configure checking whether strtold is declared... yes
172:info:configure checking whether strtoll is declared... yes
173:info:configure checking whether strtoull is declared... yes
174:info:configure checking whether fma is declared... yes
175:info:configure checking whether fmaf is declared... yes
176:info:configure checking whether fmal is declared... yes
177:info:configure checking whether rintf is declared... yes
178:info:configure checking whether rintl is declared... yes
179:info:configure checking for int_fast16_t... yes
180:info:configure checking for int_fast32_t... yes
181:info:configure checking for int_fast64_t... yes
182:info:configure checking for uint_fast16_t... yes
183:info:configure checking for uint_fast32_t... yes
184:info:configure checking for uint_fast64_t... yes
185:info:configure checking for uintptr_t... yes
186:info:configure checking for the GMP library version 4.1.3 or above... yes
187:info:configure checking size of mp_limb_t... 4
188:info:configure checking whether GMP has been compiled with support for exceptions... no
189:info:configure checking for __mpz_struct._mp_alloc... yes
190:info:configure checking for __mpz_struct._mp_size... yes
191:info:configure checking for __mpz_struct._mp_d... yes
192:info:configure checking whether to build the ppl_lcdd program... yes
193:info:configure checking whether to build the ppl_lpsol program... yes
194:info:configure checking whether to build the ppl_pips program... yes
195:info:configure checking whether to build the PPL documentation... yes
196:info:configure checking which interfaces are enabled... cxx c ocaml java
197:info:configure checking for javac... /Library/Java/Home/bin/javac
198:info:configure checking whether /Library/Java/Home/bin/javac supports enums... yes
199:info:configure checking for java... /Library/Java/Home/bin/java
200:info:configure checking for uudecode... yes
201:info:configure checking if uudecode can decode base 64 file... yes
202:info:configure checking if /Library/Java/Home/bin/java works... yes
203:info:configure checking for jar... /Library/Java/Home/bin/jar
204:info:configure checking for javah... /Library/Java/Home/bin/javah
205:info:configure checking whether jlong can contain data pointers... yes
206:info:configure checking for ocamlc... no
207:info:configure checking for ocamldep... no
208:info:configure checking for ocamlmktop... no
209:info:configure checking for ocamlmklib... no
210:info:configure checking for ocamldoc... no
211:info:configure checking for ocamlbuild... no
212:info:configure checking for GNU M4 that supports accurate traces... /mp/bin/gm4
213:info:configure checking how m4 supports trace files... --debugfile
214:info:configure checking which instantiations are enabled... Polyhedron@Grid@Rational_Box@BD_Shape<mpz_class>@BD_Shape<mpq_class>@Octagonal_Shape<mpz_class>@Octagonal_Shape<mpq_class>@Constraints_Product<C_Polyhedron,Grid>@Pointset_Powerset<C_Polyhedron>@Pointset_Powerset<NNC_Polyhedron>@Double_Box@BD_Shape<double>@Octagonal_Shape<double>
215:info:configure checking whether tests should be run under Valgrind... no
216:info:configure checking whether `make check' does a thorough or quick check... quick
217:info:configure checking how to print strings... printf
218:info:configure checking for a sed that does not truncate output... (cached) /mp/bin/gsed
219:info:configure checking for ld used by /usr/bin/gcc-4.0... /usr/libexec/gcc/powerpc-apple-darwin9/4.0.1/ld
220:info:configure checking if the linker (/usr/libexec/gcc/powerpc-apple-darwin9/4.0.1/ld) is GNU ld... no
221:info:configure checking for BSD- or MS-compatible name lister (nm)... /mp/bin/nm -p
222:info:configure checking the name lister (/mp/bin/nm -p) interface... BSD nm
223:info:configure checking whether ln -s works... yes
224:info:configure checking the maximum length of command line arguments... 196608
225:info:configure checking whether the shell understands some XSI constructs... yes
226:info:configure checking whether the shell understands "+="... yes
227:info:configure checking how to convert powerpc-apple-darwin9.8.0 file names to powerpc-apple-darwin9.8.0 format... func_convert_file_noop
228:info:configure checking how to convert powerpc-apple-darwin9.8.0 file names to toolchain format... func_convert_file_noop
229:info:configure checking for /usr/libexec/gcc/powerpc-apple-darwin9/4.0.1/ld option to reload object files... -r
230:info:configure checking for objdump... no
231:info:configure checking how to recognize dependent libraries... pass_all
232:info:configure checking for dlltool... no
233:info:configure checking how to associate runtime and link libraries... printf %s\n
234:info:configure checking for ar... ar
235:info:configure checking for archiver @FILE support... no
236:info:configure checking for strip... strip
237:info:configure checking for ranlib... ranlib
238:info:configure checking command to parse /mp/bin/nm -p output from /usr/bin/gcc-4.0 object... ok
239:info:configure checking for sysroot... no
240:info:configure checking for mt... no
241:info:configure checking if : is a manifest tool... no
242:info:configure checking for dsymutil... dsymutil
243:info:configure checking for nmedit... nmedit
244:info:configure checking for lipo... lipo
245:info:configure checking for otool... otool
246:info:configure checking for otool64... no
247:info:configure checking for -single_module linker flag... yes
248:info:configure checking for -exported_symbols_list linker flag... yes
249:info:configure checking for -force_load linker flag... ld: unknown option: -force_load
250:info:configure no
251:info:configure checking for dlfcn.h... yes
252:info:configure checking for objdir... .libs
253:info:configure checking if /usr/bin/gcc-4.0 supports -fno-rtti -fno-exceptions... no
254:info:configure checking for /usr/bin/gcc-4.0 option to produce PIC... -fno-common -DPIC
255:info:configure checking if /usr/bin/gcc-4.0 PIC flag -fno-common -DPIC works... yes
256:info:configure checking if /usr/bin/gcc-4.0 static flag -static works... no
257:info:configure checking if /usr/bin/gcc-4.0 supports -c -o file.o... yes
258:info:configure checking if /usr/bin/gcc-4.0 supports -c -o file.o... (cached) yes
259:info:configure checking whether the /usr/bin/gcc-4.0 linker (/usr/libexec/gcc/powerpc-apple-darwin9/4.0.1/ld) supports shared libraries... yes
260:info:configure checking dynamic linker characteristics... darwin9.8.0 dyld
261:info:configure checking how to hardcode library paths into programs... immediate
262:info:configure checking for dlopen in -ldl... yes
263:info:configure checking whether a program can dlopen itself... yes
264:info:configure checking whether a statically linked program can dlopen itself... yes
265:info:configure checking whether stripping libraries is possible... yes
266:info:configure checking if libtool supports shared libraries... yes
267:info:configure checking whether to build shared libraries... yes
268:info:configure checking whether to build static libraries... yes
269:info:configure checking how to run the C++ preprocessor... /usr/bin/g++-4.0 -E
270:info:configure checking for ld used by /usr/bin/g++-4.0... /usr/libexec/gcc/powerpc-apple-darwin9/4.0.1/ld
271:info:configure checking if the linker (/usr/libexec/gcc/powerpc-apple-darwin9/4.0.1/ld) is GNU ld... no
272:info:configure checking whether the /usr/bin/g++-4.0 linker (/usr/libexec/gcc/powerpc-apple-darwin9/4.0.1/ld) supports shared libraries... yes
273:info:configure checking for /usr/bin/g++-4.0 option to produce PIC... -fno-common -DPIC
274:info:configure checking if /usr/bin/g++-4.0 PIC flag -fno-common -DPIC works... yes
275:info:configure checking if /usr/bin/g++-4.0 static flag -static works... no
276:info:configure checking if /usr/bin/g++-4.0 supports -c -o file.o... yes
277:info:configure checking if /usr/bin/g++-4.0 supports -c -o file.o... (cached) yes
278:info:configure checking whether the /usr/bin/g++-4.0 linker (/usr/libexec/gcc/powerpc-apple-darwin9/4.0.1/ld) supports shared libraries... yes
279:info:configure checking dynamic linker characteristics... darwin9.8.0 dyld
280:info:configure checking how to hardcode library paths into programs... immediate
281:info:configure checking for md5sum... no
282:info:configure checking glpk.h usability... yes
283:info:configure checking glpk.h presence... yes
284:info:configure checking for glpk.h... yes
285:info:configure checking glpk/glpk.h usability... no
286:info:configure checking glpk/glpk.h presence... no
287:info:configure checking for glpk/glpk.h... no
288:info:configure checking whether lib_set_print_hook is declared... no
289:info:configure checking for _glp_lib_print_hook... no
290:info:configure checking whether glp_term_out is declared... yes
291:info:configure checking whether glp_term_hook is declared... yes
292:info:configure checking whether RLIMIT_DATA is declared... yes
293:info:configure checking whether RLIMIT_RSS is declared... yes
294:info:configure checking whether RLIMIT_VMEM is declared... no
295:info:configure checking whether RLIMIT_AS is declared... yes
296:info:configure checking whether getrusage is declared... yes
297:info:configure checking whether setrlimit is declared... yes
298:info:configure checking whether setitimer is declared... yes
299:info:configure checking whether sigaction is declared... yes
300:info:configure checking for timeval... yes
301:info:configure checking for siginfo_t... yes
302:info:configure checking whether we can limit memory in C++ using setrlimit()... no
303:info:configure configure: creating ./config.status
304:info:configure config.status: creating Makefile
305:info:configure config.status: creating ppl.lsm
306:info:configure config.status: creating src/Makefile
307:info:configure config.status: creating src/version.hh
308:info:configure config.status: creating src/ppl-config.cc
309:info:configure config.status: creating tests/Makefile
310:info:configure config.status: creating tests/BD_Shape/Makefile
311:info:configure config.status: creating tests/Box/Makefile
312:info:configure config.status: creating tests/Concrete_Expression/Makefile
313:info:configure config.status: creating tests/CO_Tree/Makefile
314:info:configure config.status: creating tests/Grid/Makefile
315:info:configure config.status: creating tests/MIP_Problem/Makefile
316:info:configure config.status: creating tests/Octagonal_Shape/Makefile
317:info:configure config.status: creating tests/Partially_Reduced_Product/Makefile
318:info:configure config.status: creating tests/PIP_Problem/Makefile
319:info:configure config.status: creating tests/Polyhedron/Makefile
320:info:configure config.status: creating tests/Powerset/Makefile
321:info:configure config.status: creating tests/Sparse_Matrix/Makefile
322:info:configure config.status: creating tests/Watchdog/Makefile
323:info:configure config.status: creating utils/Makefile
324:info:configure config.status: creating m4/Makefile
325:info:configure config.status: creating demos/Makefile
326:info:configure config.status: creating demos/ppl_lcdd/Makefile
327:info:configure config.status: creating demos/ppl_lcdd/examples/Makefile
328:info:configure config.status: creating demos/ppl_lpsol/Makefile
329:info:configure config.status: creating demos/ppl_lpsol/examples/Makefile
330:info:configure config.status: creating demos/ppl_pips/Makefile
331:info:configure config.status: creating demos/ppl_pips/examples/Makefile
332:info:configure config.status: creating doc/Makefile
333:info:configure config.status: creating doc/user.doxyconf-latex
334:info:configure config.status: creating doc/devref.doxyconf-latex
335:info:configure config.status: creating doc/user.doxyconf-html
336:info:configure config.status: creating doc/devref.doxyconf-html
337:info:configure config.status: creating doc/user-language-interface.doxyconf
338:info:configure config.status: creating doc/devref-language-interface.doxyconf
339:info:configure config.status: creating interfaces/Makefile
340:info:configure config.status: creating interfaces/C/Makefile
341:info:configure config.status: creating interfaces/C/ppl_c_version.h
342:info:configure config.status: creating interfaces/C/tests/Makefile
343:info:configure config.status: creating interfaces/Java/Makefile
344:info:configure config.status: creating interfaces/Java/jni/Makefile
345:info:configure config.status: creating interfaces/Java/tests/Makefile
346:info:configure config.status: creating interfaces/Java/parma_polyhedra_library/Makefile
347:info:configure config.status: creating interfaces/OCaml/Makefile
348:info:configure config.status: creating interfaces/OCaml/tests/Makefile
349:info:configure config.status: creating interfaces/Prolog/Makefile
350:info:configure config.status: creating interfaces/Prolog/Ciao/Makefile
351:info:configure config.status: creating interfaces/Prolog/GNU/Makefile
352:info:configure config.status: creating interfaces/Prolog/SICStus/Makefile
353:info:configure config.status: creating interfaces/Prolog/SWI/Makefile
354:info:configure config.status: creating interfaces/Prolog/XSB/Makefile
355:info:configure config.status: creating interfaces/Prolog/YAP/Makefile
356:info:configure config.status: creating interfaces/Prolog/tests/Makefile
357:info:configure config.status: creating config.h
358:info:configure config.status: executing depfiles commands
359:info:configure config.status: executing libtool commands
360:info:configure configure: WARNING: CANNOT PROPAGATE EXCEPTIONS BACK FROM GMP:
361:info:configure *** MEMORY EXHAUSTION MAY RESULT IN ABRUPT TERMINATION.
362:info:configure *** This is OK, if you do not plan to use the bounded memory capabilities
363:info:configure *** offered by the PPL.  Otherwise, if you are using GCC or the Intel C/C++
364:info:configure *** compiler, please make sure you use a version of GMP compiled with the
365:info:configure *** `-fexceptions' compiler option.
366:info:configure *** To build such a version, you can configure GMP as follows:
367:info:configure *** CPPFLAGS=-fexceptions ./configure --enable-cxx --prefix=/usr/local
368:debug:configure Privilege de-escalation not attempted as not running as root.
369:debug:build build phase started at Wed May  9 01:30:34 CDT 2012
370:notice:build --->  Building ppl
371:debug:build Executing org.macports.build (ppl)
372:debug:build Environment: CPATH='/mp/include' CC_PRINT_OPTIONS_FILE='/mp/var/macports/build/_Volumes_data_macports_ports_devel_ppl/ppl/work/.CC_PRINT_OPTIONS' LIBRARY_PATH='/mp/lib' CC_PRINT_OPTIONS='YES' MACOSX_DEPLOYMENT_TARGET='10.5' GI_SCANNER_DISABLE_CACHE='1'
373:debug:build Assembled command: 'cd "/mp/var/macports/build/_Volumes_data_macports_ports_devel_ppl/ppl/work/ppl-0.12.1" && /usr/bin/make -w all'
374:debug:build Executing command line:  cd "/mp/var/macports/build/_Volumes_data_macports_ports_devel_ppl/ppl/work/ppl-0.12.1" && /usr/bin/make -w all
375:info:build make: Entering directory `/mp/var/macports/build/_Volumes_data_macports_ports_devel_ppl/ppl/work/ppl-0.12.1'
376:info:build /usr/bin/make  all-recursive
377:info:build make[1]: Entering directory `/mp/var/macports/build/_Volumes_data_macports_ports_devel_ppl/ppl/work/ppl-0.12.1'
378:info:build Making all in .
379:info:build make[2]: Entering directory `/mp/var/macports/build/_Volumes_data_macports_ports_devel_ppl/ppl/work/ppl-0.12.1'
380:info:build /mp/bin/gsed -f ./ppl-config.sed config.h >ppl-config.h
381:info:build make[2]: Leaving directory `/mp/var/macports/build/_Volumes_data_macports_ports_devel_ppl/ppl/work/ppl-0.12.1'
382:info:build Making all in utils
383:info:build make[2]: Entering directory `/mp/var/macports/build/_Volumes_data_macports_ports_devel_ppl/ppl/work/ppl-0.12.1/utils'
384:info:build /usr/bin/g++-4.0 -DHAVE_CONFIG_H -I. -I..   -I/mp/include  -g -O2 -frounding-math -pipe -O2 -arch ppc -W -Wall -MT timings.o -MD -MP -MF .deps/timings.Tpo -c -o timings.o timings.cc
385:info:build mv -f .deps/timings.Tpo .deps/timings.Po
386:info:build rm -f libppl_utils.a
387:info:build ar cru libppl_utils.a timings.o
388:info:build ranlib libppl_utils.a
389:info:build /mp/bin/gsed -e 's,[@]PERL[@],/mp/bin/perl,g' -e 's,[@]generated_automatically[@],Generated automatically: do not modify; modify the .in file instead.,g' < ./build_header.in > build_header
390:info:build chmod +x build_header
391:info:build /mp/bin/gsed -e 's,[@]PERL[@],/mp/bin/perl,g' -e 's,[@]generated_automatically[@],Generated automatically: do not modify; modify the .in file instead.,g' < ./text2cxxarray.in > text2cxxarray
392:info:build chmod +x text2cxxarray
393:info:build make[2]: Leaving directory `/mp/var/macports/build/_Volumes_data_macports_ports_devel_ppl/ppl/work/ppl-0.12.1/utils'
394:info:build Making all in src
395:info:build make[2]: Entering directory `/mp/var/macports/build/_Volumes_data_macports_ports_devel_ppl/ppl/work/ppl-0.12.1/src'
396:info:build for file in namespaces.hh compiler.hh assert.hh meta_programming.hh Slow_Copy.hh Has_Assign_Or_Swap.hh assign_or_swap.hh mp_std_bits.defs.hh mp_std_bits.inlines.hh Concrete_Expression.types.hh Concrete_Expression.defs.hh Concrete_Expression.inlines.hh Temp.defs.hh Temp.inlines.hh Temp.templates.hh Coefficient_traits_template.hh Checked_Number.types.hh GMP_Integer.types.hh Coefficient.types.hh stdiobuf.types.hh c_streambuf.types.hh globals.types.hh iterator_to_const.types.hh distances.types.hh Interval_Info.types.hh Interval.types.hh Box.types.hh Constraint.types.hh Generator.types.hh Grid_Generator.types.hh Congruence.types.hh Init.types.hh Row_Flags.types.hh Dense_Row.types.hh CO_Tree.types.hh Sparse_Row.types.hh Sparse_Matrix.types.hh Linear_Row.types.hh Dense_Matrix.types.hh Variable.types.hh Variables_Set.types.hh Linear_Expression.types.hh Linear_System.types.hh Linear_Form.types.hh Bit_Row.types.hh Bit_Matrix.types.hh Constraint_System.types.hh Generator_System.types.hh Grid_Generator_System.types.hh Congruence_System.types.hh Scalar_Products.types.hh PIP_Tree.types.hh PIP_Problem.types.hh Poly_Con_Relation.types.hh Poly_Gen_Relation.types.hh BHRZ03_Certificate.types.hh H79_Certificate.types.hh Grid_Certificate.types.hh Partial_Function.types.hh Polyhedron.types.hh C_Polyhedron.types.hh NNC_Polyhedron.types.hh Grid.types.hh Ptr_Iterator.types.hh DB_Row.types.hh DB_Matrix.types.hh BD_Shape.types.hh OR_Matrix.types.hh Octagonal_Shape.types.hh fpu.types.hh Float.defs.hh Float.inlines.hh Float.templates.hh C_Integer.hh fpu.defs.hh fpu-c99.inlines.hh fpu-ia32.inlines.hh fpu-none.inlines.hh fpu-sparc.inlines.hh Rounding_Dir.defs.hh Rounding_Dir.inlines.hh Result.defs.hh Result.inlines.hh Numeric_Format.defs.hh checked.defs.hh checked.inlines.hh checked_int.inlines.hh checked_float.inlines.hh checked_mpz.inlines.hh checked_mpq.inlines.hh checked_ext.inlines.hh Checked_Number.defs.hh Checked_Number.inlines.hh Checked_Number.templates.hh WRD_coefficient_types.defs.hh WRD_coefficient_types.inlines.hh checked_numeric_limits.hh GMP_Integer.defs.hh GMP_Integer.inlines.hh Coefficient.defs.hh Coefficient.inlines.hh stdiobuf.defs.hh stdiobuf.inlines.hh c_streambuf.defs.hh c_streambuf.inlines.hh globals.defs.hh globals.inlines.hh math_utilities.defs.hh math_utilities.inlines.hh iterator_to_const.defs.hh iterator_to_const.inlines.hh distances.defs.hh distances.inlines.hh Boundary.defs.hh intervals.defs.hh Interval_Info.defs.hh Interval_Info.inlines.hh Interval.defs.hh Interval.inlines.hh Interval.templates.hh Box.defs.hh Box_Status.inlines.hh Box.inlines.hh Box.templates.hh Integer_Interval.hh Rational_Interval.hh Rational_Box.hh Variable.defs.hh Variable.inlines.hh Variables_Set.defs.hh Variables_Set.inlines.hh Init.defs.hh Init.inlines.hh initializer.hh Topology.types.hh Row_Flags.defs.hh Row_Flags.inlines.hh Dense_Row.defs.hh Dense_Row.inlines.hh Dense_Row.templates.hh CO_Tree.defs.hh CO_Tree.inlines.hh CO_Tree.templates.hh Sparse_Row.defs.hh Sparse_Row.inlines.hh Sparse_Row.templates.hh Sparse_Matrix.defs.hh Sparse_Matrix.inlines.hh Linear_Row.defs.hh Linear_Row.inlines.hh Dense_Matrix.defs.hh Dense_Matrix.inlines.hh Bit_Row.defs.hh Bit_Row.inlines.hh Linear_System.defs.hh Linear_System.inlines.hh Bit_Matrix.defs.hh Bit_Matrix.inlines.hh Constraint_System.defs.hh Generator_System.defs.hh Grid_Generator_System.defs.hh Congruence_System.defs.hh Linear_Expression.defs.hh Linear_Expression.inlines.hh Linear_Form.defs.hh Linear_Form.inlines.hh Linear_Form.templates.hh linearize.hh Constraint.defs.hh Constraint.inlines.hh Constraint_System.inlines.hh Generator.defs.hh Generator.inlines.hh Grid_Generator.defs.hh Grid_Generator.inlines.hh Congruence.defs.hh Congruence.inlines.hh Generator_System.inlines.hh Grid_Generator_System.inlines.hh Congruence_System.inlines.hh Scalar_Products.defs.hh Scalar_Products.inlines.hh Row.types.hh Row.defs.hh Matrix.types.hh Matrix.defs.hh MIP_Problem.types.hh MIP_Problem.defs.hh MIP_Problem.inlines.hh MIP_Problem.templates.hh PIP_Tree.types.hh PIP_Tree.defs.hh PIP_Tree.inlines.hh PIP_Problem.types.hh PIP_Problem.defs.hh PIP_Problem.inlines.hh PIP_Problem.templates.hh Poly_Con_Relation.defs.hh Poly_Con_Relation.inlines.hh Poly_Gen_Relation.defs.hh Poly_Gen_Relation.inlines.hh BHRZ03_Certificate.defs.hh BHRZ03_Certificate.inlines.hh H79_Certificate.defs.hh H79_Certificate.inlines.hh Grid_Certificate.defs.hh Grid_Certificate.inlines.hh Partial_Function.defs.hh Partial_Function.inlines.hh Polyhedron.defs.hh Ph_Status.inlines.hh Polyhedron.inlines.hh Polyhedron.templates.hh Grid.defs.hh Grid_Status.inlines.hh Grid.inlines.hh Grid.templates.hh C_Polyhedron.defs.hh C_Polyhedron.inlines.hh NNC_Polyhedron.defs.hh NNC_Polyhedron.inlines.hh Widening_Function.types.hh Widening_Function.defs.hh Widening_Function.inlines.hh Ptr_Iterator.defs.hh Ptr_Iterator.inlines.hh DB_Row.defs.hh DB_Row.inlines.hh DB_Row.templates.hh DB_Matrix.defs.hh DB_Matrix.inlines.hh DB_Matrix.templates.hh BD_Shape.defs.hh BDS_Status.inlines.hh BD_Shape.inlines.hh BD_Shape.templates.hh OR_Matrix.defs.hh OR_Matrix.inlines.hh OR_Matrix.templates.hh Octagonal_Shape.defs.hh Og_Status.inlines.hh Octagonal_Shape.inlines.hh Octagonal_Shape.templates.hh Determinate.types.hh Determinate.defs.hh Determinate.inlines.hh Powerset.types.hh Powerset.defs.hh Powerset.inlines.hh Powerset.templates.hh Pointset_Powerset.types.hh Pointset_Powerset.defs.hh Pointset_Powerset.inlines.hh Pointset_Powerset.templates.hh Partially_Reduced_Product.types.hh Partially_Reduced_Product.defs.hh Partially_Reduced_Product.inlines.hh Partially_Reduced_Product.templates.hh Weight_Profiler.defs.hh max_space_dimension.hh algorithms.hh termination.defs.hh termination.templates.hh wrap_assign.hh wrap_string.hh Floating_Point_Expression.types.hh Floating_Point_Expression.defs.hh Floating_Point_Expression.inlines.hh Floating_Point_Expression.templates.hh Cast_Floating_Point_Expression.types.hh Cast_Floating_Point_Expression.defs.hh Cast_Floating_Point_Expression.inlines.hh Cast_Floating_Point_Expression.templates.hh Constant_Floating_Point_Expression.types.hh Constant_Floating_Point_Expression.defs.hh Constant_Floating_Point_Expression.inlines.hh Variable_Floating_Point_Expression.types.hh Variable_Floating_Point_Expression.defs.hh Variable_Floating_Point_Expression.inlines.hh Sum_Floating_Point_Expression.types.hh Sum_Floating_Point_Expression.defs.hh Sum_Floating_Point_Expression.inlines.hh Sum_Floating_Point_Expression.templates.hh Difference_Floating_Point_Expression.types.hh Difference_Floating_Point_Expression.defs.hh Difference_Floating_Point_Expression.inlines.hh Difference_Floating_Point_Expression.templates.hh Multiplication_Floating_Point_Expression.types.hh Multiplication_Floating_Point_Expression.defs.hh Multiplication_Floating_Point_Expression.inlines.hh Multiplication_Floating_Point_Expression.templates.hh Division_Floating_Point_Expression.types.hh Division_Floating_Point_Expression.defs.hh Division_Floating_Point_Expression.inlines.hh Division_Floating_Point_Expression.templates.hh Opposite_Floating_Point_Expression.types.hh Opposite_Floating_Point_Expression.defs.hh Opposite_Floating_Point_Expression.inlines.hh Doubly_Linked_Object.types.hh EList.types.hh EList_Iterator.types.hh Handler.types.hh Pending_Element.types.hh Pending_List.types.hh Time.types.hh Watchdog.types.hh Threshold_Watcher.types.hh Handler.defs.hh Handler.inlines.hh Time.defs.hh Time.inlines.hh Doubly_Linked_Object.defs.hh Doubly_Linked_Object.inlines.hh EList_Iterator.defs.hh EList_Iterator.inlines.hh EList.defs.hh EList.inlines.hh Pending_Element.defs.hh Pending_Element.inlines.hh Pending_List.defs.hh Pending_List.inlines.hh Pending_List.templates.hh Watchdog.defs.hh Watchdog.inlines.hh Threshold_Watcher.defs.hh Threshold_Watcher.inlines.hh Threshold_Watcher.templates.hh ; \
397:info:build     do \
398:info:build       i="#include \"$file\"" ; \
399:info:build       ( cd ../src ; /usr/bin/grep -F -q "$i" namespaces.hh compiler.hh assert.hh meta_programming.hh Slow_Copy.hh Has_Assign_Or_Swap.hh assign_or_swap.hh mp_std_bits.defs.hh mp_std_bits.inlines.hh Concrete_Expression.types.hh Concrete_Expression.defs.hh Concrete_Expression.inlines.hh Temp.defs.hh Temp.inlines.hh Temp.templates.hh Coefficient_traits_template.hh Checked_Number.types.hh GMP_Integer.types.hh Coefficient.types.hh stdiobuf.types.hh c_streambuf.types.hh globals.types.hh iterator_to_const.types.hh distances.types.hh Interval_Info.types.hh Interval.types.hh Box.types.hh Constraint.types.hh Generator.types.hh Grid_Generator.types.hh Congruence.types.hh Init.types.hh Row_Flags.types.hh Dense_Row.types.hh CO_Tree.types.hh Sparse_Row.types.hh Sparse_Matrix.types.hh Linear_Row.types.hh Dense_Matrix.types.hh Variable.types.hh Variables_Set.types.hh Linear_Expression.types.hh Linear_System.types.hh Linear_Form.types.hh Bit_Row.types.hh Bit_Matrix.types.hh Constraint_System.types.hh Generator_System.types.hh Grid_Generator_System.types.hh Congruence_System.types.hh Scalar_Products.types.hh PIP_Tree.types.hh PIP_Problem.types.hh Poly_Con_Relation.types.hh Poly_Gen_Relation.types.hh BHRZ03_Certificate.types.hh H79_Certificate.types.hh Grid_Certificate.types.hh Partial_Function.types.hh Polyhedron.types.hh C_Polyhedron.types.hh NNC_Polyhedron.types.hh Grid.types.hh Ptr_Iterator.types.hh DB_Row.types.hh DB_Matrix.types.hh BD_Shape.types.hh OR_Matrix.types.hh Octagonal_Shape.types.hh fpu.types.hh Float.defs.hh Float.inlines.hh Float.templates.hh C_Integer.hh fpu.defs.hh fpu-c99.inlines.hh fpu-ia32.inlines.hh fpu-none.inlines.hh fpu-sparc.inlines.hh Rounding_Dir.defs.hh Rounding_Dir.inlines.hh Result.defs.hh Result.inlines.hh Numeric_Format.defs.hh checked.defs.hh checked.inlines.hh checked_int.inlines.hh checked_float.inlines.hh checked_mpz.inlines.hh checked_mpq.inlines.hh checked_ext.inlines.hh Checked_Number.defs.hh Checked_Number.inlines.hh Checked_Number.templates.hh WRD_coefficient_types.defs.hh WRD_coefficient_types.inlines.hh checked_numeric_limits.hh GMP_Integer.defs.hh GMP_Integer.inlines.hh Coefficient.defs.hh Coefficient.inlines.hh stdiobuf.defs.hh stdiobuf.inlines.hh c_streambuf.defs.hh c_streambuf.inlines.hh globals.defs.hh globals.inlines.hh math_utilities.defs.hh math_utilities.inlines.hh iterator_to_const.defs.hh iterator_to_const.inlines.hh distances.defs.hh distances.inlines.hh Boundary.defs.hh intervals.defs.hh Interval_Info.defs.hh Interval_Info.inlines.hh Interval.defs.hh Interval.inlines.hh Interval.templates.hh Box.defs.hh Box_Status.inlines.hh Box.inlines.hh Box.templates.hh Integer_Interval.hh Rational_Interval.hh Rational_Box.hh Variable.defs.hh Variable.inlines.hh Variables_Set.defs.hh Variables_Set.inlines.hh Init.defs.hh Init.inlines.hh initializer.hh Topology.types.hh Row_Flags.defs.hh Row_Flags.inlines.hh Dense_Row.defs.hh Dense_Row.inlines.hh Dense_Row.templates.hh CO_Tree.defs.hh CO_Tree.inlines.hh CO_Tree.templates.hh Sparse_Row.defs.hh Sparse_Row.inlines.hh Sparse_Row.templates.hh Sparse_Matrix.defs.hh Sparse_Matrix.inlines.hh Linear_Row.defs.hh Linear_Row.inlines.hh Dense_Matrix.defs.hh Dense_Matrix.inlines.hh Bit_Row.defs.hh Bit_Row.inlines.hh Linear_System.defs.hh Linear_System.inlines.hh Bit_Matrix.defs.hh Bit_Matrix.inlines.hh Constraint_System.defs.hh Generator_System.defs.hh Grid_Generator_System.defs.hh Congruence_System.defs.hh Linear_Expression.defs.hh Linear_Expression.inlines.hh Linear_Form.defs.hh Linear_Form.inlines.hh Linear_Form.templates.hh linearize.hh Constraint.defs.hh Constraint.inlines.hh Constraint_System.inlines.hh Generator.defs.hh Generator.inlines.hh Grid_Generator.defs.hh Grid_Generator.inlines.hh Congruence.defs.hh Congruence.inlines.hh Generator_System.inlines.hh Grid_Generator_System.inlines.hh Congruence_System.inlines.hh Scalar_Products.defs.hh Scalar_Products.inlines.hh Row.types.hh Row.defs.hh Matrix.types.hh Matrix.defs.hh MIP_Problem.types.hh MIP_Problem.defs.hh MIP_Problem.inlines.hh MIP_Problem.templates.hh PIP_Tree.types.hh PIP_Tree.defs.hh PIP_Tree.inlines.hh PIP_Problem.types.hh PIP_Problem.defs.hh PIP_Problem.inlines.hh PIP_Problem.templates.hh Poly_Con_Relation.defs.hh Poly_Con_Relation.inlines.hh Poly_Gen_Relation.defs.hh Poly_Gen_Relation.inlines.hh BHRZ03_Certificate.defs.hh BHRZ03_Certificate.inlines.hh H79_Certificate.defs.hh H79_Certificate.inlines.hh Grid_Certificate.defs.hh Grid_Certificate.inlines.hh Partial_Function.defs.hh Partial_Function.inlines.hh Polyhedron.defs.hh Ph_Status.inlines.hh Polyhedron.inlines.hh Polyhedron.templates.hh Grid.defs.hh Grid_Status.inlines.hh Grid.inlines.hh Grid.templates.hh C_Polyhedron.defs.hh C_Polyhedron.inlines.hh NNC_Polyhedron.defs.hh NNC_Polyhedron.inlines.hh Widening_Function.types.hh Widening_Function.defs.hh Widening_Function.inlines.hh Ptr_Iterator.defs.hh Ptr_Iterator.inlines.hh DB_Row.defs.hh DB_Row.inlines.hh DB_Row.templates.hh DB_Matrix.defs.hh DB_Matrix.inlines.hh DB_Matrix.templates.hh BD_Shape.defs.hh BDS_Status.inlines.hh BD_Shape.inlines.hh BD_Shape.templates.hh OR_Matrix.defs.hh OR_Matrix.inlines.hh OR_Matrix.templates.hh Octagonal_Shape.defs.hh Og_Status.inlines.hh Octagonal_Shape.inlines.hh Octagonal_Shape.templates.hh Determinate.types.hh Determinate.defs.hh Determinate.inlines.hh Powerset.types.hh Powerset.defs.hh Powerset.inlines.hh Powerset.templates.hh Pointset_Powerset.types.hh Pointset_Powerset.defs.hh Pointset_Powerset.inlines.hh Pointset_Powerset.templates.hh Partially_Reduced_Product.types.hh Partially_Reduced_Product.defs.hh Partially_Reduced_Product.inlines.hh Partially_Reduced_Product.templates.hh Weight_Profiler.defs.hh max_space_dimension.hh algorithms.hh termination.defs.hh termination.templates.hh wrap_assign.hh wrap_string.hh Floating_Point_Expression.types.hh Floating_Point_Expression.defs.hh Floating_Point_Expression.inlines.hh Floating_Point_Expression.templates.hh Cast_Floating_Point_Expression.types.hh Cast_Floating_Point_Expression.defs.hh Cast_Floating_Point_Expression.inlines.hh Cast_Floating_Point_Expression.templates.hh Constant_Floating_Point_Expression.types.hh Constant_Floating_Point_Expression.defs.hh Constant_Floating_Point_Expression.inlines.hh Variable_Floating_Point_Expression.types.hh Variable_Floating_Point_Expression.defs.hh Variable_Floating_Point_Expression.inlines.hh Sum_Floating_Point_Expression.types.hh Sum_Floating_Point_Expression.defs.hh Sum_Floating_Point_Expression.inlines.hh Sum_Floating_Point_Expression.templates.hh Difference_Floating_Point_Expression.types.hh Difference_Floating_Point_Expression.defs.hh Difference_Floating_Point_Expression.inlines.hh Difference_Floating_Point_Expression.templates.hh Multiplication_Floating_Point_Expression.types.hh Multiplication_Floating_Point_Expression.defs.hh Multiplication_Floating_Point_Expression.inlines.hh Multiplication_Floating_Point_Expression.templates.hh Division_Floating_Point_Expression.types.hh Division_Floating_Point_Expression.defs.hh Division_Floating_Point_Expression.inlines.hh Division_Floating_Point_Expression.templates.hh Opposite_Floating_Point_Expression.types.hh Opposite_Floating_Point_Expression.defs.hh Opposite_Floating_Point_Expression.inlines.hh Doubly_Linked_Object.types.hh EList.types.hh EList_Iterator.types.hh Handler.types.hh Pending_Element.types.hh Pending_List.types.hh Time.types.hh Watchdog.types.hh Threshold_Watcher.types.hh Handler.defs.hh Handler.inlines.hh Time.defs.hh Time.inlines.hh Doubly_Linked_Object.defs.hh Doubly_Linked_Object.inlines.hh EList_Iterator.defs.hh EList_Iterator.inlines.hh EList.defs.hh EList.inlines.hh Pending_Element.defs.hh Pending_Element.inlines.hh Pending_List.defs.hh Pending_List.inlines.hh Pending_List.templates.hh Watchdog.defs.hh Watchdog.inlines.hh Threshold_Watcher.defs.hh Threshold_Watcher.inlines.hh Threshold_Watcher.templates.hh ) || echo "$i" ; \
400:info:build     done > ppl_include_files.hh
401:info:build ../utils/build_header \
402:info:build             -I .. -I ../src \
403:info:build             ../src/ppl_header.hh >ppl.hh
404:info:build ../utils/text2cxxarray --name=BUGS_array --decl-only \
405:info:build             ../BUGS >>BUGS.hh
406:info:build ../utils/text2cxxarray --name=BUGS_array \
407:info:build             ../BUGS >BUGS.cc
408:info:build ../utils/text2cxxarray --name=COPYING_array --decl-only \
409:info:build             ../COPYING >>COPYING.hh
410:info:build ../utils/text2cxxarray --name=COPYING_array \
411:info:build             ../COPYING >COPYING.cc
412:info:build ../utils/text2cxxarray --name=CREDITS_array --decl-only \
413:info:build             ../CREDITS >>CREDITS.hh
414:info:build ../utils/text2cxxarray --name=CREDITS_array \
415:info:build             ../CREDITS >CREDITS.cc
416:info:build /usr/bin/make  all-am
417:info:build make[3]: Entering directory `/mp/var/macports/build/_Volumes_data_macports_ports_devel_ppl/ppl/work/ppl-0.12.1/src'
418:info:build /bin/sh ../libtool  --tag=CXX   --mode=compile /usr/bin/g++-4.0 -DHAVE_CONFIG_H -I. -I..  -I.. -I../src  -I/mp/include  -g -O2 -frounding-math -pipe -O2 -arch ppc -W -Wall -MT assert.lo -MD -MP -MF .deps/assert.Tpo -c -o assert.lo assert.cc
419:info:build libtool: compile:  /usr/bin/g++-4.0 -DHAVE_CONFIG_H -I. -I.. -I.. -I../src -I/mp/include -g -O2 -frounding-math -pipe -O2 -arch ppc -W -Wall -MT assert.lo -MD -MP -MF .deps/assert.Tpo -c assert.cc  -fno-common -DPIC -o .libs/assert.o
420:info:build libtool: compile:  /usr/bin/g++-4.0 -DHAVE_CONFIG_H -I. -I.. -I.. -I../src -I/mp/include -g -O2 -frounding-math -pipe -O2 -arch ppc -W -Wall -MT assert.lo -MD -MP -MF .deps/assert.Tpo -c assert.cc -o assert.o >/dev/null 2>&1
421:info:build mv -f .deps/assert.Tpo .deps/assert.Plo
422:info:build /bin/sh ../libtool  --tag=CXX   --mode=compile /usr/bin/g++-4.0 -DHAVE_CONFIG_H -I. -I..  -I.. -I../src  -I/mp/include  -g -O2 -frounding-math -pipe -O2 -arch ppc -W -Wall -MT Box.lo -MD -MP -MF .deps/Box.Tpo -c -o Box.lo Box.cc
423:info:build libtool: compile:  /usr/bin/g++-4.0 -DHAVE_CONFIG_H -I. -I.. -I.. -I../src -I/mp/include -g -O2 -frounding-math -pipe -O2 -arch ppc -W -Wall -MT Box.lo -MD -MP -MF .deps/Box.Tpo -c Box.cc  -fno-common -DPIC -o .libs/Box.o
424:info:build libtool: compile:  /usr/bin/g++-4.0 -DHAVE_CONFIG_H -I. -I.. -I.. -I../src -I/mp/include -g -O2 -frounding-math -pipe -O2 -arch ppc -W -Wall -MT Box.lo -MD -MP -MF .deps/Box.Tpo -c Box.cc -o Box.o >/dev/null 2>&1
425:info:build mv -f .deps/Box.Tpo .deps/Box.Plo
426:info:build /bin/sh ../libtool  --tag=CXX   --mode=compile /usr/bin/g++-4.0 -DHAVE_CONFIG_H -I. -I..  -I.. -I../src  -I/mp/include  -g -O2 -frounding-math -pipe -O2 -arch ppc -W -Wall -MT checked.lo -MD -MP -MF .deps/checked.Tpo -c -o checked.lo checked.cc
427:info:build libtool: compile:  /usr/bin/g++-4.0 -DHAVE_CONFIG_H -I. -I.. -I.. -I../src -I/mp/include -g -O2 -frounding-math -pipe -O2 -arch ppc -W -Wall -MT checked.lo -MD -MP -MF .deps/checked.Tpo -c checked.cc  -fno-common -DPIC -o .libs/checked.o
428:info:build libtool: compile:  /usr/bin/g++-4.0 -DHAVE_CONFIG_H -I. -I.. -I.. -I../src -I/mp/include -g -O2 -frounding-math -pipe -O2 -arch ppc -W -Wall -MT checked.lo -MD -MP -MF .deps/checked.Tpo -c checked.cc -o checked.o >/dev/null 2>&1
429:info:build mv -f .deps/checked.Tpo .deps/checked.Plo
430:info:build /bin/sh ../libtool  --tag=CXX   --mode=compile /usr/bin/g++-4.0 -DHAVE_CONFIG_H -I. -I..  -I.. -I../src  -I/mp/include  -g -O2 -frounding-math -pipe -O2 -arch ppc -W -Wall -MT Checked_Number.lo -MD -MP -MF .deps/Checked_Number.Tpo -c -o Checked_Number.lo Checked_Number.cc
431:info:build libtool: compile:  /usr/bin/g++-4.0 -DHAVE_CONFIG_H -I. -I.. -I.. -I../src -I/mp/include -g -O2 -frounding-math -pipe -O2 -arch ppc -W -Wall -MT Checked_Number.lo -MD -MP -MF .deps/Checked_Number.Tpo -c Checked_Number.cc  -fno-common -DPIC -o .libs/Checked_Number.o
432:info:build libtool: compile:  /usr/bin/g++-4.0 -DHAVE_CONFIG_H -I. -I.. -I.. -I../src -I/mp/include -g -O2 -frounding-math -pipe -O2 -arch ppc -W -Wall -MT Checked_Number.lo -MD -MP -MF .deps/Checked_Number.Tpo -c Checked_Number.cc -o Checked_Number.o >/dev/null 2>&1
433:info:build mv -f .deps/Checked_Number.Tpo .deps/Checked_Number.Plo
434:info:build /bin/sh ../libtool  --tag=CXX   --mode=compile /usr/bin/g++-4.0 -DHAVE_CONFIG_H -I. -I..  -I.. -I../src  -I/mp/include  -g -O2 -frounding-math -pipe -O2 -arch ppc -W -Wall -MT Float.lo -MD -MP -MF .deps/Float.Tpo -c -o Float.lo Float.cc
435:info:build libtool: compile:  /usr/bin/g++-4.0 -DHAVE_CONFIG_H -I. -I.. -I.. -I../src -I/mp/include -g -O2 -frounding-math -pipe -O2 -arch ppc -W -Wall -MT Float.lo -MD -MP -MF .deps/Float.Tpo -c Float.cc  -fno-common -DPIC -o .libs/Float.o
436:info:build libtool: compile:  /usr/bin/g++-4.0 -DHAVE_CONFIG_H -I. -I.. -I.. -I../src -I/mp/include -g -O2 -frounding-math -pipe -O2 -arch ppc -W -Wall -MT Float.lo -MD -MP -MF .deps/Float.Tpo -c Float.cc -o Float.o >/dev/null 2>&1
437:info:build mv -f .deps/Float.Tpo .deps/Float.Plo
438:info:build /bin/sh ../libtool  --tag=CXX   --mode=compile /usr/bin/g++-4.0 -DHAVE_CONFIG_H -I. -I..  -I.. -I../src  -I/mp/include  -g -O2 -frounding-math -pipe -O2 -arch ppc -W -Wall -MT fpu-ia32.lo -MD -MP -MF .deps/fpu-ia32.Tpo -c -o fpu-ia32.lo fpu-ia32.cc
439:info:build libtool: compile:  /usr/bin/g++-4.0 -DHAVE_CONFIG_H -I. -I.. -I.. -I../src -I/mp/include -g -O2 -frounding-math -pipe -O2 -arch ppc -W -Wall -MT fpu-ia32.lo -MD -MP -MF .deps/fpu-ia32.Tpo -c fpu-ia32.cc  -fno-common -DPIC -o .libs/fpu-ia32.o
440:info:build libtool: compile:  /usr/bin/g++-4.0 -DHAVE_CONFIG_H -I. -I.. -I.. -I../src -I/mp/include -g -O2 -frounding-math -pipe -O2 -arch ppc -W -Wall -MT fpu-ia32.lo -MD -MP -MF .deps/fpu-ia32.Tpo -c fpu-ia32.cc -o fpu-ia32.o >/dev/null 2>&1
441:info:build mv -f .deps/fpu-ia32.Tpo .deps/fpu-ia32.Plo
442:info:build /bin/sh ../libtool  --tag=CXX   --mode=compile /usr/bin/g++-4.0 -DHAVE_CONFIG_H -I. -I..  -I.. -I../src  -I/mp/include  -g -O2 -frounding-math -pipe -O2 -arch ppc -W -Wall -MT Concrete_Expression.lo -MD -MP -MF .deps/Concrete_Expression.Tpo -c -o Concrete_Expression.lo Concrete_Expression.cc
443:info:build libtool: compile:  /usr/bin/g++-4.0 -DHAVE_CONFIG_H -I. -I.. -I.. -I../src -I/mp/include -g -O2 -frounding-math -pipe -O2 -arch ppc -W -Wall -MT Concrete_Expression.lo -MD -MP -MF .deps/Concrete_Expression.Tpo -c Concrete_Expression.cc  -fno-common -DPIC -o .libs/Concrete_Expression.o
444:info:build libtool: compile:  /usr/bin/g++-4.0 -DHAVE_CONFIG_H -I. -I.. -I.. -I../src -I/mp/include -g -O2 -frounding-math -pipe -O2 -arch ppc -W -Wall -MT Concrete_Expression.lo -MD -MP -MF .deps/Concrete_Expression.Tpo -c Concrete_Expression.cc -o Concrete_Expression.o >/dev/null 2>&1
445:info:build mv -f .deps/Concrete_Expression.Tpo .deps/Concrete_Expression.Plo
446:info:build /bin/sh ../libtool  --tag=CXX   --mode=compile /usr/bin/g++-4.0 -DHAVE_CONFIG_H -I. -I..  -I.. -I../src  -I/mp/include  -g -O2 -frounding-math -pipe -O2 -arch ppc -W -Wall -MT Constraint.lo -MD -MP -MF .deps/Constraint.Tpo -c -o Constraint.lo Constraint.cc
447:info:build libtool: compile:  /usr/bin/g++-4.0 -DHAVE_CONFIG_H -I. -I.. -I.. -I../src -I/mp/include -g -O2 -frounding-math -pipe -O2 -arch ppc -W -Wall -MT Constraint.lo -MD -MP -MF .deps/Constraint.Tpo -c Constraint.cc  -fno-common -DPIC -o .libs/Constraint.o
448:info:build libtool: compile:  /usr/bin/g++-4.0 -DHAVE_CONFIG_H -I. -I.. -I.. -I../src -I/mp/include -g -O2 -frounding-math -pipe -O2 -arch ppc -W -Wall -MT Constraint.lo -MD -MP -MF .deps/Constraint.Tpo -c Constraint.cc -o Constraint.o >/dev/null 2>&1
449:info:build mv -f .deps/Constraint.Tpo .deps/Constraint.Plo
450:info:build /bin/sh ../libtool  --tag=CXX   --mode=compile /usr/bin/g++-4.0 -DHAVE_CONFIG_H -I. -I..  -I.. -I../src  -I/mp/include  -g -O2 -frounding-math -pipe -O2 -arch ppc -W -Wall -MT Constraint_System.lo -MD -MP -MF .deps/Constraint_System.Tpo -c -o Constraint_System.lo Constraint_System.cc
451:info:build libtool: compile:  /usr/bin/g++-4.0 -DHAVE_CONFIG_H -I. -I.. -I.. -I../src -I/mp/include -g -O2 -frounding-math -pipe -O2 -arch ppc -W -Wall -MT Constraint_System.lo -MD -MP -MF .deps/Constraint_System.Tpo -c Constraint_System.cc  -fno-common -DPIC -o .libs/Constraint_System.o
452:info:build libtool: compile:  /usr/bin/g++-4.0 -DHAVE_CONFIG_H -I. -I.. -I.. -I../src -I/mp/include -g -O2 -frounding-math -pipe -O2 -arch ppc -W -Wall -MT Constraint_System.lo -MD -MP -MF .deps/Constraint_System.Tpo -c Constraint_System.cc -o Constraint_System.o >/dev/null 2>&1
453:info:build mv -f .deps/Constraint_System.Tpo .deps/Constraint_System.Plo
454:info:build /bin/sh ../libtool  --tag=CXX   --mode=compile /usr/bin/g++-4.0 -DHAVE_CONFIG_H -I. -I..  -I.. -I../src  -I/mp/include  -g -O2 -frounding-math -pipe -O2 -arch ppc -W -Wall -MT Congruence.lo -MD -MP -MF .deps/Congruence.Tpo -c -o Congruence.lo Congruence.cc
455:info:build libtool: compile:  /usr/bin/g++-4.0 -DHAVE_CONFIG_H -I. -I.. -I.. -I../src -I/mp/include -g -O2 -frounding-math -pipe -O2 -arch ppc -W -Wall -MT Congruence.lo -MD -MP -MF .deps/Congruence.Tpo -c Congruence.cc  -fno-common -DPIC -o .libs/Congruence.o
456:info:build libtool: compile:  /usr/bin/g++-4.0 -DHAVE_CONFIG_H -I. -I.. -I.. -I../src -I/mp/include -g -O2 -frounding-math -pipe -O2 -arch ppc -W -Wall -MT Congruence.lo -MD -MP -MF .deps/Congruence.Tpo -c Congruence.cc -o Congruence.o >/dev/null 2>&1
457:info:build mv -f .deps/Congruence.Tpo .deps/Congruence.Plo
458:info:build /bin/sh ../libtool  --tag=CXX   --mode=compile /usr/bin/g++-4.0 -DHAVE_CONFIG_H -I. -I..  -I.. -I../src  -I/mp/include  -g -O2 -frounding-math -pipe -O2 -arch ppc -W -Wall -MT Congruence_System.lo -MD -MP -MF .deps/Congruence_System.Tpo -c -o Congruence_System.lo Congruence_System.cc
459:info:build libtool: compile:  /usr/bin/g++-4.0 -DHAVE_CONFIG_H -I. -I.. -I.. -I../src -I/mp/include -g -O2 -frounding-math -pipe -O2 -arch ppc -W -Wall -MT Congruence_System.lo -MD -MP -MF .deps/Congruence_System.Tpo -c Congruence_System.cc  -fno-common -DPIC -o .libs/Congruence_System.o
460:info:build Congruence_System.cc: In member function 'void Parma_Polyhedra_Library::Congruence_System::insert(const Parma_Polyhedra_Library::Congruence_System&)':
461:info:build Congruence_System.cc:183: error: no matching function for call to 'swap(Parma_Polyhedra_Library::Dense_Row&, Parma_Polyhedra_Library::Congruence&)'
462:info:build make[3]: *** [Congruence_System.lo] Error 1
463:info:build make[3]: Leaving directory `/mp/var/macports/build/_Volumes_data_macports_ports_devel_ppl/ppl/work/ppl-0.12.1/src'
464:info:build make[2]: *** [all] Error 2
465:info:build make[2]: Leaving directory `/mp/var/macports/build/_Volumes_data_macports_ports_devel_ppl/ppl/work/ppl-0.12.1/src'
466:info:build make[1]: *** [all-recursive] Error 1
467:info:build make[1]: Leaving directory `/mp/var/macports/build/_Volumes_data_macports_ports_devel_ppl/ppl/work/ppl-0.12.1'
468:info:build make: *** [all] Error 2
469:info:build make: Leaving directory `/mp/var/macports/build/_Volumes_data_macports_ports_devel_ppl/ppl/work/ppl-0.12.1'
470:info:build shell command " cd "/mp/var/macports/build/_Volumes_data_macports_ports_devel_ppl/ppl/work/ppl-0.12.1" && /usr/bin/make -w all " returned error 2
471:error:build Target org.macports.build returned: shell command failed (see log for details)
472:debug:build Backtrace: shell command failed (see log for details)
473    while executing
474"command_exec build"
475    (procedure "portbuild::build_main" line 8)
476    invoked from within
477"$procedure $targetname"
478:info:build Warning: the following items did not execute (for ppl): org.macports.install org.macports.build org.macports.destroot
479:notice:build Log for ppl is at: /mp/var/macports/logs/_Volumes_data_macports_ports_devel_ppl/ppl/main.log