Ticket #42368: main.2.log

File main.2.log, 15.4 KB (added by tonior@…, 10 years ago)

PATH=/usr/bin:$PATH sudo port upgrade phantomjs

Line 
1version:1
2:msg:main --->  Computing dependencies for phantomjs:info:main .:debug:main phantomjs has no conflicts
3:debug:main Found Dependency: path: /usr/bin filename: unzip regex: ^unzip$
4:debug:main Searching for dependency: unzip
5:debug:main Didn't find receipt, going to depspec regex for: unzip
6:debug:main Found Dependency: path: /usr/bin filename: unzip regex: ^unzip$
7:msg:main
8:debug:main Executing org.macports.main (phantomjs)
9:debug:main changing euid/egid - current euid: 0 - current egid: 0
10:debug:main egid changed to: 502
11:debug:main euid changed to: 503
12:debug:archivefetch archivefetch phase started at Wed Apr 30 15:35:01 AST 2014
13:msg:archivefetch --->  Fetching archive for phantomjs
14:debug:archivefetch Executing org.macports.archivefetch (phantomjs)
15:debug:archivefetch euid/egid changed to: 0/0
16:debug:archivefetch chowned /opt/local/var/macports/incoming to macports
17:debug:archivefetch euid/egid changed to: 503/502
18:info:archivefetch --->  phantomjs-1.9.7_0.darwin_13.x86_64.tbz2 doesn't seem to exist in /opt/local/var/macports/incoming/verified
19:msg:archivefetch --->  Attempting to fetch phantomjs-1.9.7_0.darwin_13.x86_64.tbz2 from http://mse.uk.packages.macports.org/sites/packages.macports.org/phantomjs
20:debug:archivefetch Fetching archive failed:: The requested URL returned error: 404 Not Found
21:msg:archivefetch --->  Attempting to fetch phantomjs-1.9.7_0.darwin_13.x86_64.tbz2 from http://nue.de.packages.macports.org/macports/packages/phantomjs
22:debug:archivefetch Fetching archive failed:: The requested URL returned error: 404 Not Found
23:msg:archivefetch --->  Attempting to fetch phantomjs-1.9.7_0.darwin_13.x86_64.tbz2 from http://lil.fr.packages.macports.org/phantomjs
24:debug:archivefetch Fetching archive failed:: The requested URL returned error: 404 Not Found
25:debug:archivefetch Privilege de-escalation not attempted as not running as root.
26:debug:fetch fetch phase started at Wed Apr 30 15:35:03 AST 2014
27:notice:fetch --->  Fetching distfiles for phantomjs
28:debug:fetch Executing org.macports.fetch (phantomjs)
29:debug:fetch Privilege de-escalation not attempted as not running as root.
30:debug:checksum checksum phase started at Wed Apr 30 15:35:03 AST 2014
31:notice:checksum --->  Verifying checksums for phantomjs
32:debug:checksum Executing org.macports.checksum (phantomjs)
33:info:checksum --->  Checksumming phantomjs-1.9.7-source.zip
34:debug:checksum Correct (rmd160) checksum for phantomjs-1.9.7-source.zip
35:debug:checksum Correct (sha256) checksum for phantomjs-1.9.7-source.zip
36:debug:checksum Privilege de-escalation not attempted as not running as root.
37:debug:extract extract phase started at Wed Apr 30 15:35:03 AST 2014
38:notice:extract --->  Extracting phantomjs
39:debug:extract setting option extract.cmd to /usr/bin/unzip
40:debug:extract setting option extract.pre_args to -q
41:debug:extract setting option extract.post_args to {-d /opt/local/var/macports/build/_opt_local_var_macports_sources_rsync.macports.org_release_ports_www_phantomjs/phantomjs/work}
42:debug:extract Executing org.macports.extract (phantomjs)
43:info:extract --->  Extracting phantomjs-1.9.7-source.zip
44:debug:extract setting option extract.args to '/opt/local/var/macports/distfiles/phantomjs/phantomjs-1.9.7-source.zip'
45:debug:extract Environment: CPATH='/opt/local/include' CC_PRINT_OPTIONS_FILE='/opt/local/var/macports/build/_opt_local_var_macports_sources_rsync.macports.org_release_ports_www_phantomjs/phantomjs/work/.CC_PRINT_OPTIONS' LIBRARY_PATH='/opt/local/lib' CC_PRINT_OPTIONS='YES' MACOSX_DEPLOYMENT_TARGET='10.9'
46:debug:extract Assembled command: 'cd "/opt/local/var/macports/build/_opt_local_var_macports_sources_rsync.macports.org_release_ports_www_phantomjs/phantomjs/work" && /usr/bin/unzip -q '/opt/local/var/macports/distfiles/phantomjs/phantomjs-1.9.7-source.zip' -d /opt/local/var/macports/build/_opt_local_var_macports_sources_rsync.macports.org_release_ports_www_phantomjs/phantomjs/work'
47:debug:extract Executing command line:  cd "/opt/local/var/macports/build/_opt_local_var_macports_sources_rsync.macports.org_release_ports_www_phantomjs/phantomjs/work" && /usr/bin/unzip -q '/opt/local/var/macports/distfiles/phantomjs/phantomjs-1.9.7-source.zip' -d /opt/local/var/macports/build/_opt_local_var_macports_sources_rsync.macports.org_release_ports_www_phantomjs/phantomjs/work
48:debug:extract euid/egid changed to: 0/0
49:debug:extract chowned /opt/local/var/macports/build/_opt_local_var_macports_sources_rsync.macports.org_release_ports_www_phantomjs/phantomjs/work to macports
50:debug:extract euid/egid changed to: 503/502
51:debug:extract Privilege de-escalation not attempted as not running as root.
52:debug:patch patch phase started at Wed Apr 30 15:35:11 AST 2014
53:debug:patch Executing org.macports.patch (phantomjs)
54:notice:patch --->  Applying patches to phantomjs
55:info:patch --->  Applying patch-tools_preconfig.sh.diff
56:debug:patch Environment: CPATH='/opt/local/include' CC_PRINT_OPTIONS_FILE='/opt/local/var/macports/build/_opt_local_var_macports_sources_rsync.macports.org_release_ports_www_phantomjs/phantomjs/work/.CC_PRINT_OPTIONS' LIBRARY_PATH='/opt/local/lib' CC_PRINT_OPTIONS='YES' MACOSX_DEPLOYMENT_TARGET='10.9'
57:debug:patch Assembled command: 'cd "/opt/local/var/macports/build/_opt_local_var_macports_sources_rsync.macports.org_release_ports_www_phantomjs/phantomjs/work/phantomjs-1.9.7" && /usr/bin/patch -p0'
58:debug:patch Executing command line:  cd "/opt/local/var/macports/build/_opt_local_var_macports_sources_rsync.macports.org_release_ports_www_phantomjs/phantomjs/work/phantomjs-1.9.7" && /usr/bin/patch -p0 < '/opt/local/var/macports/sources/rsync.macports.org/release/ports/www/phantomjs/files/patch-tools_preconfig.sh.diff'
59:info:patch patching file tools/preconfig.sh
60:info:patch --->  Applying patch-src_qt_preconfig.sh.diff
61:debug:patch Environment: CPATH='/opt/local/include' CC_PRINT_OPTIONS_FILE='/opt/local/var/macports/build/_opt_local_var_macports_sources_rsync.macports.org_release_ports_www_phantomjs/phantomjs/work/.CC_PRINT_OPTIONS' LIBRARY_PATH='/opt/local/lib' CC_PRINT_OPTIONS='YES' MACOSX_DEPLOYMENT_TARGET='10.9'
62:debug:patch Assembled command: 'cd "/opt/local/var/macports/build/_opt_local_var_macports_sources_rsync.macports.org_release_ports_www_phantomjs/phantomjs/work/phantomjs-1.9.7" && /usr/bin/patch -p0'
63:debug:patch Executing command line:  cd "/opt/local/var/macports/build/_opt_local_var_macports_sources_rsync.macports.org_release_ports_www_phantomjs/phantomjs/work/phantomjs-1.9.7" && /usr/bin/patch -p0 < '/opt/local/var/macports/sources/rsync.macports.org/release/ports/www/phantomjs/files/patch-src_qt_preconfig.sh.diff'
64:info:patch patching file src/qt/preconfig.sh
65:info:patch --->  Applying patch-src_qt_src_corelib_global_qglobal.h.diff
66:debug:patch Environment: CPATH='/opt/local/include' CC_PRINT_OPTIONS_FILE='/opt/local/var/macports/build/_opt_local_var_macports_sources_rsync.macports.org_release_ports_www_phantomjs/phantomjs/work/.CC_PRINT_OPTIONS' LIBRARY_PATH='/opt/local/lib' CC_PRINT_OPTIONS='YES' MACOSX_DEPLOYMENT_TARGET='10.9'
67:debug:patch Assembled command: 'cd "/opt/local/var/macports/build/_opt_local_var_macports_sources_rsync.macports.org_release_ports_www_phantomjs/phantomjs/work/phantomjs-1.9.7" && /usr/bin/patch -p0'
68:debug:patch Executing command line:  cd "/opt/local/var/macports/build/_opt_local_var_macports_sources_rsync.macports.org_release_ports_www_phantomjs/phantomjs/work/phantomjs-1.9.7" && /usr/bin/patch -p0 < '/opt/local/var/macports/sources/rsync.macports.org/release/ports/www/phantomjs/files/patch-src_qt_src_corelib_global_qglobal.h.diff'
69:info:patch patching file src/qt/src/corelib/global/qglobal.h
70:info:patch --->  Applying patch-src_qt_src_gui_kernel_qt_cocoa_helpers_mac_p.h.diff
71:debug:patch Environment: CPATH='/opt/local/include' CC_PRINT_OPTIONS_FILE='/opt/local/var/macports/build/_opt_local_var_macports_sources_rsync.macports.org_release_ports_www_phantomjs/phantomjs/work/.CC_PRINT_OPTIONS' LIBRARY_PATH='/opt/local/lib' CC_PRINT_OPTIONS='YES' MACOSX_DEPLOYMENT_TARGET='10.9'
72:debug:patch Assembled command: 'cd "/opt/local/var/macports/build/_opt_local_var_macports_sources_rsync.macports.org_release_ports_www_phantomjs/phantomjs/work/phantomjs-1.9.7" && /usr/bin/patch -p0'
73:debug:patch Executing command line:  cd "/opt/local/var/macports/build/_opt_local_var_macports_sources_rsync.macports.org_release_ports_www_phantomjs/phantomjs/work/phantomjs-1.9.7" && /usr/bin/patch -p0 < '/opt/local/var/macports/sources/rsync.macports.org/release/ports/www/phantomjs/files/patch-src_qt_src_gui_kernel_qt_cocoa_helpers_mac_p.h.diff'
74:info:patch patching file src/qt/src/gui/kernel/qt_cocoa_helpers_mac_p.h
75:debug:patch Privilege de-escalation not attempted as not running as root.
76:debug:configure configure phase started at Wed Apr 30 15:35:11 AST 2014
77:notice:configure --->  Configuring phantomjs
78:debug:configure Using compiler 'Xcode Clang'
79:debug:configure Executing org.macports.configure (phantomjs)
80:debug:configure Privilege de-escalation not attempted as not running as root.
81:debug:build build phase started at Wed Apr 30 15:35:11 AST 2014
82:notice:build --->  Building phantomjs
83:debug:build Executing org.macports.build (phantomjs)
84:debug:build Environment: CPATH='/opt/local/include' CC_PRINT_OPTIONS_FILE='/opt/local/var/macports/build/_opt_local_var_macports_sources_rsync.macports.org_release_ports_www_phantomjs/phantomjs/work/.CC_PRINT_OPTIONS' LIBRARY_PATH='/opt/local/lib' CC_PRINT_OPTIONS='YES' MACOSX_DEPLOYMENT_TARGET='10.9'
85:debug:build Assembled command: 'cd "/opt/local/var/macports/build/_opt_local_var_macports_sources_rsync.macports.org_release_ports_www_phantomjs/phantomjs/work/phantomjs-1.9.7" && ./build.sh --confirm --jobs 4'
86:debug:build Executing command line:  cd "/opt/local/var/macports/build/_opt_local_var_macports_sources_rsync.macports.org_release_ports_www_phantomjs/phantomjs/work/phantomjs-1.9.7" && ./build.sh --confirm --jobs 4
87:info:build Determining system architecture... (Darwin:13.1.0:x86_64)
88:info:build     'macosx' is supported
89:info:build System architecture: 'macosx'
90:info:build Precompiled-headers support enabled.
91:info:build Xarch is not supported
92:info:build Symbol visibility control enabled.
93:info:build
94:info:build This is the Qt for Mac OS X Open Source Edition.
95:info:build
96:info:build You are licensed to use this software under the terms of
97:info:build the Lesser GNU General Public License (LGPL) versions 2.1.
98:info:build You are also licensed to use this software under the terms of
99:info:build the GNU General Public License (GPL) versions 3.
100:info:build
101:info:build You have already accepted the terms of the  license.
102:info:build
103:info:build Creating qmake. Please wait...
104:info:build g++ -c -o project.o -pipe -DQMAKE_OPENSOURCE_EDITION -fconstant-cfstrings -g -I. -Igenerators -Igenerators/unix -Igenerators/win32 -Igenerators/mac -Igenerators/symbian -Igenerators/integrity -I/opt/local/var/macports/build/_opt_local_var_macports_sources_rsync.macports.org_release_ports_www_phantomjs/phantomjs/work/phantomjs-1.9.7/src/qt/include -I/opt/local/var/macports/build/_opt_local_var_macports_sources_rsync.macports.org_release_ports_www_phantomjs/phantomjs/work/phantomjs-1.9.7/src/qt/include/QtCore -I/opt/local/var/macports/build/_opt_local_var_macports_sources_rsync.macports.org_release_ports_www_phantomjs/phantomjs/work/phantomjs-1.9.7/src/qt/src/corelib/global -I/opt/local/var/macports/build/_opt_local_var_macports_sources_rsync.macports.org_release_ports_www_phantomjs/phantomjs/work/phantomjs-1.9.7/src/qt/src/corelib/xml -I/opt/local/var/macports/build/_opt_local_var_macports_sources_rsync.macports.org_release_ports_www_phantomjs/phantomjs/work/phantomjs-1.9.7/src/qt/tools/shared -DQT_NO_PCRE -DQT_BUILD_QMAKE -DQT_BOOTSTRAPPED -DQLIBRARYINFO_EPOCROOT -DQT_NO_TEXTCODEC -DQT_NO_UNICODETABLES -DQT_NO_COMPONENT -DQT_NO_STL -DQT_NO_COMPRESS -I/opt/local/var/macports/build/_opt_local_var_macports_sources_rsync.macports.org_release_ports_www_phantomjs/phantomjs/work/phantomjs-1.9.7/src/qt/mkspecs/macx-g++ -DHAVE_QCONFIG_CPP -DQT_NO_THREAD -DQT_NO_QOBJECT -DQT_NO_GEOM_VARIANT -DQT_NO_DEPRECATED  project.cpp
105:info:build g++ -c -o property.o -pipe -DQMAKE_OPENSOURCE_EDITION -fconstant-cfstrings -g -I. -Igenerators -Igenerators/unix -Igenerators/win32 -Igenerators/mac -Igenerators/symbian -Igenerators/integrity -I/opt/local/var/macports/build/_opt_local_var_macports_sources_rsync.macports.org_release_ports_www_phantomjs/phantomjs/work/phantomjs-1.9.7/src/qt/include -I/opt/local/var/macports/build/_opt_local_var_macports_sources_rsync.macports.org_release_ports_www_phantomjs/phantomjs/work/phantomjs-1.9.7/src/qt/include/QtCore -I/opt/local/var/macports/build/_opt_local_var_macports_sources_rsync.macports.org_release_ports_www_phantomjs/phantomjs/work/phantomjs-1.9.7/src/qt/src/corelib/global -I/opt/local/var/macports/build/_opt_local_var_macports_sources_rsync.macports.org_release_ports_www_phantomjs/phantomjs/work/phantomjs-1.9.7/src/qt/src/corelib/xml -I/opt/local/var/macports/build/_opt_local_var_macports_sources_rsync.macports.org_release_ports_www_phantomjs/phantomjs/work/phantomjs-1.9.7/src/qt/tools/shared -DQT_NO_PCRE -DQT_BUILD_QMAKE -DQT_BOOTSTRAPPED -DQLIBRARYINFO_EPOCROOT -DQT_NO_TEXTCODEC -DQT_NO_UNICODETABLES -DQT_NO_COMPONENT -DQT_NO_STL -DQT_NO_COMPRESS -I/opt/local/var/macports/build/_opt_local_var_macports_sources_rsync.macports.org_release_ports_www_phantomjs/phantomjs/work/phantomjs-1.9.7/src/qt/mkspecs/macx-g++ -DHAVE_QCONFIG_CPP -DQT_NO_THREAD -DQT_NO_QOBJECT -DQT_NO_GEOM_VARIANT -DQT_NO_DEPRECATED  property.cpp
106:info:build g++: error: unrecognized command line option '-fconstant-cfstrings'
107:info:build Makefile:262: recipe for target 'project.o' failed
108:info:build gmake: *** [project.o] Error 1
109:info:build gmake: *** Waiting for unfinished jobs....
110:info:build g++: error: unrecognized command line option '-fconstant-cfstrings'
111:info:build Makefile:265: recipe for target 'property.o' failed
112:info:build gmake: *** [property.o] Error 1
113:info:build make: *** No targets specified and no makefile found.  Stop.
114:info:build /opt/local/var/macports/build/_opt_local_var_macports_sources_rsync.macports.org_release_ports_www_phantomjs/phantomjs/work/phantomjs-1.9.7/src/qt/src/plugins/codecs /opt/local/var/macports/build/_opt_local_var_macports_sources_rsync.macports.org_release_ports_www_phantomjs/phantomjs/work/phantomjs-1.9.7/src/qt
115:info:build make: *** No targets specified and no makefile found.  Stop.
116:info:build /opt/local/var/macports/build/_opt_local_var_macports_sources_rsync.macports.org_release_ports_www_phantomjs/phantomjs/work/phantomjs-1.9.7/src/qt
117:info:build ./build.sh: line 93: src/qt/bin/qmake: No such file or directory
118:info:build Command failed:  cd "/opt/local/var/macports/build/_opt_local_var_macports_sources_rsync.macports.org_release_ports_www_phantomjs/phantomjs/work/phantomjs-1.9.7" && ./build.sh --confirm --jobs 4
119:info:build Exit code: 1
120:error:build org.macports.build for port phantomjs returned: command execution failed
121:debug:build Error code: CHILDSTATUS 708 1
122:debug:build Backtrace: command execution failed
123    while executing
124"system -nice 0 $fullcmdstring"
125    ("eval" body line 1)
126    invoked from within
127"eval system $notty $nice \$fullcmdstring"
128    invoked from within
129"command_exec build"
130    (procedure "portbuild::build_main" line 8)
131    invoked from within
132"$procedure $targetname"
133:info:build Warning: targets not executed for phantomjs: org.macports.install org.macports.build org.macports.destroot
134:notice:build Please see the log file for port phantomjs for details:
135    /opt/local/var/macports/logs/_opt_local_var_macports_sources_rsync.macports.org_release_ports_www_phantomjs/phantomjs/main.log