New Ticket     Tickets     Wiki     Browse Source     Timeline     Roadmap     Ticket Reports     Search

Custom Query (4054 matches)

Filters
 
Or
 
  
 
Columns

Show under each result:


Results (901 - 1000 of 4054)

1 2 3 4 5 6 7 8 9 10 11 12 13 14 15 16 17 18 19 20
Ticket Summary Port Status Owner Type Priority
#50498 gimp-app: segmentation fault gimp-app new macports-tickets@… defect Normal
#48527 Bug in gimp-gap gimp-gap assigned devans@… defect Normal
#39174 gimp-jp2 needs to be aware whether it was compiled against gtk2 +x11 or +quartz gimp-jp2 new devans@… defect Normal
#45624 Failed to install gimp-jp2 gimp-jp2 new devans@… defect Normal
#45355 git @2.1.2_0 +bash_completion+credential_osxkeychain+doc+pcre+perl5_12+python27+svn instaweb with Apache 2 git new ciserlohn@… enhancement Normal
#45502 git: Create -perl variant for a Perl-free install git new ciserlohn@… enhancement Normal
#45876 git: documentation files are not readable by normal user git new ciserlohn@… defect Normal
#41466 port request: 'git-annex' git-annex new macports-tickets@… submission Normal
#45151 git bash_completion with egrep colors git bash-completion new macports-tickets@… defect Normal
#49539 git-flow: fatal: unable to access 'https://github.com/nvie/gitflow.git/': SSL certificate problem: Couldn't understand the server certificate format git-flow new jason-macports@… defect Normal
#49639 git-flow-avh installation fails, checksum error for gitflow-1.8.0.tar.gz git-flow-avh new jason-macports@… defect Normal
#19405 git: move docs to new port git git-htmldocs new ciserlohn@… enhancement Normal
#40518 github portgroup: offer the option to use archive URLs instead of tarball URLs github new macports-tickets@… enhancement Normal
#42957 Replace GitX port with GitX-dev GitX new macports-tickets@… update Normal
#43937 GitX fails to build due to compiler option with Xcode 5.1.1 GitX new cal@… defect Normal
#42014 gjs build failure gjs new juanrgar@… defect Normal
#43267 glade @3.16.1: crashes on Snow Leopard glade new devans@… defect Normal
#45689 Yosemite 10.10 Glade requirements not met glade new devans@… defect Normal
#23356 glade3 doesn't use the native Mac menu glade3 assigned devans@… defect Normal
#31441 glade3: Workaround for +quartz variant glade3 assigned devans@… defect Normal
#32455 glade3 +quartz variant doesn't build glade3 new devans@… defect Normal
#46729 glademm fails to build on OS X 10.9.5 glademm new toralf@… defect Normal
#45423 glances: unecessarily forces python 3.4 when 2.7 should work glances new g5pw@… enhancement Normal
#29892 GLC_lib update to version 2.2.0. GLC_lib new macports@… update Normal
#47418 GLC_lib @1.2.0_3: error: use of undeclared identifier 'gluLookAt' GLC_lib new macports@… defect Normal
#37441 gle-graphics: universal variant doesn't work gle-graphics new swinbank@… defect Normal
#49848 Glew 1.13 does not build with Leopard PPC glew new jmr@… defect Normal
#31470 glib2 ppc64 configure fails on check for res_query glib2 new ryandesign@… defect Normal
#43315 glib2 @2.40.0 big_chunk_size.png reported as PNG:CVE-2013-1331 [Expl] by Avast. glib2 new ryandesign@… defect Normal
#44395 glib2, glib2-devel: don't add -I${prefix}/include to glib-2.0.pc glib2 glib2-devel new ryandesign@… defect Normal
#29051 glib2: revert to OS X sorting (alphabetical, not case-sensitive) on Mac OS X 10.5.8 Leopard glib2, glib2-devel new ryandesign@… defect Normal
#49151 glib2, glib2-devel: error: Universal builds not supported glib2, glib2-devel reopened ryandesign@… defect Normal
#50386 Glib error gives Invalid byte sequence in conversion input glibmm glom new macports-tickets@… defect Normal
#42702 glibtool drops dylibs at link time glibtool new macports-tickets@… defect Normal
#35022 glob2: error: reference to 'Collection' is ambiguous glob2 new macports-tickets@… defect Normal
#44616 Glom will not build with +quartz option glom new landonf@… defect Normal
#50501 Give native file dialog to Glom Quartz glom new macports-tickets@… enhancement Normal
#46833 glpng fails to build due to macro conflict with libpng glpng new ryandesign@… defect Normal
#28282 glw doesn't ensure it's UsingTheRightCompiler glw new css@… defect Normal
#49421 gmake should use --disable-nls to avoid CoreFoundation linkage via libintl gmake new stuartwesterman@… defect Normal
#33008 gmic: update to 1.5.0.9 gmic new assemlal@… defect Normal
#43880 gmic @1.5.0.8: update to 1.5.9.1 gmic new assemlal@… update Normal
#38793 gmime @2.6.15_0 build failure due to missing dependency gmime new macports-tickets@… defect Normal
#50311 gmt5: build fails on Mavericks: error: conflicting types for 'dsyev_' gmt5 new florian@… defect Normal
#25598 GNAT GPL 2010 now available, update portfile to use it? gnat-gcc assigned krischik@… update Normal
#40145 Some of gnome-chemistry-utils crash on startup gnome-chemistry-utils new macports-tickets@… defect Normal
#32057 gnome-desktop: Can't build with gtk2+quartz gnome-desktop reopened devans@… enhancement Low
#29153 gnome-doc-utils: python import error for libxml2 module gnome-doc-utils assigned devans@… defect Normal
#38973 Error: Failed to install gnome-doc-utils while installing wine gnome-doc-utils new macports-tickets@… defect Normal
#42558 gnome-settings-daemon fails to build with gtk3 +quartz -x11 gnome-settings-daemon new devans@… defect Normal
#41542 gnome-system-monitor @3.8.2.1_0 - application crashes when the Resources tab is selected gnome-system-monitor assigned devans@… defect Normal
#43891 gnome-terminal @3.12.2 backend factory fails on startup when started via dbus gnome-terminal assigned devans@… defect Normal
#43892 gnome-terminal @3.12.2 "Use colors from system theme" results in black-on-black gnome-terminal assigned devans@… defect Normal
#44502 gnome-terminal install fails due to dependency on coreutils::gmkdir gnome-terminal assigned devans@… defect Normal
#46800 gnome-terminal is not working gnome-terminal assigned devans@… defect Normal
#39754 Make gnome-themes-standard setup as gtk2 and 3 theme automatically gnome-themes-standard new devans@… enhancement Low
#35714 gnome-vfs: fatal error: 'acl/libacl.h' file not found gnome-vfs new macports-tickets@… defect Normal
#37128 gnome-vfs 2.24.4: configure: error: Your intltool is too old. You need intltool 0.35.0 or later. gnome-vfs new macports-tickets@… defect Normal
#42590 gnubg @0.14.3_5: build error "assignment to cast is illegal, lvalue casts are not supported" gnubg new macports-tickets@… defect Normal
#49411 gnucap @2009-12-07: error: variable has incomplete type 'C_Comment' gnucap new macports-tickets@… defect Normal
#31645 Upgrade of gnucash+no_x11 fails gnucash new macports-tickets@… defect Normal
#42876 Stack overflow in Gnucash when opening the Scheduled Transactions Editor gnucash assigned dports@… defect Normal
#43254 gnucash: +python27 variant broken gnucash assigned dports@… defect Normal
#46845 Gnucash @ 2.6.5 Fails when printing Invoice gnucash new dports@… defect Normal
#48299 gnucash @2.6.7_0 build failure with quartz gtk gnucash new dports@… defect Normal
#50497 gnucash 2.6.11: Missing dependency prevents "Get Quotes" from working gnucash new dports@… defect Normal
#37219 failed to install gnu-classpath: command execution failed gnu-classpath new macports-tickets@… defect Normal
#38113 gnu-classpath @0.99: configure fails: error: cannot determine a size for void * gnu-classpath new macports-tickets@… defect Normal
#41639 gnudatalanguage @0.9.4: error: call to 'isspace' is ambiguous gnudatalanguage new takeshi@… defect Normal
#41966 gnudatalanguage @0.9.4_3 +gshhs Runtime Error - PLplot installation lacks the requested driver: xwin gnudatalanguage new macports-tickets@… defect Normal
#47131 gnudatalanguage +python27 +openmp install fails with cmake issue. gnudatalanguage new takeshi@… defect Normal
#48267 gnudatalange @0.9.5_4: dyld: Library not loaded: /opt/local/lib/libgrib_api.0.dylib gnudatalanguage new takeshi@… defect Normal
#49466 gnudatalanguage: Library not loaded: /opt/local/lib/libform.5.dylib gnudatalanguage new macports-tickets@… defect Normal
#49530 gnudatalanguage failed gnudatalanguage new takeshi@… defect Normal
#49592 gnudatalanguage @0.9.5_8 + wxWidgets run error gnudatalanguage new takeshi@… defect Normal
#50093 Processing of port gnudatalanguage failed gnudatalanguage new takeshi@… defect Normal
#39111 gnumeric won't install gnumeric new macports-tickets@… defect Normal
#40265 Gnumeric @1.12.x throws runtime warnings gnumeric new macports-tickets@… defect Normal
#40449 Gnumeric @1.12.7 broken menu items... gnumeric new macports-tickets@… defect Normal
#50585 Gnumeric will crash when selecting Matrix graphic gnumeric assigned devans@… defect Normal
#26859 [New port] GNUnet 0.9.0pre1-r13253 GNUnet new macports-tickets@… submission Normal
#20051 gnupg2 2.0.11 Package shouldn't have libusb dependency gnupg2 assigned ionic@… enhancement Normal
#50238 gpg2 can't connect to the agent specified in GPG_AGENT_INFO gnupg2 new ionic@… defect Normal
#35616 gnuplot: options for setting default terminal gnuplot new mojca@… enhancement Low
#38345 gnupod: fix variants gnupod new macports-tickets@… defect Normal
#39681 Error in SWIG C++ when installing gnuradio +full on OSX 10.6 gnuradio reopened michaelld@… defect Normal
#47318 gnuradio: gnuradio-companion: command not found gnuradio new michaelld@… defect Normal
#44988 gnuradio-next: error: sys/soundcard.h: No such file or directory gnuradio-next new michaelld@… defect Normal
#16425 gnustep-back: build failure on Leopard: Segmentation fault gnustep-back new macports-tickets@… defect Normal
#20775 gnustep-base: gnustep-config: command not found gnustep-base new macports-tickets@… defect Normal
#28063 gnustep-base configure fails on 10.6, "I don't seem to be able to use your Objective-C compiler to produce working binaries" gnustep-base new macports-tickets@… defect Normal
#28273 gnustep-gui fails to install gnustep-gui new macports-tickets@… defect Normal
#30788 gnustep-make-cocoa: installs files containing -arch flags gnustep-make-cocoa new macports-tickets@… defect Normal
#47001 gnutar doesn't work anymore. gnutar new mww@… defect Normal
#43953 gnutls @3.3.4: error: use of undeclared identifier '_ISspace' gnutls new mschamschula@… defect Normal
#44763 gnutls @3.3.7 +staging into destroot error gnutls new macports-tickets@… defect Normal
#48343 gnutls-devel 3.4.3 gnutls assigned ryandesign@… enhancement Normal
#48646 request golang cross-compiler variants go new ciserlohn@… enhancement Normal
#49039 go @1.4.2: fails to build with tracemode go asciinema docker docker-machine git-lfs go-tools godep mongo-tools peco new macports-tickets@… defect Normal
#37256 gobject-introspection: building non-universal i386 fails when python27 is installed universal i386 x86_64 gobject-introspection new macports-tickets@… defect Low
1 2 3 4 5 6 7 8 9 10 11 12 13 14 15 16 17 18 19 20
Note: See TracQuery for help on using queries.