New Ticket     Tickets     Wiki     Browse Source     Timeline     Roadmap     Ticket Reports     Search

Custom Query (3733 matches)

Filters
 
Or
 
  
 
Columns

Show under each result:


Results (101 - 200 of 3733)

1 2 3 4 5 6 7 8 9 10 11 12
Ticket Summary Port Status Owner Type Priority
#45825 ledger @2.6.2_1: mv: rename *.elc to ../*.elc: No such file or directory ledger new johnw@… defect Normal
#45823 [NEW]: rb21-fontcustom with dependent rb21 ports rb21-fontcustom new macports-tickets@… submission Normal
#45822 Issues when installing VLC-devel in a clean MacPorts install VLC-devel new macports-tickets@… defect Normal
#45820 Defect: gcc49 4.9.1_1 fails to build on PPC Leopard (Mac OS X 10.5.8) gcc49 new macports-tickets@… defect Normal
#45818 dblatex installs old versions of tex packages, shadowing newer versions in texlive dblatex new cal@… defect Normal
#45813 uhd undefined symbols for architecture x86_64 uhd new michaelld@… defect Normal
#45811 gcc49: thread sanitizer is broken gcc49 new macports-tickets@… defect Normal
#45807 py27-tkinter installation failed py27-tkinter new jwa@… defect Normal
#45806 arm-none-eabi-gdb build failure on 10.10 Yosemite arm-none-eabi-gdb new stuartwesterman@… defect Normal
#45804 py27-llvmmath @0.1.1_0: destroot fails with an assertion error py-llvmmath new stromnov@… defect Normal
#45803 mongodb @2.6.5_1: Run mongod instance with config file mongodb new ryandesign@… enhancement Normal
#45799 Can't build encfs-1.7.5-135_2 on OSX 10.6.8 encfs new Markus.Ueberall@… defect Normal
#45797 aalib @1.4rc5 fails to build aalib new tim@… defect Normal
#45796 yersinia: make: *** No rule to make target `all'. Stop. yersinia new hsivank@… defect Normal
#45795 llvm-3.4 fails to build with +ocaml variant llvm-3.4 new jeremyhu@… defect Normal
#45794 osxfuse @2.7.0_0: doesn't build on PPC osxfuse assigned dports@… defect Normal
#45791 geany: cannot open display geany new kiarash@… defect Normal
#45789 mysql-connector-java 5.1.12_0 command execution failed mysql-connector-java new macports-tickets@… defect Normal
#45786 Update mhddfs to 0.1.39 mhddfs new mellon85@… update Normal
#45781 gtkextra3: new port gtkextra3 new macports-tickets@… submission Normal
#45772 rxvt-unicode @9.20 fails to build rxvt-unicode new evangoldenberg@… defect Normal
#45769 cfourcc: upstream mastersites not valid cfourcc new petr.vacek@… defect Normal
#45765 magit: staging into destroot failure: wrong type argument listp magit new macports-tickets@… defect Normal
#45762 id3v2 @0.1.12_1 wrong man page parsing id3v2 new brent@… defect Normal
#45754 Add Facebook's osquery port new macports-tickets@… request Normal
#45751 gdal py-gdal: gdal +python2? and py2?-gdal are conflicting gdal py-gdal reopened vince@… defect Normal
#45749 cloc @1.62 - new submission cloc new macports-tickets@… submission Normal
#45747 inkscape @0.48.5_4+python27+x11 fails to import images inkscape new devans@… defect Normal
#45746 llvm-gcc42 is not supported on Yosemite or later llvm-gcc42 new macports-tickets@… defect Normal
#45745 soprano @2.9.4+universal fails on Yosemite soprano new pixilla@… defect Normal
#45744 [NEW] security/libcerror libcerror new macports-tickets@… submission Normal
#45743 [NEW] security/libcstring libcstring new macports-tickets@… submission Normal
#45740 reduce-algebra obsolete; replaced by reduce reduce-algebra new macports-tickets@… enhancement Normal
#45739 submission: reduce reduce new macports-tickets@… submission Normal
#45736 Gecode port update to gecode 4.3.1 and qt5-mac dependency gecode new brandon@… update Normal
#45735 appledoc @2.2: error: garbage collection is no longer supported appledoc new g5pw@… defect Normal
#45734 gettext @0.19.3: compiling areadlink.c fails with "use of undeclared identifier 'AT_FDCWD'" gettext new ryandesign@… defect Normal
#45732 new port submission: kcm-baloo-advanced new macports-tickets@… submission Normal
#45725 R @3.1.1: version bump request to 3.1.2 R new kjell.konis@… update Normal
#45722 libmemcached xercesc3: resolve conflict libmemcached xercesc3 new snc@… defect Normal
#45721 pymol-1.7.2.1-1 pymol new macports-tickets@… update Normal
#45720 dragonegg-3.{3,4}-gcc-4.8: fails to build dragonegg-3.3-gcc-4.8 dragonegg-3.4-gcc-4.8 new jeremyhu@… defect Normal
#45716 [Port Abandoned] py26-mapnik py26-mapnik new dbsgeo@… defect Normal
#45712 xorg-libXt-1.1.4_0 links shared libs with -flat_namespace on Yosemite xorg-libXt new jeremyhu@… defect Normal
#45708 "port notes active" errors on deleted port new macports-tickets@… defect Normal
#45702 Building libsdl fails under OSX 10.10 libsdl new jmr@… defect Normal
#45696 Add +python34 variant to MacVim MacVim new raimue@… enhancement Normal
#45693 py-cartopy: [reminder] update and add python 3.4 subport py-cartopy reopened petr@… update Normal
#45690 eblook @1.6.1-media-20110801: error: use of undeclared identifier 'CPPFunction' eblook assigned ryandesign@… defect Normal
#45689 Yosemite 10.10 Glade requirements not met glade new devans@… defect Normal
#45687 dfu-util to be used with Mac OS X 10.10 new macports-tickets@… request Normal
#45685 cmake fails because of XML linking error (expat issue?) cmake new css@… defect Normal
#45684 Builds hang post upgrading to Yosemite new macports-tickets@… defect Normal
#45683 py-pudb: Add subport for Python 3.4 py-pudb new dechaume@… update Normal
#45682 add java variant to vtk port vtk new stromnov@… enhancement Normal
#45681 libgcc fails to build on Mavericks 10.9.5 with XCode 6.1 libgcc assigned larryv@… defect Normal
#45679 devel/bsdowl: Update to v2.2.1 bsdowl new macports-tickets@… update Normal
#45678 libquicktime @1.2.4: build failure libquicktime new mww@… defect Normal
#45676 vtk-devel does not build on Yosemite vtk-devel new macports-tickets@… defect Normal
#45675 cryptlib fails to build on 10.10 with XCode 6.1 cryptlib new macports-tickets@… defect Normal
#45674 Misleading logging new macports-tickets@… defect Low
#45672 poxml@4.13.3_0 build fails on Mac OSX 10.9.5 poxml new nicos@… defect Normal
#45671 gtime @1.7_1 Doesn't install into libexec/gnubin gtime new macports-tickets@… defect Normal
#45670 InsightToolkit31{2,4}: retire old series 3.x versions InsightToolkit312 InsightToolkit314 new macports-tickets@… enhancement Normal
#45669 db46 @4.6.21: libtool db46 new blair@… defect Normal
#45666 emacs-app: error: conflicting types for ‘Cursor’ emacs-app new hum@… defect Normal
#45665 ilmbase destroot error ilmbase new blair@… defect Normal
#45664 mecab-java linker error mecab-java new macports-tickets@… defect Normal
#45663 reaver in yosemite 10.10 could not work well reaver new ryandesign@… defect Normal
#45658 chkrootkit distfiles unavalible chkrootkit new macports-tickets@… defect Normal
#45657 libtool @2.4.2_5: update to 2.4.3 libtool assigned larryv@… update Normal
#45654 Update leiningen port from 2.1.3 to 2.5.0 leiningen new ieure@… update Normal
#45652 Request port of ghostscript 9.15 ghostscript new takanori@… update Normal
#45651 openldap 2.4.40 openldap new landonf@… update Normal
#45650 mailman 2.1.18-1 mailman new macports-tickets@… update Normal
#45646 pulseaudio build fail after Yosemite upgrade pulseaudio new devans@… defect Normal
#45644 [NEW] analogi analogi new macports-tickets@… submission Normal
#45643 [UPDATE] libevt libevt new macports-tickets@… update Normal
#45642 [NEW] py-yara py-yara new macports-tickets@… submission Normal
#45640 rom8x: new submission rom8x new macports-tickets@… submission Normal
#45639 Update wordpress dependencies wordpress new macports-tickets@… defect Normal
#45634 InsightToolkit @3.16.0_3: needs variant for newer Python InsightToolkit new macports-tickets@… defect Normal
#45631 gnucash, gnucash-devel: update to version 2.6.4. gnucash gnucash-devel new dports@… update Normal
#45629 cedet @1.1 fails to build on OS X Yosemite cedet new macports-tickets@… defect Normal
#45626 source-highlight @3.1.7 build failure source-highlight new macports-tickets@… defect Normal
#45625 QtCurve 1.8.18_0 fails to build on Snow Leopard qtcurve new rjvbertin@… defect Normal
#45624 Failed to install gimp-jp2 gimp-jp2 new devans@… defect Normal
#45622 Trac - use subticket plugin new macports-dev@… enhancement Not set
#45621 unison @2.40.102_2 crashes unison reopened macports-tickets@… defect Normal
#45620 Libpcap 1.6.2 can't be installed without bison libpcap new mschamschula@… defect Normal
#45619 gcc48 @4.8.3_1 move libgcj pkgconfig file to default path gcc48 new mww@… enhancement Low
#45617 abinit 7.8.2: use of port groups abinit new macports-tickets@… enhancement Normal
#45616 Compile error with g++ 4.8.2 boost new macports-tickets@… defect Normal
#45613 sundials @2.5.0_1: fetch receives a 404 page sundials new sean@… defect Normal
#45612 Failed to Install SoXt on Yosemite SoXt new css@… defect Normal
#45604 request: zbar new macports-tickets@… request Normal
#45599 cairo runtime messages/crash regarding obsolete CGFontGetGlyphPath cairo new ryandesign@… defect Normal
#45592 port upgrade outdated fails new macports-tickets@… defect Normal
#45590 $PATH variable for kde apps doesn't contain opt/local/bin directory kde4-kile new nicos@… defect Normal
#45585 Yosemite py27-cython installs but does not function properly. Hasfix py27-cython new stromnov@… defect Normal
1 2 3 4 5 6 7 8 9 10 11 12
Note: See TracQuery for help on using queries.