New Ticket     Tickets     Wiki     Browse Source     Timeline     Roadmap     Ticket Reports     Search

Custom Query (4298 matches)

Filters
 
Or
 
  
 
Columns

Show under each result:


Results (601 - 700 of 4298)

1 2 3 4 5 6 7 8 9 10 11 12 13 14 15 16 17
Ticket Summary Port Status Owner Type Priority
#46327 cpan2port: fix exceptions cpan2port new macports-tickets@… defect Normal
#44654 cpan2port improvements cpan2port new macports-tickets@… enhancement Normal
#31191 cpio @2.11_1 fails to build cpio new mww@… defect Low
#38556 cpphs @1.3: update to 1.16, use haskell-1.0 portgroup, rename to hs-cpphs cpphs new macports-tickets@… update Normal
#49711 [cpp-netlib][0.11.2][new port] cpp-netlib new macports-tickets@… submission Normal
#42331 crack-attack won't build/install on OS X Mavericks crack-attack mesa new raimue@… defect Normal
#45179 crafty @24.1: error: unrecognized command line option "-fprofile-correction" crafty new khindenburg@… defect Normal
#45178 crafty: use the right compiler, -arch flags, universal variant crafty new khindenburg@… defect Normal
#51180 crashing BLT blt new macports-tickets@… defect Normal
#46681 crash in glx_display_free when closing application connected to remote XOrg.org server mesa assigned jeremyhu@… defect Normal
#46549 crash in gst_plugin_scanner from port:gstreamer010 gstreamer010 new macports-tickets@… defect Normal
#51278 cre2 - C wrapper for re2 assigned sean@… request Normal
#48553 create new php70-ssh2 port php70-ssh2 new ryandesign@… request Normal
#33396 Create single mpkg of all installed ports new macports-tickets@… enhancement Normal
#52190 criticalmass @1.0.2_3 build error due to requirement for older libpng 1.2 criticalmass assigned ryandesign@… defect Low
#33613 criticalmass: memalloc errors criticalmass new macports-tickets@… defect Normal
#45269 crossbinutils @ 1.0 0-byte manpages arm-elf-binutils new macports-tickets@… defect Normal
#40177 cross-compilers are missing the fortran compiler crossgcc new macports-tickets@… defect Normal
#45675 cryptlib @3.4.2 fails to build on 10.10 with XCode 6.1 cryptlib assigned ryandesign@… defect Normal
#45560 csound won't build csound new macports-tickets@… defect Normal
#32420 cssed crashes at launch when built against gtk2 +quartz cssed new macports-tickets@… defect Normal
#42008 cssed: ld: symbol(s) not found for architecture x86_64 cssed new macports-tickets@… defect Normal
#49749 cssh: Request to update port to 4.03_03 cssh new macports-tickets@… update Normal
#45500 ctags 5.8_1 ignores --regex- flags ctags new mww@… defect Normal
#38885 cufflinks @ 0.9.3: build fails cufflinks new haroldpimentel@… defect Normal
#38969 cufflinks @0.9.3 - build failure cufflinks new haroldpimentel@… defect Normal
#42120 cufflinks: update to 2.1.1 cufflinks new haroldpimentel@… update Normal
#33708 cuneiform @1.1.0_0 Error during execution: Abort trap: 6 cuneiform new macports-tickets@… defect Normal
#24045 cups-pdf 2.5.0 printer spool issue cups-pdf new macports-tickets@… defect Normal
#52245 cups-pdf mainly broken on El Capitan OS X 10.11 cups-pdf new macports-tickets@… defect Normal
#45006 cups-pdf sandbox issues in yosemite cups-pdf new macports-tickets@… defect Normal
#34383 curl @7.25.0 SFTP fails with "Failure establishing ssh session" (2) curl new ryandesign@… defect Normal
#50625 curl 7.47.1 crashes PPC/G4 Tiger/10.4.11 curl new ryandesign@… defect Normal
#38369 curl: add Secure Transport (darwinssl) support curl assigned ryandesign@… enhancement Normal
#51362 curl with SPNEGO and git can't be used together. curl kerberos5 new ryandesign@… defect Normal
#49548 Currently failing KDE4 ports (because of concurrent qt4-mac and other reasons) category:kde4 new rjvbertin@… defect Normal
#32967 cvsps needs to be UsingTheRightCompiler cvsps new macports-tickets@… defect Normal
#52085 cyrus-imapd @2.4.18_2: xinstall: Unknown user cyrus cyrus-imapd new macports-tickets@… defect Normal
#33326 cyrus-sasl2 @2.1.23 +universal +kerberos: libsasl2.la differs and cannot be merged cyrus-sasl2 new macports-tickets@… defect Normal
#41872 cyrus-sasl2 @2.1.26_3 +kerberos+sql+universal: muniversal destroot merge failure cyrus-sasl2 new macports-tickets@… defect Normal
#14486 cyrus-sasl2: Add ldap variant cyrus-sasl2 new landonf@… enhancement Normal
#36781 cyrus-sasl2: use Heimdal instead of MIT Kerberos on Lion and later cyrus-sasl2 new macports-tickets@… enhancement Normal
#34548 dansguardian doesn't start anymore since upgrade to macports 2.1.0 dansguardian new macports-tickets@… defect Normal
#26134 dante @1.2.1: socksify: missing /opt/local/lib/libdsocks.so. no preload support? dante new macports-tickets@… defect Normal
#46245 daq @2.0.4: fetch fails daq new jann@… defect Normal
#48794 darcs: package HTTP-4000.2.10 is broken due to missing package darcs new cal@… defect Normal
#52068 darkice needs pkgconfig dependency darkice new nd@… defect Normal
#47226 darktable @1.1.2: ./build.sh: line 242: syntax error near unexpected token `&&' darktable new macports-tickets@… defect Normal
#43286 darktable @1.1.2: update to latest version 2.0.0 darktable assigned ryandesign@… update Normal
#51447 darktable CMake module FindLensFun.cmake has incorrect path darktable new macports-tickets@… defect Normal
#43199 darktable: Freetype_INCLUDE_DIR NOTFOUND darktable new macports-tickets@… defect Normal
#45849 darwinbuild update errors darwinbuild new wms@… defect Normal
#25415 dash universal variant fails dash new Mathias.Laurin+macports@… defect Normal
#41995 db46 @4.6.21_9 update fails "build Command failed" db46 new blair@… defect Normal
#45669 db46 @4.6.21: libtool db46 new blair@… defect Normal
#42426 db46 build failed db46 new blair@… defect Normal
#42785 db46: error: no member named 'seq' in 'struct __db' db46 reopened macports-tickets@… defect Normal
#45826 db48 +java fails to configure without java db48 new jmr@… defect Normal
#33124 db48: Valgrind-compatible variant db48 new macports-tickets@… submission Normal
#39464 db_select @0.1 Failed to fetch signature for archive - build failure db_select new macports-tickets@… defect Normal
#34415 dbus-devel: build fails dbus-devel new pixilla@… defect Normal
#52257 dbus: enhancements to use privileged services via the system bus and run a session bus over a remote X11 connection dbus new mcalhoun@… enhancement Normal
#48045 dbus "no_root" fails to install dbus new mcalhoun@… defect Normal
#35427 dbview @1.0.4 dbview new macports-tickets@… submission Normal
#46149 dcmtk @3.6.1_20140617_1: bits/c++config.h not found dcmtk new eborisch@… defect Normal
#50463 DDD 3.3.12 (i386-apple-darwin15.2.0) gets Xt error ddd new macports-tickets@… defect Normal
#39427 dd_rescue @1.14: update to 1.33 dd_rescue new macports-tickets@… update Normal
#40424 dd_rescue @1.14: Update to 1.40 dd_rescue ddrescue new macports-tickets@… update Normal
#43517 deactivate phase swallows sigint new cal@… defect Normal
#22471 Debugging options for startupitems (launchd / daemondo) new macports-tickets@… enhancement Normal
#45831 defect: emacs 24.4_1 cannot be built on PPC Tiger and Leopard because it needs Clang 3.4 which cannot be built emacs new dports@… defect Normal
#50326 defect: hugin-app can't find Lensfun at configure new macports-tickets@… defect Normal
#51102 defect: openbrowser can't find com.apple.LaunchServices.plist openbrowser new ryandesign@… defect Normal
#45291 defect: valgrind 3.10 does not built on Snow Leopard/Mac OS X 10.5.8 because libcoregrind_amd64_darwin_a-syswrap-darwin.o has no symbols valgrind new raimue@… defect Normal
#29165 Defect : xsane does not build universal with gimp support enabled xsane reopened devans@… defect Normal
#30264 deluge: Variant to build daemon and webclient only deluge new devans@… enhancement Normal
#50603 demeter and pgplot pgplot new macports-tickets@… defect Normal
#50986 Dependencies fail to install because hostnames cannot be resolved because we've run out of file descriptors new macports-tickets@… defect High
#15818 Describe when to run "portindex" new macports-tickets@… enhancement Normal
#13900 DesktopManager-0.5.3: Undefined symbols: _CGSCreateCStringNoCopy DesktopManager new macports-tickets@… defect Normal
#35136 despotify: no sound despotify new mail@… defect Normal
#25933 Devede new macports-tickets@… request Normal
#44882 [developer] kdelibs4 4.14/git/master portfile and directory kdelibs4 new macports-tickets@… enhancement Normal
#49009 developers convience utility: port-edit-state, port-update-checksum and port-redo-install-phase new macports-tickets@… submission Normal
#16465 devel/ptlib-2.2.1 new port ptlib new macports-tickets@… submission Normal
#45687 dfu-util to be used with Mac OS X 10.10 new macports-tickets@… request Normal
#50663 DIA 0.97.3_0 not working in El Capitan dia new macports-tickets@… defect Normal
#50873 Dia canvas has incoherent colors in Quartz dia assigned devans@… defect Normal
#37939 dia: docbook.xsl:1: parser error : Document is empty dia new macports-tickets@… defect Normal
#42401 Dia does not include help documentation; offers no variant to build it either dia new macports-tickets@… enhancement Normal
#42165 dialog @1.2-20130928+universal∞ Install failed during build dialog new macports-tickets@… defect Normal
#52018 dibbler @1.0.0RC1: ../Misc/Portable.h:323:48: error: expected ')' dibbler new fclaire@… defect Normal
#40565 dict: add dictzip dict new landonf@… enhancement Normal
#40570 dict: universal variant fails dict new landonf@… defect Normal
#30838 Digikam @2.0.0 hangs at launch. digikam new jan@… defect Normal
#31926 digikam @2.1.1 unknown protocol 'digikamalbums' digikam new jan@… defect Normal
#37592 digikam @2.9.0 flickr module cannot authenticate digikam new jan@… defect Normal
#40912 DigiKam 3.5 corrupts JPG, TiFF, PNG images digikam new jan@… defect Normal
#44985 digikam @4.0.0_0: No drag and drop to the Dock anymore digikam new jan@… defect Normal
#47749 digikam @4.10.0 No video playback [Portfile PATCH] digikam new jan@… enhancement Normal
1 2 3 4 5 6 7 8 9 10 11 12 13 14 15 16 17
Note: See TracQuery for help on using queries.