New Ticket     Tickets     Wiki     Browse Source     Timeline     Roadmap     Ticket Reports     Search

Custom Query (4235 matches)

Filters
 
Or
 
  
 
Columns

Show under each result:


Results (701 - 800 of 4235)

1 2 3 4 5 6 7 8 9 10 11 12 13 14 15 16 17 18

Owner: jwa@… (21 matches)

Ticket Summary Status Type Priority Milestone Component
#40094 pgAdmin3 uses --with-arch-x86_64 new defect Normal ports
#41343 python extension module builds missing -I/opt/local/include new defect Normal ports
#41440 python27 +universal build fail new defect Normal ports
#42191 python*: IDLE requires py*-tkinter new defect Normal ports
#44159 pgAdmin3 @1.18.1_1 UI problems new defect Normal ports
#45247 python2{6,7} memory leak due to db46 new defect Normal ports
#45557 wxWidgets-3.0 build error new defect Normal ports
#45807 py27-tkinter installation failed new defect Normal ports
#47827 python34 @3.4.3_2 ANSI escape code are disabled on input() with readline module new defect Normal ports
#48573 python35 @3.5.0b4 pip not installed by default new enhancement Normal ports
#48807 python messes with terminal state on exit new defect Normal ports
#49272 python35: doesn't work with Xcode 4 new defect Normal ports
#49317 python34 @3.4.3 Allow loading SQLite extensions new enhancement Normal ports
#49376 py35-tkinter @3.5.0_2: Python 3.5 idle using X-windows graphic, not using OS X native graphics new defect Normal ports
#49408 ssl.SSLError: [SSL: CERTIFICATE_VERIFY_FAILED] certificate verify failed (_ssl.c:590) new defect Normal ports
#49767 python27 @2.7.10_3 org.macports.destroot for port python27 returned: command execution failed new defect Normal ports
#50308 python27: Warning: configHandler.py - IdleConf.GetOption - problem retrieving configuration option 'name2' from section 'Theme'. new defect Normal ports
#50578 python34 + GCC + El Capitain new defect Normal ports
#50821 python24, python25, python26, python27, python31, python32, python33, python34, python35: Fix building for strange architecture combinations new defect Normal ports
#51141 Consider building Python with +ucs4 by default new enhancement Normal ports
#51736 python35 @3.5.2_0 fails to build with macosx_deployment_target 10.7 new defect Normal ports

Owner: kajtzu@… (1 match)

Ticket Summary Status Type Priority Milestone Component
#19197 rb-piston: update to 2.0.1 new update Normal ports

Owner: kenh@… (1 match)

Ticket Summary Status Type Priority Milestone Component
#35468 nmh does not build with clang new defect Normal ports

Owner: khindenburg@… (3 matches)

Ticket Summary Status Type Priority Milestone Component
#33701 LyX spotlight plugin can't be loaded new defect Normal ports
#45178 crafty: use the right compiler, -arch flags, universal variant new defect Normal ports
#45179 crafty @24.1: error: unrecognized command line option "-fprofile-correction" new defect Normal ports

Owner: kiarash@… (1 match)

Ticket Summary Status Type Priority Milestone Component
#45791 geany: cannot open display new defect Normal ports

Owner: kimuraw@… (2 matches)

Ticket Summary Status Type Priority Milestone Component
#39248 rb ports need revbump assigned defect High ports
#50227 port select --set ruby ruby23 fails on rake symlink creation new defect Normal ports

Owner: kitchen.andy@… (3 matches)

Ticket Summary Status Type Priority Milestone Component
#42092 ghc-bootstrap does not build new defect Normal ports
#50480 GHC installation failed on El Capitan new defect Normal ports
#51439 ghc: allow building with clang-3.4 or later new enhancement Normal ports

Owner: kjell.konis@… (11 matches)

Ticket Summary Status Type Priority Milestone Component
#37107 R.app crashes when trying to load tk@8.5.13_0+quartz new defect Normal ports
#38235 R documentation is missing new defect Normal ports
#38958 R @3.0.0_0: build failure on OS X 10.6.8 new defect Normal ports
#39339 R-app @1.61: build failure on 10.6.8 new defect Normal ports
#41731 R @3.0.2 installation fails to complete new defect Normal ports
#41918 R @3.0.2_1: +atlas variant fails to build new defect Normal ports
#44084 R fails to upgrade with fortran compiler error new defect Normal ports
#44871 Building R-3.1.1 on a PPC requires using a compiler that can properly handle ObjectiveC code new defect Normal ports
#46786 R changes broke rNMR package new defect Normal ports
#46849 R @3.1.2_0: restore support for ${prefix}/lib/R/library new enhancement Normal ports
#11784 RFE: make R universal new enhancement Low ports

Owner: kobold@… (1 match)

Ticket Summary Status Type Priority Milestone Component
#51321 nuweb: update to 1.58 new update Normal ports

Owner: krischik@… (12 matches)

Ticket Summary Status Type Priority Milestone Component
#18648 slrn unable to connect to leafnode new defect Normal ports
#21150 nonpareil 15c, no LCD display new defect Normal ports
#25598 GNAT GPL 2010 now available, update portfile to use it? assigned update Normal ports
#31826 android: whitespace cleanup and update to sdk15 + features new update Normal ports
#33341 android @16 Problem with permissions folder new defect Normal ports
#37002 leafnode: plist files should use <UserName> rather than sudo new defect Normal ports
#38133 android-ndk @7b_0: build failure on OS X 10.5.8 PPC new defect Normal ports
#44349 port install broken permission-wise new defect Normal ports
#48160 sigil: update to 0.8.7 new update Normal ports
#48194 libunrar @5.2.7_0: build fails with "use of undeclared identifier 'mprintf'" new defect Normal ports
#48417 unrar: update to 5.3.1 new update Normal ports
#50713 unRAR 5.2.7 does nor build on Mac OS X 10.6.8, Snow Leopard, because "‘mprintf’ was not declared in this scope" new defect Normal ports

Owner: kristian.peters@… (1 match)

Ticket Summary Status Type Priority Milestone Component
#44402 jpilot has missing dependencies new defect Normal ports

Owner: krugazor@… (1 match)

Ticket Summary Status Type Priority Milestone Component
#24592 yafray : is now named YafaRay and got updated new update Normal ports

Owner: ksammons@… (1 match)

Ticket Summary Status Type Priority Milestone Component
#44749 reclaim test suite fails if not run with superuser privileges new defect Normal base

Owner: kuba@… (1 match)

Ticket Summary Status Type Priority Milestone Component
#48427 maxima: add gcl variant new enhancement Normal ports

Owner: kyut@… (2 matches)

Ticket Summary Status Type Priority Milestone Component
#17461 jnethack: don't make user/group games new defect Normal ports
#47203 jnethack @3.4.3-0.11_0: patch-sys_unix_Makefile.doc.diff fails to apply new defect Normal ports

Owner: landonf@… (37 matches)

Ticket Summary Status Type Priority Milestone Component
#14042 Jetty-6.1.7 new update Normal ports
#14486 cyrus-sasl2: Add ldap variant new enhancement Normal ports
#18630 liboil: do not require glib new enhancement Normal ports
#20498 ocaml-ocamlnet: reinplace didn't change anything in Makefile new defect Normal ports
#20911 make caml-pcre use the same compiler as ocaml new enhancement Normal ports
#26942 Openldap daemon start fails out of the box new defect Normal ports
#27665 ccache cannot write manifest files new defect Normal ports
#28992 Mscgen port needs an update new update Normal ports
#29298 openldap @2.4.21 add back-ldap variant new enhancement Normal ports
#30713 jetty: add startup item new enhancement Normal ports
#31578 Update i386-mingw32-gcc to latest version new update Normal ports
#32120 fsharp: F# Interactive gives error: Failed to install ctrl-c handler new defect Normal ports
#32186 pmd: Update to 4.3 new update Normal ports
#34143 ocaml-ocamlnet : all variants available in configure new enhancement Normal ports
#34412 apt will not compile at the end new defect Normal ports
#34993 libgtksourceviewmm: update to 1.9.5 new update Normal ports
#37627 py-pyproj is not UsingTheRightCompiler new defect Normal ports
#38153 py27-gitpython missing runtime dependency on py27-gitdb new defect Normal ports
#38183 ccache @3.1.9 "c++" uses the wrong compiler new defect Normal ports
#38304 i386-mingw32-binutils @2.21-3_0: windres converts resource string to UTF-16 with wrong endianness, PATCH new defect Normal ports
#38629 openldap: clang: error: no input files new defect Normal ports
#40191 spatialite will not upgrade (build fails if spatialite is active) new defect Normal ports
#40565 dict: add dictzip new enhancement Normal ports
#40570 dict: universal variant fails new defect Normal ports
#41275 nsis: build failure under 10.9 new defect Normal ports
#42336 heimdal @1.3.3_1 does not install (OS 10.9) new defect Normal ports
#43646 i386-mingw32-binutils build error new defect Normal ports
#44567 Upgrade mscgen to 0.2 new update Normal ports
#44616 Glom will not build with +quartz option new defect Normal ports
#45103 ocaml-ocamlnet: Missing dependency on ocaml-camlp4 new defect Normal ports
#45104 ocaml-ocamlnet @3.7.3_0: update available to 3.7.6 new update Normal ports
#45895 error building antlr new defect Normal ports
#47111 tinyca2 @0.7.5 fails to start in 10.9.5 new defect Normal ports
#47560 meld: version bump to @3.12.3 (Portfile attached) new update Normal ports
#47630 openldap @2.4.40_1 does not build on PPC Leopard, Mac OS X 10.5.8, presumingly when another Berkeley DB is present new defect Normal ports
#47836 i386-mingw32-gcc @3.4.5-20060117-2 Fails to build new defect Normal ports
#11826 RFE: cyrus-sasl2 add PAM support new enhancement Low ports

Owner: larryv@… (1 match)

Ticket Summary Status Type Priority Milestone Component
#37732 cmake-1.0: provide option to disable CMAKE_OSX_ARCHITECTURES new defect High ports
(more results for this group on next page)
1 2 3 4 5 6 7 8 9 10 11 12 13 14 15 16 17 18
Note: See TracQuery for help on using queries.