New Ticket     Tickets     Wiki     Browse Source     Timeline     Roadmap     Ticket Reports     Search

{1} Active Tickets (4169 matches)

  • List all active tickets by priority.
  • Color each row based on priority.

Results (1801 - 1900 of 4169)

Ticket Summary Component Version Milestone Type Owner Status Created
#47929 llvm-gcc42 @2336.11_2 fails building on 10.6.8 ports 2.3.3 defect macports-tickets@… new 06/02/15
#47932 Missing components for Plplot 5.10.0 ports 2.3.3 defect takeshi@… new 06/02/15
#47937 grads: /opt/local/bin/wgrib already exists and does not belong to a registered port ports 2.3.3 defect takeshi@… new 06/03/15
#47944 poppler @0.33.0: cross-compilation fails: Bad CPU type in executable ports 2.3.3 defect devans@… new 06/03/15
#47965 iTerm2 @2.1_0 upgrade to 2.1.1 ports 2.3.3 defect emer@… new 06/05/15
#47974 arm-none-linux-gnueabi-gcc: stdio.h: No such file or directory ports 2.3.3 defect stuartwesterman@… new 06/05/15
#47983 ocaml-lacaml 7.0.13 build failure owing to changed framework on yosemite 10.10 ports 2.3.3 defect mww@… new 06/06/15
#47995 compiling qiv err out with 'gdk/gdkx.h' file not found ports 2.3.3 defect lloyd@… new 06/08/15
#48004 Internal compiler error (gcc-5.1.0) when using math.h on Yosemite ports 2.3.3 defect mww@… new 06/09/15
#48007 Macports installation fails everytime base 2.3.3 defect macports-tickets@… new 06/10/15
#48009 volk @20150521_0 Undefined symbols for architecture x86_64 ports 2.3.3 defect michaelld@… new 06/10/15
#48016 icu do not compile under OSX 10.7 (error: initialization of non-aggregate type with an initializer list) ports 2.3.3 defect ryandesign@… new 06/11/15
#48020 cacti package depends on mysql5 package ports 2.3.3 defect macports-tickets@… new 06/11/15
#48024 charm-qt5 @1.8.0_20150312: cannot evaluate portfile ports defect rjvbertin@… new 06/11/15
#48045 dbus "no_root" fails to install ports 2.3.3 defect mcalhoun@… new 06/14/15
#48047 wcslib fails in destroot phase on G4 running Leopard 10.5.8 ports 2.3.3 defect macports-tickets@… new 06/14/15
#48051 Installing a port +universal needlessly reinstalls recursive dependencies +universal base 2.3.99 defect macports-tickets@… new 06/14/15
#48060 canna: building the documentation fails during image conversion ports defect macports-tickets@… new 06/15/15
#48063 MacVim doesn’t build on 10.6 ports 2.3.3 defect raimue@… new 06/15/15
#48064 py27-astropy fails in build stage on G4 running Leopard 10.5.8 ports 2.3.3 defect robitaille@… new 06/15/15
#48066 opencv @3.0.0 fails to build if opencv @2.4.11 is active ports 2.3.99 defect stromnov@… new 06/16/15
#48067 opencv @3.0.0 provides different library versions than opencv @2.4.11 did ports 2.3.99 defect stromnov@… new 06/16/15
#48081 digikam @4.9.0: build fails after upgrade to opencv 3.0.0 due to API/header changes ports 2.3.3 defect jan@… new 06/16/15
#48086 mpich subports use -devel suffix incorrectly ports 2.3.99 defect eborisch@… new 06/16/15
#48094 OpenGTL is dead ports 2.3.3 defect macports-tickets@… new 06/18/15
#48103 clojure-devel @1.6.0 "Command failed: cd ... && ant jar" ports 2.3.3 defect macports-tickets@… new 06/19/15
#48126 wgrib2 @2.0.0_3: build fails, cannot find _omp_set_num_threads and restGPRx ports 2.3.3 defect takeshi@… new 06/20/15
#48127 npm 2.11.2 fails user prefix build ports 2.3.3 defect macports-tickets@… new 06/20/15
#48130 uhd @3.8.4: i386 build fails: error: integer constant is too large for ‘long’ type ports 2.3.3 defect michaelld@… new 06/21/15
#48134 p5-sdl unusable ports defect macports-tickets@… new 06/21/15
#48143 octave-1.0.tcl ports 2.3.3 defect macports-tickets@… new 06/22/15
#48145 castxml: add variants for different versions of clang toolchain, use corresponding toolchain for compilation ports 2.3.3 defect stromnov@… new 06/23/15
#48173 Lion buildbot builder: No space left on device server/hosting defect admin@… new 06/25/15
#48178 circular dependency apple-gcc42/xpm, and many others ports 2.3.3 defect macports-tickets@… new 06/26/15
#48183 libetonyek @0.1.2: build failure on Lion ports defect rjvbertin@… new 06/26/15
#48194 libunrar @5.2.7_0: build fails with "use of undeclared identifier 'mprintf'" ports 2.3.3 defect krischik@… new 06/28/15
#48199 tiff @4.0.4_0: build fails ports 2.3.3 defect ryandesign@… new 06/28/15
#48202 gflags @2.0_0: missing CMake config script ports 2.3.3 defect macports-tickets@… new 06/29/15
#48203 openssl @1.0.2c_0: missing or invalid immediate expression `' taken as 0 ports 2.3.3 defect larryv@… assigned 06/29/15
#48218 opencv @3.0.0_0: debug variant not producing debug symbols ports 2.3.3 defect stromnov@… new 07/01/15
#48220 libsoup: build error ports 2.3.3 defect devans@… assigned 07/01/15
#48239 Can not change application colors via KDE System settings ports 2.3.3 defect nicos@… new 07/03/15
#48251 libpcl fails to build ports 2.3.3 defect luminans@… new 07/04/15
#48267 gnudatalange @0.9.5_4: dyld: Library not loaded: /opt/local/lib/libgrib_api.0.dylib ports 2.3.3 defect takeshi@… new 07/06/15
#48270 esmf @6_3_0rp1: error: cannot allocate an object of abstract type 'xercesc_2_8::XMLGrammarPoolImpl' ports 2.3.3 defect takeshi@… new 07/06/15
#48281 py27-pygrib @1.9.9: ld: library not found for -lopenjpeg ports 2.3.3 defect jswhit@… new 07/07/15
#48282 mpd @ 0.19.10 build fail - no boost files found ports 2.3.3 defect macports-tickets@… new 07/07/15
#48285 py27-glewpy @0.7.4_9 build failure ports 2.3.3 defect macports-tickets@… new 07/08/15
#48288 CMake generating broken Xcode projects when using OpenCV ports 2.3.3 defect macports-tickets@… new 07/08/15
#48299 gnucash @2.6.7_0 build failure with quartz gtk ports 2.3.3 defect dports@… new 07/09/15
#48329 aspell not installed as a dependency ports 2.3.3 defect macports-tickets@… new 07/12/15
#48336 x265 build fails on Leopard G4 PPC ports 2.3.3 defect ays388@… new 07/12/15
#48345 Building for 10.4u SDK on 10.6 uses gcc-4.0 even though building directly on 10.4 uses the newer apple-gcc-4.2 base 2.3.99 defect macports-tickets@… new 07/13/15
#48373 OpenNI does not install .pc file ports 2.3.3 defect ryandesign@… new 07/16/15
#48397 FreeRDP @1.1.0-beta1-2015031201 without VideoDecodeAcceleration for PPC? ports 2.3.3 defect macports-tickets@… new 07/18/15
#48398 salt @2014.1.13_1: post-activate failure ports 2.3.3 defect macports-tickets@… new 07/18/15
#48399 port install py27-kivy fails ports 2.3.3 defect stromnov@… new 07/18/15
#48409 sleuthkit: Directory /opt/local/var/macports/home/.ant/lib creation was not successful for an unknown reason ports 2.3.3 defect macports-tickets@… new 07/20/15
#48412 gcc49: fails to build on PPC Tiger 10.4.11 ports 2.3.3 defect mww@… new 07/20/15
#48424 py34-gevent @1.0.2_0 is not really Python 3.4 compatible ports 2.3.3 defect stromnov@… new 07/23/15
#48428 PHP wiki discrepancy? wiki defect macports-tickets@… new 07/23/15
#48437 kerberos5 @1.13.2: ld: -dylib_compatibility_version must be greater than zero ports 2.3.3 defect ryandesign@… assigned 07/25/15
#48441 libftdi1 @1.2_2: universal variant fails ports 2.3.3 defect snc@… new 07/25/15
#48454 babl @0.1.12 build failure (codegen) ports 2.3.3 defect macports-tickets@… new 07/28/15
#48455 Unnable to install opencv ports 2.3.3 defect stromnov@… new 07/29/15
#48457 octave-io @2.2.8_0 build error on update ports 2.3.3 defect mschamschula@… new 07/29/15
#48465 lensfun: build fails while installing gimp ports defect devans@… assigned 07/30/15
#48471 FSF gcc48 fails to compile projects on El Capitan due to OS X SDK bug in Availability.h ports 2.3.3 defect mww@… reopened 07/31/15
#48487 freetype@2.6: exported macro TYPEOF interferes with other applications (fixed in git) ports 2.3.3 defect ryandesign@… assigned 08/01/15
#48499 apache2: httpd binary not available through PATH (apache/passenger does not detect macports apache) ports 2.3.3 defect ryandesign@… new 08/04/15
#48501 atlas @3.10.2_1: checksum failure for binary archive ports 2.3.3 defect vince@… new 08/04/15
#48520 asymptote @2.35: +universal variant fails ports 2.3.3 defect mojca@… new 08/06/15
#48523 saga does not compile after gdal port uprade to 2.0 ports 2.3.3 defect vince@… new 08/06/15
#48527 Bug in gimp-gap ports defect devans@… assigned 08/08/15
#48528 Build of pdftk stuck ports 2.3.3 defect ryandesign@… new 08/08/15
#48540 php54-cairo: configuration never completes ports 2.3.3 defect ryandesign@… new 08/09/15
#48544 apbs-mpi: build fails ports 2.3.3 defect howarth.at.macports@… new 08/10/15
#48546 rethinkdb fails to build ports 2.3.3 defect macports-tickets@… new 08/10/15
#48558 Unable to install inventor in MacOS 10.8.5 ports 2.3.3 defect css@… assigned 08/12/15
#48568 airport fails to build on Yosemite ports defect macports-tickets@… new 08/13/15
#48571 '/opt/local/bin/average' causes conflict between ports "argyll" and "num-utils" ports 2.3.3 defect macports-tickets@… new 08/14/15
#48577 subversion 1.9.0+ causes port lint Portfile property checks to fail base 2.3.3 defect macports-tickets@… new 08/14/15
#48578 msgpack-1.0.1_0 configuration error - build failure ports 2.3.3 defect hum@… new 08/14/15
#48582 texlive-bin @2015_2: Makefile:1906: *** missing separator. Stop. ports 2.3.3 defect dports@… new 08/14/15
#48585 zim @0.63_0+python27: startup failure ports 2.3.3 defect gabriel.ben.jamin@… new 08/15/15
#48603 py27-astropy build fails with AttributeError ports 2.3.3 defect robitaille@… new 08/17/15
#48614 boost 1.59 with -no_single failing to build ports 2.3.3 defect ryandesign@… assigned 08/18/15
#48617 pulseaudio @6.0_9: error: unknown type name 'Point' ports 2.3.3 defect ionic@… new 08/18/15
#48619 Guide Page "4.6. Local Portfile Repositories" Seems Wrong guide defect markd@… new 08/18/15
#48620 HandBrakeCLI @0.10.0: error: unexpected token in argument list ports 2.3.3 defect larryv@… new 08/18/15
#48637 python25 @2.5.6_5: clang: error: unknown argument: '-mno-fused-madd' ports 2.3.3 defect macports-tickets@… new 08/19/15
#48647 `port select gcc` sets default C++ compiler ports 2.3.3 defect macports-tickets@… new 08/20/15
#48648 gdb build fails for userland prefix environments ports 2.3.3 defect stuartwesterman@… new 08/20/15
#48655 mutt @1.4.2.3_2 now using ncurses @6.0 lost color rendering ports 2.3.3 defect macports-tickets@… new 08/20/15
#48661 screen displays ""TERMCAP", line 20, col 1, terminal 'SC': Missing separator" ports 2.3.3 defect youvegotmoxie@… new 08/21/15
#48674 ocaml-pxp 1.2.4_3 ports 2.3.3 defect mww@… new 08/22/15
#48677 kealib @1.4.2.20140825_2: CMake Error: The source directory does not appear to contain CMakeLists.txt ports 2.3.3 defect vince@… new 08/22/15
#48688 py27-ipyparallel @4.0.2_0 conflicts with py27-ipython ports 2.3.3 defect macports-tickets@… new 08/23/15
#48690 Upgrading "guile18" fails ports 2.3.3 defect macports-tickets@… new 08/23/15
#48691 caffe: ld: library not found for -lopencv_imgcodecs ports 2.3.3 defect hum@… new 08/23/15
Note: See TracReports for help on using and creating reports.