New Ticket     Tickets     Wiki     Browse Source     Timeline     Roadmap     Ticket Reports     Search

{1} Active Tickets (4068 matches)

  • List all active tickets by priority.
  • Color each row based on priority.

Results (1101 - 1200 of 4068)

2 3 4 5 6 7 8 9 10 11 12 13 14 15 16 17 18 19 20 21 22
Ticket Summary Component Version Milestone Type Owner Status Created
#41289 arpack @3.1.3: Undefined symbols ports 2.2.1 defect mmoll@… new 11/09/13
#41292 libvmime @0.9.1_1: error: unknown type name 'pthread_mutex_t' ports 2.2.1 defect macports-tickets@… new 11/10/13
#41293 rasmol @2.7.4.2: Imake.tmpl:2144:10: fatal error: ' X11 .rules' file not found ports 2.2.1 defect macports-tickets@… new 11/10/13
#41343 python extension module builds missing -I/opt/local/include ports 2.2.1 defect jwa@… new 11/12/13
#41344 vim: breaks with two Python versions ports 2.2.1 defect raimue@… assigned 11/12/13
#41355 Zenity @2.32.1_4 needs a fix after upgrade to libnotify @0.7.6_0 ports 2.2.1 defect devans@… new 11/13/13
#41360 gucharmap install fails, please help ports 2.2.1 defect devans@… new 11/13/13
#41366 gcc48: asan (address sanitizer) is broken ports 2.2.1 defect larryv@… assigned 11/14/13
#41372 Arpack can't find BLAS ports 2.2.1 defect mmoll@… new 11/14/13
#41378 Installing subversion-javahlbindings (1.8.4) fails on OS X 10.9 ports 2.2.1 defect dluke@… assigned 11/15/13
#41383 llvm-gcc42 executables link with /usr/lib/libstdc++ when libc++ is used by MacPorts ports 2.2.99 defect erickt@…, jeremyhu@… new 11/15/13
#41392 Virtualbox @4.2.14: doesn't build on Mavericks ports defect macports-tickets@… new 11/16/13
#41394 vtk44 @4.4.2 Configure error - build failure ports 2.2.1 defect css@… new 11/16/13
#41401 root @5.34.11: configure: libX11 MUST be installed (on 10.5 PPC) ports defect jonesc@… new 11/16/13
#41417 libtorrent, libtorrent-devel: fatal error: 'tr1/functional' file not found ports 2.2.1 defect stuartwesterman@… new 11/18/13
#41418 mod_perl2 build is not affected by "configure.cflags-append -std=gnu89" ports defect macports-tickets@… new 11/18/13
#41425 tcpflow @1.4.2: SSL certificate problem, verify that the CA cert is OK ports 2.2.1 defect macports-tickets@… new 11/18/13
#41431 kdenlive fails to run on 10.9 if gavl is installed ports 2.2.1 defect dan@… reopened 11/18/13
#41434 magicpoint @1.13a - fatal error: ' X11 .rules' file not found ports 2.2.1 defect macports-tickets@… new 11/18/13
#41435 qemu @1.6.1 +target_sparc: Cocoa UI doesn't work for SPARC emulator. ports 2.2.1 defect raimue@… new 11/18/13
#41440 python27 +universal build fail ports 2.2.1 defect jwa@… new 11/18/13
#41468 angelscript: Inline asm clobbers must be last on the x87 stack ports 2.2.1 defect macports-tickets@… new 11/20/13
#41477 iRecovery @0.01 Git clone failed ports 2.2.1 defect blair@… new 11/20/13
#41480 socat @1.7.2.1 builds without tun/tap support ports 2.2.1 defect macports-tickets@… new 11/21/13
#41488 rbenv @0.4.0 fails to initialize shell completion ports 2.2.1 defect macports-tickets@… new 11/21/13
#41523 gtkwave misses dependency to gtk-osx-application, build fails for variant -x11 +no_x11 +quartz ports 2.2.1 defect macports-tickets@… new 11/24/13
#41529 Error: org.macports.build for port BGHUDAppKit returned: command execution failed ports 2.2.1 defect macports-tickets@… reopened 11/25/13
#41533 ocaml-lwt @2.4.3_1 – build failure ports 2.2.1 defect mww@… new 11/25/13
#41534 abiword @2.4.5: error: incomplete definition of type 'struct png_info_def' ports 2.2.1 defect macports-tickets@… new 11/25/13
#41536 arpack @3.1.3: configure failed ports 2.2.1 defect mmoll@… new 11/25/13
#41539 mysql-connector-java build depends on ant-contrib ports 2.2.1 defect macports-tickets@… new 11/25/13
#41541 py33-logilab-common installation failure ports 2.2.1 defect dh@… new 11/25/13
#41542 gnome-system-monitor @3.8.2.1_0 - application crashes when the Resources tab is selected ports 2.2.1 defect devans@… assigned 11/25/13
#41546 py33-psycopg2 +universal isn't universal ports 2.2.99 defect snc@… assigned 11/25/13
#41553 opencv @2.4.7_1 + enable cuda + configure error - build failure ports 2.2.1 defect stromnov@… new 11/26/13
#41562 libbonoboui @2.24.5: error: format string is not a string literal [-Werror,-Wformat-nonliteral] ports 2.2.1 defect macports-tickets@… new 11/26/13
#41586 py27-pyfftw @0.9.2 build failure ports 2.2.1 defect aronnax@… new 11/28/13
#41592 Warning: configured user/group macports does not exist, will build as root base 2.2.1 defect macports-tickets@… new 11/28/13
#41595 php: SIZEOF_LONG needs to vary based on bitness ports 2.2.1 defect ryandesign@… new 11/28/13
#41610 portmidi @217 Can't find jni.h even though it exists ports 2.2.1 defect macports-tickets@… new 11/29/13
#41616 TightVNC @1.3.10_1 won't build on PPC Leopard because of bug in Xvnc/config/cf/Imake.rules file? ports 2.2.1 defect macports-tickets@… new 11/30/13
#41639 gnudatalanguage @0.9.4: error: call to 'isspace' is ambiguous ports 2.2.1 defect takeshi@… new 12/01/13
#41644 root5 @5.34.13: Undefined symbols: ___GLXEW_ARB_multisample (on 10.5 i386) ports defect jonesc@… new 12/01/13
#41648 gcc48: Bootstrap comparison failure ports 2.2.1 defect mww@… new 12/02/13
#41659 digikam crash-Very unstable ports 2.2.1 defect jan@… new 12/02/13
#41670 swi-prolog @6.6.0 build error: command execution failed ports 2.2.1 defect pmoura@… new 12/03/13
#41672 gdb 7 can't read mach-o-le files. gdb apple can. ports defect stuartwesterman@… new 12/03/13
#41678 v8 @3.23.15: undefined symbols v8::Isolate::ThrowException etc. ports 2.2.1 defect frodwith@… new 12/03/13
#41681 gramps: use app portgroup to add launcher ports 2.2.1 defect devans@… new 12/04/13
#41687 gcc48 @4.8.2 fortran does not work ports 2.2.1 defect mww@… new 12/04/13
#41703 fuse4x-kext: No architectures to compile for (ARCHS=, VALID_ARCHS=i386 x86_64). ports 2.2.1 defect dports@… new 12/05/13
#41709 Mac OS X- loading two sets of Qt binaries into the same process ports 2.2.1 defect jan@… new 12/05/13
#41731 R @3.0.2 installation fails to complete ports 2.2.1 defect kjell.konis@… new 12/08/13
#41738 unison +aqua @2.40.102_1 does not build on Mavericks ports 2.2.1 defect macports-tickets@… new 12/09/13
#41744 herrie @2.2_0: Error: some dependencies are missing <spiff/spiff_c.h> ports 2.2.1 defect macports-tickets@… new 12/09/13
#41749 gdb: dyld: Library not loaded @rpath/libCore.so ports 2.2.1 defect stuartwesterman@… new 12/10/13
#41750 py-mahotas and py-pymorph not available after install ports 2.2.1 defect stromnov@… new 12/10/13
#41752 binutils-2.24 fails to build on PPC Tiger because of "multiple definitions of symbol _filename_cmp" ports 2.2.99 defect macports-tickets@… new 12/10/13
#41755 mysql-connector-odbc @5.1.8_1 +universal build failure ports 2.2.1 defect pixilla@… new 12/10/13
#41766 py27-numpy @1.8.0_2 +atlas +gcc48 compile error - build failure ports 2.2.1 defect dh@… new 12/11/13
#41770 VisualBoyAdvance @1.7.2_2: error: redefinition of 'i' ports 2.2.1 defect jtonio@… new 12/11/13
#41787 wxmsw @2.8.4: +universal variant fails because i386-mingw32-w32api is not universal ports 2.2.1 defect macports-tickets@… new 12/12/13
#41794 Gcc48 incompatible with opencv ports 2.2.1 defect macports-tickets@… new 12/13/13
#41796 binary package download ignores macosx_deployment_target set globally base 2.2.1 defect macports-tickets@… new 12/13/13
#41817 CMake @2.8.12_2: remove /sw paths from installed cmake modules ports 2.2.1 defect css@… new 12/14/13
#41821 Tesseract description should indicate required steps post-install steps ports 2.2.1 defect emer@… new 12/15/13
#41825 openexr: configure failure on Mavericks ports 2.2.1 defect blair@… new 12/15/13
#41828 port 2.2.1 mpkg build fails after package has been created base 2.2.1 defect macports-tickets@… new 12/15/13
#41839 gcr: build fails when using gtk3 +quartz due to X11 specific UI code ports 2.2.1 defect devans@… new 12/17/13
#41849 port 2.2.1: Error: org.macports.archivefetch for port libiconv returned: Failed to fetch signature for archive: The requested URL returned error: 400 Bad Request server/hosting 2.2.1 defect admin@… new 12/18/13
#41862 freetype: freetype-config differs and cannot be merged ports 2.2.1 defect ryandesign@… new 12/19/13
#41872 cyrus-sasl2 @2.1.26_3 +kerberos+sql+universal: muniversal destroot merge failure ports 2.2.1 defect macports-tickets@… new 12/21/13
#41873 lablgtk @1.2.7_4: build failure for gList.ml ports 2.2.1 defect macports-tickets@… new 12/21/13
#41875 slirp @1.0.17: ror: second parameter of 'main' (argument array) must be of type 'char **' ports 2.2.1 defect ryandesign@… assigned 12/21/13
#41876 maven-ant-tasks: Error: JAVA_HOME is not defined correctly. ports 2.2.1 defect macports-tickets@… new 12/21/13
#41894 Build of autotrace 0.31.1_9 does not detect installed pstoedit ports 2.2.1 defect macports-tickets@… new 12/23/13
#41895 ghostscript @9.10: missing font packages ports 2.2.1 defect macports-tickets@… new 12/23/13
#41917 libgcc-devel @4.9-20131215: internal compiler error: Illegal instruction ports 2.2.1 defect mww@… new 12/24/13
#41918 R @3.0.2_1: +atlas variant fails to build ports 2.2.1 defect kjell.konis@… new 12/24/13
#41924 v8 @3.23.15: build fails on lion buildslave and icu confusion ports 2.2.1 defect frodwith@… new 12/24/13
#41930 py-game: cannot initialize pygame screen ports 2.2.1 defect jmr@… new 12/25/13
#41937 Cacti port fails on Mavericks ports 2.2.1 defect macports-tickets@… new 12/26/13
#41966 gnudatalanguage @0.9.4_3 +gshhs Runtime Error - PLplot installation lacks the requested driver: xwin ports 2.2.1 defect macports-tickets@… new 12/29/13
#41967 secpwgen @1.3_1 cryptlib error: -20 ports 2.2.1 defect macports-tickets@… new 12/29/13
#41972 latex2man @1.23: imprecise dependency on texlive ports 2.2.1 defect larryv@… assigned 12/30/13
#41976 upgrade for camlimages fails ports 2.2.1 defect reilles@… new 12/30/13
#41995 db46 @4.6.21_9 update fails "build Command failed" ports 2.2.1 defect blair@… new 01/01/14
#42006 gpick: fatal error: 'libintl.h' file not found ports 2.2.1 defect macports-tickets@… new 01/03/14
#42008 cssed: ld: symbol(s) not found for architecture x86_64 ports 2.2.1 defect macports-tickets@… new 01/03/14
#42014 gjs build failure ports 2.2.1 defect juanrgar@… new 01/03/14
#42030 alliance @5.0: error: incompatible type for argument 2 of 'chktab' ports 2.2.1 defect macports-tickets@… new 01/05/14
#42045 cgminer @3.9.0 knc varient causes compilation error ports 2.2.1 defect ram@… new 01/07/14
#42051 llvm-3.3: found python 2.3.5 (/usr/bin/python); required >= 2.5 ports 2.2.1 defect ryandesign@… new 01/07/14
#42055 freeradius @2.1.9_2 - Update overwrites all config files ports 2.2.1 defect macports-tickets@… new 01/08/14
#42061 mysql5: uses /usr/lib/libstdc++.6.dylib as C++ standard library although macports::cxx_stdlib is set to libc++ ports 2.2.1 defect ryandesign@… new 01/08/14
#42065 Squid runaway child processes at boot, commBind: Cannot bind socket FD NN to *:3128: (48) Address already in use ports 2.2.1 defect jmr@… new 01/08/14
#42070 lua @5.2.2_1 arrow keys don't work in interpreter ports 2.2.1 defect macports-tickets@… new 01/09/14
#42092 ghc-bootstrap does not build ports 2.2.1 defect kitchen.andy@… new 01/10/14
#42101 upgrading qpdf attempts to link with old library ports 2.2.1 defect dojo@… new 01/12/14
#42102 py27-pip targets wrong python ports 2.2.1 defect stromnov@… new 01/12/14
2 3 4 5 6 7 8 9 10 11 12 13 14 15 16 17 18 19 20 21 22
Note: See TracReports for help on using and creating reports.