New Ticket     Tickets     Wiki     Browse Source     Timeline     Roadmap     Ticket Reports     Search

{3} All Tickets by Milestone (4060 matches)

This report shows how to color results by priority, while grouping results by milestone.

Last modification time, description and reporter are included as hidden fields for useful RSS export.

Results (901 - 1000 of 4060)

1 2 3 4 5 6 7 8 9 10 11 12 13 14 15 16 17 18 19 20

Release (100 matches)

Ticket Summary Component Version Type Owner Status Created
#38986 python 2.7 ENOTSUP vs. EOPNOTSUPP discrepancies ports 2.1.3 defect jwa@… new 05/02/13
#38991 Python27 crashes in openssl code on PPC Tiger 10.4.11 when I build with -vd ports 2.1.3 defect macports-tickets@… new 05/03/13
#39025 mtools @3.9.11 needs a dependency on xorg-libx11 ports 2.1.3 defect francois@… new 05/07/13
#39026 bigloo links to nonexisting framework ports defect reilles@… new 05/07/13
#39032 libnotify @0.5.2 should use the active_variants portgroup ports 2.1.3 defect macports-tickets@… new 05/07/13
#39038 ccl-util @32.69: build error ports 2.1.3 defect dave@… new 05/08/13
#39044 python33 @3.3.1: build failure ports 2.1.3 defect jwa@… new 05/08/13
#39051 The example portfile in the "doc" folder of base should pass lint base 2.1.3 defect macports-tickets@… new 05/09/13
#39070 uzbl: uzbl-browser immediately aborts with a memory fault ports 2.1.3 defect ryandesign@… assigned 05/11/13
#39074 mod_security2 fails to compile with lua error ports 2.1.3 defect pixilla@… new 05/11/13
#39098 opendx @4.4.4_3: mkdir: /opt/local/dx/java/server/nets: Operation not permitted ports 2.1.3 defect macports-tickets@… new 05/14/13
#39100 aria2 @1.17.0 build error related to AppleTLSContext.cc; build failure ports 2.1.3 defect macports-tickets@… new 05/14/13
#39111 gnumeric won't install ports 2.1.3 defect macports-tickets@… new 05/15/13
#39123 squid3: EUI error with 3.3.4 and OSX Server 10.6.8 ports 2.1.3 defect jmr@… assigned 05/16/13
#39124 povray 3.7.0.RC7 does not support Preview_Start_Size ports 2.1.3 defect macports-tickets@… new 05/16/13
#39125 ImageMagick 6.8.5-5: build failure ports 2.1.3 defect ryandesign@… new 05/16/13
#39136 make test fails when run as root and creates junk file base 2.1.99 defect macports-tickets@… new 05/17/13
#39151 cflow 1.0 Build error with clang ports 2.1.3 defect gnn@… new 05/19/13
#39153 Kdevelop will not launch after successful installation ports 2.1.3 defect nicos@… reopened 05/19/13
#39172 poppler 0.22.4 seems to miss a dependency: source-highlight ports 2.1.3 defect devans@… new 05/20/13
#39174 gimp-jp2 needs to be aware whether it was compiled against gtk2 +x11 or +quartz ports 2.1.3 defect devans@… new 05/20/13
#39192 Image::LibRSVG won't install ports 2.1.3 defect pixilla@… new 05/22/13
#39209 afni @2010_10_19_1028_2: checksum mismatch ports 2.1.3 defect macports-tickets@… new 05/23/13
#39249 qt3-mac: error: invalid use of incomplete type ‘struct png_info_def’ ports 2.1.3 defect blair@… new 05/26/13
#39265 graphviz +ruby: mtree violation by /System ports 2.1.3 defect ryandesign@… new 05/28/13
#39272 `-p` flag for `port` command doesn't play nice with errors resulting from mismatched requested variants vs. originally-selected variants base 2.1.3 defect macports-tickets@… new 05/29/13
#39299 libpqxx26 build fails with clang due to -Werror ports 2.1.3 defect macports-tickets@… new 05/31/13
#39300 libpqxx26 conflicts with libpqxx ports 2.1.3 defect macports-tickets@… new 05/31/13
#39303 avahi @0.6.31 fails to upgrade to revision 8 ports 2.1.3 defect pixilla@… new 06/01/13
#39307 mplayer no subtitles, no fonts ports 2.1.3 defect jeremyhu@… new 06/01/13
#39312 gtkglextmm 1.2.0 - command execution failed ports 2.1.3 defect billitch@… new 06/02/13
#39319 netcdf-fortran: NETCDF.mod install location varies with universal variant ports 2.1.3 defect takeshi@… new 06/02/13
#39332 quarter @1.0.0.5 +Coin error -build failure ports 2.1.3 defect macports-tickets@… new 06/03/13
#39339 R-app @1.61: build failure on 10.6.8 ports 2.1.3 defect kjell.konis@… new 06/04/13
#39344 evas 1.7.7 build failure ports 2.1.3 defect ryandesign@… new 06/05/13
#39345 spim @7.4 build failed - Command execution failed ports 2.1.3 defect macports-tickets@… new 06/05/13
#39346 kerberos5: build failure (10.4/Intel) ports 2.1.3 defect ryandesign@… new 06/05/13
#39347 Qt-Creator doesn't open any pro file anymore ports 2.1.3 defect sicherha@… new 06/05/13
#39372 xournal: copy and paste don't work ports 2.1.3 defect ryandesign@… new 06/06/13
#39403 kgraphviewer @2.1.1_0: build failure - package 'libgraph' not found ports 2.1.3 defect jonesc@… new 06/10/13
#39405 Space character in packagemaker_path attribute in macports.conf breaks mpkg and mdmg base 2.1.3 defect macports-tickets@… new 06/10/13
#39416 Error: org.macports.build for port arm-elf-gdb returned: command execution failed ports 2.1.3 defect billy@… new 06/11/13
#39420 imapfilter @2.5.3: "symbol not found _lual_register" at runtime ports 2.1.3 defect mww@… new 06/11/13
#39423 Uninstalling replaced port with dependents has to be forced base 2.1.3 defect macports-tickets@… new 06/12/13
#39443 qtpfsgui fails to build: OpenMP problem ports 2.1.3 defect macports-tickets@… new 06/16/13
#39464 db_select @0.1 Failed to fetch signature for archive - build failure ports 2.1.3 defect macports-tickets@… new 06/18/13
#39467 rb-capistrano does not install capistrano in any useful form ports 2.1.3 defect macports-tickets@… new 06/18/13
#39483 reduce-algebra: runtime errors ports 2.1.3 defect mark.brethen@… new 06/20/13
#39484 man @@1.6g +man_all_lang build failure ports 2.1.3 defect mww@… new 06/20/13
#39522 "man" incorrectly displays the Russian locale ports 2.1.3 defect macports-tickets@… new 06/24/13
#39527 logsentry - Fix path references ports 2.1.3 defect julien.touche@… new 06/25/13
#39538 wireshark @1.10.0_1: Install ws_symbol_export.h ports 2.1.3 defect darkart.com@… new 06/26/13
#39541 gimp2 @2.8.6_0 +help_browser +python27 +quartz build fails ports 2.1.3 defect devans@… assigned 06/26/13
#39559 openscad build fails: fatal error: 'IOKit/IOKitLib.h' file not found ports 2.1.3 defect macports-tickets@… new 06/27/13
#39561 postgresql93-server @9.3beta2: Unable to start server ports 2.1.3 defect jwa@… new 06/28/13
#39571 yelp 2.31.6 fails to build for +quartz ports 2.1.3 defect macports-tickets@… new 06/28/13
#39586 vtk5 @5.10.1_0 ports 2.1.3 defect macports-tickets@… new 06/29/13
#39606 qt4-creator-mac: error: IOKit/IOKitLib.h: No such file or directory ports 2.1.3 defect macports@… new 07/02/13
#39611 MacPorts installer for Lion fails if /opt is mounted zfs base 2.1.3 defect macports-tickets@… new 07/02/13
#39638 Proxy is removed when doing port upgrade outdated base 2.1.3 defect macports-tickets@… new 07/05/13
#39639 xulrunner-devel @2.0_2: default initialization of an object of const type 'const EmptyEnumeratorImpl' requires a user-provided default constructor ports 2.1.3 defect macports-tickets@… new 07/05/13
#39640 Duplicate symbol __gcry_mpih_add_1 when linking libgcrypt ports 2.1.3 defect macports-tickets@… new 07/05/13
#39657 aircrack-ng @1.1: build failure "ld: malformed archive TOC entry" ports 2.1.3 defect macports-tickets@… new 07/07/13
#39659 configure script does not expand "~" for applications_dir and frameworks_dir base 2.1.3 defect macports-tickets@… new 07/07/13
#39661 mosml, mosml-dynlibs: fix homepage and master_sites ports 2.1.3 defect cso@… new 07/07/13
#39663 mosml, mosml-dynlibs: fix whitespace ports 2.1.3 defect cso@… new 07/07/13
#39664 mosml-dynlibs does not build: lvalue required as left operand of assignment ports 2.1.3 defect macports-tickets@… new 07/07/13
#39665 mosml-dynlibs is not UsingTheRightCompiler ports 2.1.3 defect macports-tickets@… new 07/07/13
#39668 ntop: remove gd2 dependency ports defect macports-tickets@… new 07/07/13
#39680 stog: dependency on texlive-bin is likely incorrect ports 2.1.3 defect mww@… new 07/09/13
#39681 Error in SWIG C++ when installing gnuradio +full on OSX 10.6 ports 2.1.3 defect michaelld@… reopened 07/09/13
#39714 mythtv-core.25 builds on ppc but scheduling fails ports 2.1.3 defect ctreleaven@… new 07/12/13
#39723 ccl @1.9 build failure ports 2.1.3 defect easieste@… new 07/13/13
#39725 moc @2.4.4 build error ports 2.1.3 defect eu@… new 07/14/13
#39726 fail2ban @0.8.8: fail2ban-regex fails ports 2.1.3 defect fclaire@… new 07/14/13
#39745 xsel missing dependency ports 2.1.3 defect ryandesign@… assigned 07/15/13
#39755 libemf @1.0.4: update to 1.0.7 ports 2.1.3 defect macports-tickets@… new 07/15/13
#39756 Adding runtime dep of yelp @2.31.6_1 to gnome apps breaks +quartz variant ports defect devans@… new 07/15/13
#39780 py3{2,3}-shiboken: build failure, members of libapiextractor.a have no symbols ports 2.1.3 defect mmoll@… new 07/17/13
#39791 libstdcxx 4.8.1 fails to build on PPC Tiger because of undefined symbols ports 2.2.99 defect mww@… new 07/18/13
#39798 libsdl_sound-framework @1.0.3 doesn't work like the rest of the libsdl_*-framework ports do ports 2.1.3 defect macports-tickets@… new 07/18/13
#39803 qt4-mac @4.8.5_0 missing dependency: qt4-mac-sqlite3-plugin ports 2.1.3 defect michaelld@… reopened 07/19/13
#39812 tests for scotch 6.0.0 are failing ports 2.1.3 defect macports-tickets@… new 07/20/13
#39857 Configure fails with totem ports 2.2.0 defect devans@… new 07/25/13
#39916 arm-elf-gdb: error: non-void function 'ARMul_MRC' should return a value ports 2.2.0 defect billy@… new 07/30/13
#39917 arm-elf-gdb conflicts with binutils ports 2.2.0 defect billy@… new 07/30/13
#39926 webkit-gtk 2.0.4 upgrade error: excess elements in struct initializer ports 2.2.0 defect mfeiri@… new 07/31/13
#39931 py-webkitgtk @1.1.8_7 build failure ports 2.2.0 defect elelay@… new 07/31/13
#39934 camlimages @4.0.1_7: build failure ports defect reilles@… new 07/31/13
#39967 qt4-creator-mac 2.8.0_1 fails building on 10.5.8 PPC ports 2.2.0 defect macports@… new 08/02/13
#39971 bro uses system python; needs to use MacPorts python ports 2.2.0 defect tanawts@… new 08/02/13
#40001 lamson: Missing dep for python-modargs ports 2.2.0 defect macports-tickets@… new 08/04/13
#40009 libproj4 @3_20081120_3+universal: arch mismatch with libgsl during build ports 2.2.0 defect takeshi@… new 08/05/13
#40018 Error in mysqld_safe script prevents startup ports 2.2.0 defect quest@… new 08/05/13
#40019 pspp 0.8.0 can't find cblas_dsdot () in optimized libgslblas ports defect dtakahashi42@… reopened 08/05/13
#40023 boost-1.54.0 unit test framework crashing at runtime ports 2.2.0 defect macports-tickets@… new 08/05/13
#40043 xapian-bindings @1.2.8_0: destroot does not install anything ports 2.2.0 defect dcolish@… new 08/07/13
#40078 py27-sympy build fails: AttributeError: 'module' object has no attribute 'sqrtrem' ports 2.2.0 defect stromnov@… new 08/13/13
#40090 log4cxx @0.10.0: Undefined local symbol L318 ports 2.2.0 defect macports-tickets@… new 08/13/13
#40094 pgAdmin3 uses --with-arch-x86_64 ports 2.2.0 defect jwa@… new 08/13/13
1 2 3 4 5 6 7 8 9 10 11 12 13 14 15 16 17 18 19 20
Note: See TracReports for help on using and creating reports.