New Ticket     Tickets     Wiki     Browse Source     Timeline     Roadmap     Ticket Reports     Search

{8} Active Tickets, Mine first (4313 matches)

  • List all active tickets by priority.
  • Show all tickets owned by the logged in user in a group first.

Results (1001 - 1100 of 4313)

1 2 3 4 5 6 7 8 9 10 11 12 13 14 15 16 17 18 19 20 21

Active Tickets (100 matches)

Ticket Summary Component Version Milestone Type Owner Status Created
#40709 "-fgnu89-inline" should not be used when building with clang ports 2.2.0 defect macports-tickets@… new 10/09/13
#40729 kate @4.11.2_0 unexpected behavior with dynamic word wrap ports 2.2.0 defect macports-tickets@… new 10/10/13
#40738 jack does not build OSX 10.9 ports 2.2.99 defect eu@… reopened 10/11/13
#40744 macports-built expect @5.45_4: crashes when used in a dejagnu testsuite ports 2.2.0 defect macports-tickets@… new 10/11/13
#40760 libpcl 1.7 only builds if template depth is raised ports 2.2.0 defect luminans@… new 10/13/13
#40788 Avidemux: Macports application does not work ports 2.2.0 defect macports-tickets@… new 10/16/13
#40791 nant @0.91: pkgconfig file does not define prefix ports 2.2.0 defect macports-tickets@… new 10/16/13
#40796 google-perftools @2.0 crashes due to infinite recursion in tlv_get_addr ports 2.2.0 defect macports-tickets@… new 10/17/13
#40805 wine 1.6 makes Tanner L-Edit crash when saving file ports 2.2.0 defect ryandesign@… new 10/18/13
#40807 graphviz @2.34.0: dot hangs when generating doxymentation on 10.6 ports 2.2.0 defect macports-tickets@… new 10/18/13
#40814 cmake configure failure (subdirectories with symlinks?) ports 2.2.0 defect macports-tickets@… new 10/19/13
#40853 gcc43, gcc44: g++ is broken wrt exception handling ports 2.2.0 defect mww@… new 10/23/13
#40862 tightvnc @1.3.10: fatal error: ' X11 .rules' file not found ports 2.2.0 defect macports-tickets@… new 10/23/13
#40872 screen: attach in multiuser mode fails with "Attach attempt with bad pid" message ports 2.2.0 defect macports-tickets@… new 10/23/13
#40904 tesseract @3.02.02: some language subports conflict ports 2.2.0 defect emer@… new 10/24/13
#40911 auctex port installation fails to check dependencies correctly ports 2.2.0 defect macports-tickets@… new 10/24/13
#40912 DigiKam 3.5 corrupts JPG, TiFF, PNG images ports 2.2.0 defect jan@… new 10/24/13
#40956 ocaml: ld: unknown option: -no_compact_unwind ports 2.2.0 defect mww@… new 10/26/13
#40958 media tomb does not build on Maverick ports 2.2.1 defect yattenator@… new 10/26/13
#40962 fox: universal build fails ports 2.2.0 defect lyle@… new 10/26/13
#40978 emacs-app @24.3_1/emacs-mac-app @4.4: memory bug in patch-src_emacs.c.diff ports 2.2.0 defect hum@… new 10/26/13
#40994 phantomjs @1.9.2: library not found for -lQtWebKit ports 2.2.1 defect stromnov@… new 10/27/13
#41020 gcc48: undefined symbol for toupper(int) when compiled as C11 ports 2.2.1 defect mww@… new 10/28/13
#41039 Installing MacPorts on Mavericks Renames "staff" Group To "macports" base 2.2.1 defect macports-tickets@… new 10/28/13
#41068 srtp: Undefined symbols: _aes_icm_advance_ismacryp ports 2.2.1 defect aeh@… new 10/29/13
#41071 mpg123 1.14.4 - Failed to open module coreaudio ports 2.2.1 defect astifter@… new 10/29/13
#41103 libtool @2.4.2_4 put $prefix in dl search path ports 2.2.0 defect macports-tickets@… new 10/31/13
#41104 otx can't compile ports 2.2.1 defect macports-tickets@… new 10/31/13
#41107 Apache-ivy fails to install on OS X Mavericks ports 2.2.1 defect macports-tickets@… new 11/01/13
#41153 php55-apache2handler: PHP scripts not running in Apache2 ports defect ryandesign@… new 11/03/13
#41166 gdb @7.6 Staging into destroot failed ports 2.2.1 defect stuartwesterman@… new 11/03/13
#41175 powerpc-rtems-gcc @4.2.3 doesn't compile with the default compiler in Mavericks ports 2.2.1 defect macports-tickets@… new 11/04/13
#41177 kdepimlibs4 fails to build on 10.6.8.1 / 2.2.1 ports 2.2.1 defect nicos@… new 11/04/13
#41199 gconf @2.32.4_3 does not build because of missing symbol _PyUnicodeUCS2_AsUTF8String in/opt/local/lib/gobject-introspection/giscanner/_giscanner.so ports 2.2.1 defect macports-tickets@… new 11/05/13
#41200 poppler 0.24.3_0 does not build because of missing symbol _PyUnicodeUCS2_AsUTF8String in/opt/local/lib/gobject-introspection/giscanner/_giscanner.so ports 2.2.1 defect devans@… new 11/05/13
#41202 qtiplot @0.9.8.9_7 crashes with segmentation fault: 11 ports 2.2.1 defect nicos@… new 11/05/13
#41241 vxl fails to build on OS X 10.9 Mavericks ports 2.2.1 defect macports-tickets@… new 11/06/13
#41248 bash @4.2.45_2 - Segmentation Fault when executing undefined command ports 2.2.1 defect raimue@… assigned 11/07/13
#41252 mysql-connector-java fails build on OSX Mavericks ports 2.2.1 defect macports-tickets@… new 11/07/13
#41267 amarok: Undefined symbols Playlists::M3UPlaylist::M3UPlaylist(KUrl const&) ports 2.2.1 defect macports-tickets@… new 11/08/13
#41282 wine: Assertion failed at address 0x000b:0x9938f952 (thread 0009), starting debugger... ports 2.2.1 defect ryandesign@… new 11/09/13
#41289 arpack @3.1.3: Undefined symbols ports 2.2.1 defect mmoll@… new 11/09/13
#41292 libvmime @0.9.1_1: error: unknown type name 'pthread_mutex_t' ports 2.2.1 defect macports-tickets@… new 11/10/13
#41293 rasmol @2.7.4.2: Imake.tmpl:2144:10: fatal error: ' X11 .rules' file not found ports 2.2.1 defect macports-tickets@… new 11/10/13
#41343 python extension module builds missing -I/opt/local/include ports 2.2.1 defect jwa@… new 11/12/13
#41344 vim: breaks with two Python versions ports 2.2.1 defect raimue@… assigned 11/12/13
#41355 Zenity @2.32.1_4 needs a fix after upgrade to libnotify @0.7.6_0 ports 2.2.1 defect devans@… new 11/13/13
#41360 gucharmap install fails, please help ports 2.2.1 defect devans@… new 11/13/13
#41366 gcc48: asan (address sanitizer) is broken ports 2.2.1 defect larryv@… assigned 11/14/13
#41372 Arpack can't find BLAS ports 2.2.1 defect mmoll@… new 11/14/13
#41378 Installing subversion-javahlbindings (1.8.4) fails on OS X 10.9 ports 2.2.1 defect dluke@… assigned 11/15/13
#41383 llvm-gcc42 executables link with /usr/lib/libstdc++ when libc++ is used by MacPorts ports 2.2.99 defect erickt@…, jeremyhu@… new 11/15/13
#41392 Virtualbox @4.2.14: failed to determine Darwin version ports defect macports-tickets@… new 11/16/13
#41394 vtk44 @4.4.2 Configure error - build failure ports 2.2.1 defect css@… new 11/16/13
#41401 root @5.34.11: configure: libX11 MUST be installed (on 10.5 PPC) ports defect jonesc@… new 11/16/13
#41417 libtorrent, libtorrent-devel: fatal error: 'tr1/functional' file not found ports 2.2.1 defect stuartwesterman@… new 11/18/13
#41418 mod_perl2 build is not affected by "configure.cflags-append -std=gnu89" ports defect macports-tickets@… new 11/18/13
#41425 tcpflow @1.4.2: SSL certificate problem, verify that the CA cert is OK ports 2.2.1 defect macports-tickets@… new 11/18/13
#41431 kdenlive fails to run on 10.9 if gavl is installed ports 2.2.1 defect mk@… new 11/18/13
#41434 magicpoint @1.13a - fatal error: ' X11 .rules' file not found ports 2.2.1 defect macports-tickets@… new 11/18/13
#41435 qemu @1.6.1 +target_sparc: Cocoa UI doesn't work for SPARC emulator. ports 2.2.1 defect raimue@… new 11/18/13
#41440 python27 +universal build fail ports 2.2.1 defect jwa@… new 11/18/13
#41468 angelscript: Inline asm clobbers must be last on the x87 stack ports 2.2.1 defect macports-tickets@… new 11/20/13
#41477 iRecovery @0.01 Git clone failed ports 2.2.1 defect blair@… new 11/20/13
#41480 socat @1.7.2.1 builds without tun/tap support ports 2.2.1 defect macports-tickets@… new 11/21/13
#41488 rbenv @0.4.0 fails to initialize shell completion ports 2.2.1 defect macports-tickets@… new 11/21/13
#41523 gtkwave misses dependency to gtk-osx-application, build fails for variant -x11 +no_x11 +quartz ports 2.2.1 defect macports-tickets@… new 11/24/13
#41529 Error: org.macports.build for port BGHUDAppKit returned: command execution failed ports 2.2.1 defect macports-tickets@… reopened 11/25/13
#41533 ocaml-lwt @2.4.3_1 – build failure ports 2.2.1 defect mww@… new 11/25/13
#41534 abiword @2.4.5: error: incomplete definition of type 'struct png_info_def' ports 2.2.1 defect macports-tickets@… new 11/25/13
#41536 arpack @3.1.3: configure failed ports 2.2.1 defect mmoll@… new 11/25/13
#41539 mysql-connector-java build depends on ant-contrib ports 2.2.1 defect macports-tickets@… new 11/25/13
#41541 py33-logilab-common installation failure ports 2.2.1 defect stromnov@… new 11/25/13
#41542 gnome-system-monitor @3.8.2.1_0 - application crashes when the Resources tab is selected ports 2.2.1 defect devans@… assigned 11/25/13
#41546 py33-psycopg2 +universal isn't universal ports 2.2.99 defect snc@… assigned 11/25/13
#41553 opencv @2.4.7_1 + enable cuda + configure error - build failure ports 2.2.1 defect stromnov@… new 11/26/13
#41592 Warning: configured user/group macports does not exist, will build as root base 2.2.1 defect macports-tickets@… new 11/28/13
#41595 php: SIZEOF_LONG needs to vary based on bitness ports 2.2.1 defect ryandesign@… new 11/28/13
#41610 portmidi @217 Can't find jni.h even though it exists ports 2.2.1 defect macports-tickets@… new 11/29/13
#41616 TightVNC @1.3.10_1 won't build on PPC Leopard because of bug in Xvnc/config/cf/Imake.rules file? ports 2.2.1 defect macports-tickets@… new 11/30/13
#41639 gnudatalanguage @0.9.4: error: call to 'isspace' is ambiguous ports 2.2.1 defect takeshi@… new 12/01/13
#41644 root5 @5.34.13: Undefined symbols: ___GLXEW_ARB_multisample (on 10.5 i386) ports defect jonesc@… new 12/01/13
#41648 gcc48: Bootstrap comparison failure ports 2.2.1 defect mww@… new 12/02/13
#41659 digikam crash-Very unstable ports 2.2.1 defect jan@… new 12/02/13
#41670 swi-prolog @6.6.0 build error: command execution failed ports 2.2.1 defect pmoura@… new 12/03/13
#41672 gdb 7 can't read mach-o-le files. gdb apple can. ports defect stuartwesterman@… new 12/03/13
#41678 v8 @3.23.15: undefined symbols v8::Isolate::ThrowException etc. ports 2.2.1 defect frodwith@… new 12/03/13
#41681 gramps: use app portgroup to add launcher ports 2.2.1 defect devans@… new 12/04/13
#41687 gcc48 @4.8.2 fortran does not work ports 2.2.1 defect mww@… new 12/04/13
#41709 Mac OS X- loading two sets of Qt binaries into the same process ports 2.2.1 defect jan@… new 12/05/13
#41731 R @3.0.2 installation fails to complete ports 2.2.1 defect kjell.konis@… new 12/08/13
#41738 unison +aqua @2.40.102_1 does not build on Mavericks ports 2.2.1 defect macports-tickets@… new 12/09/13
#41744 herrie @2.2_0: Error: some dependencies are missing <spiff/spiff_c.h> ports 2.2.1 defect macports-tickets@… new 12/09/13
#41749 gdb: dyld: Library not loaded @rpath/libCore.so ports 2.2.1 defect stuartwesterman@… new 12/10/13
#41750 py-mahotas and py-pymorph not available after install ports 2.2.1 defect stromnov@… new 12/10/13
#41752 binutils-2.24 fails to build on PPC Tiger because of "multiple definitions of symbol _filename_cmp" ports 2.2.99 defect macports-tickets@… new 12/10/13
#41755 mysql-connector-odbc @5.1.8_1 +universal build failure ports 2.2.1 defect pixilla@… new 12/10/13
#41766 py27-numpy @1.8.0_2 +atlas +gcc48 compile error - build failure ports 2.2.1 defect michaelld@… new 12/11/13
#41770 VisualBoyAdvance @1.7.2_2: error: redefinition of 'i' ports 2.2.1 defect jtonio@… new 12/11/13
#41787 wxmsw @2.8.4: +universal variant fails because i386-mingw32-w32api is not universal ports 2.2.1 defect macports-tickets@… new 12/12/13
1 2 3 4 5 6 7 8 9 10 11 12 13 14 15 16 17 18 19 20 21
Note: See TracReports for help on using and creating reports.