New Ticket     Tickets     Wiki     Browse Source     Timeline     Roadmap     Ticket Reports     Search

{8} Active Tickets, Mine first (3718 matches)

  • List all active tickets by priority.
  • Show all tickets owned by the logged in user in a group first.

Results (1801 - 1900 of 3718)

Active Tickets (100 matches)

Ticket Summary Component Version Milestone Type Owner Status Created
#44032 boost @0_1.55.0_6 Fails to create pkg ports 2.3.0 defect macports-tickets@… new 06/16/14
#44034 [arm-none-linux-gnueabi-gcc] Build Error Issue ports 2.3.0 defect stuartwesterman@… new 06/16/14
#44036 rspamd 0.4.4: archived binary, build broken, update to latest version 0.7.1. ports defect pixilla@… new 06/16/14
#44044 libnewt: add support for Python ports defect ryandesign@… new 06/17/14
#44049 enblend: fails to build on 10.6 ports defect hvdwolf@… new 06/17/14
#44050 codeblocks: runs autotools during `make all` ports defect mojca@… new 06/17/14
#44056 grass: upgrade to 7.0.0 ports defect macports-tickets@… new 06/17/14
#44058 texlive-bin will not build with -std=c++11 ports defect dports@… new 06/17/14
#44063 Unable to build dsniff on OS X 10.9.2 ports 2.3.0 defect cal@… new 06/18/14
#44065 libarchive opportunistically links with libnettle ports 2.3.99 defect toby@… new 06/18/14
#44068 serf1: building error on OSX 10.4 Server (PPC) ports 2.3.0 defect blair@… new 06/18/14
#44072 More sophisticated curl dependency ports 2.3.0 defect gardnermj@… new 06/18/14
#44073 root6: .demo doesn't work ports defect jonesc@… new 06/18/14
#44084 R fails to upgrade with fortran compiler error ports 2.3.0 defect kjell.konis@… new 06/19/14
#44088 centerim @4.22.10_1 Build Error ports 2.3.0 defect macports-tickets@… new 06/19/14
#44103 Coin: update information in the portfile, add livecheck, avoid /usr/X11R ports defect css@… new 06/21/14
#44108 simulavr @1.0.0_2: SWIG version >= 1.3.18 is required. You have 3.0.2. ports 2.3.0 defect landonf@… new 06/21/14
#44112 guile hangs on snarf-check-and-output-texi ports 2.3.0 defect macports-tickets@… new 06/22/14
#44124 postgis2: fatal error: 'json/json.h' file not found ports 2.3.0 defect vince@… new 06/23/14
#44129 cmake: fix build against libc++ on Lion ports defect css@… new 06/24/14
#44136 PyROOT with root6 ACLiC Issues ports defect jonesc@… new 06/24/14
#44141 apple-gcc42 has ${prefix}/include in default search path ports 2.3.0 defect jeremyhu@… new 06/25/14
#44159 pgAdmin3 @1.18.1_1 UI problems ports defect jwa@… new 06/26/14
#44162 openssl: configure prints usage message; configure args does not include compiler ports 2.3.0 defect mww@… new 06/27/14
#44165 Incomplete mpkg of gtk2 port ports 2.3.0 defect macports-tickets@… new 06/27/14
#44168 mkvtoolnix 7.0 crash on start ports defect macports-tickets@… new 06/27/14
#44198 libxslt: Failed to fetch signature for archive: The requested URL returned error: 400 Bad Request ports 2.3.0 defect macports-tickets@… new 06/30/14
#44201 mkvtoolnix build failure due to stray @ in NSObjCRuntime.h ports 2.3.1 defect macports-tickets@… new 07/01/14
#44206 py-readline broken for Python 3.4, upgrade to new gnureadline 6.3.3 ports 2.3.1 defect petr@… assigned 07/01/14
#44215 octave-signal: upfirdn.oct failure ports defect macports-tickets@… new 07/01/14
#44221 dot2texi: shell escape does not seem to work ports 2.3.1 defect snc@… new 07/02/14
#44224 root5: fails to compile with libc++ on 10.7 (error: no matching function for call to 'isnan') ports defect jonesc@… new 07/02/14
#44228 sbcl: failure to build in trace mode ports defect macports-tickets@… new 07/02/14
#44237 CMake @3.0.0_2: fails to configure when Gtk.framework exists (bug in FindGTK2.cmake) ports defect css@… new 07/04/14
#44240 tracelib: resource forks not handled correctly base 2.3.99 defect macports-tickets@… new 07/04/14
#44265 objc @3.2.8 Build Error ports 2.3.1 defect mww@… new 07/07/14
#44271 npm 1.4.20 fails with ENOENT, open '`pwd`/null' ports 2.3.1 defect ciserlohn@… new 07/07/14
#44274 gcc47 Issue? ports 2.3.0 defect mww@… new 07/07/14
#44279 screen 4.2.1_0 builds okay, but crashes with "Abort trap" ports 2.3.1 defect macports-tickets@… new 07/08/14
#44291 /opt/local/libexec/macports/bin/tclsh8.5 crashed when activating libgpg-error on PPC Leopard, Mac OS X 10.5.8 base 2.3.1 defect macports-tickets@… new 07/09/14
#44293 Tup needs to be updated to 0.7.2 ports 2.3.1 defect anatol.pomozov@… new 07/09/14
#44310 py-pyepl @1.0.29: fails to build ports 2.3.1 defect macports-tickets@… new 07/11/14
#44316 atlas. dyld: Symbol not found: _dlartg_ ports 2.3.1 defect vince@… new 07/12/14
#44322 clang-3.0: fatal error: 'arm/limits.h' file not found ports 2.3.1 defect jeremyhu@… new 07/13/14
#44326 msmtp: remove unused configure arg ports defect mww@… new 07/14/14
#44329 FileZilla: re-check dependencies ports defect mojca@… new 07/14/14
#44331 gstreamer010-gst-plugins-good @0.10.31 fails to activate due to missing gconftool-2 ports 2.3.1 defect macports-tickets@… new 07/14/14
#44334 octave @3.8.1: Cursor keys and command line history not working in the GUI ports 2.3.1 defect michaelld@… new 07/14/14
#44340 texlive-bin @2014 Configure error "-arch ppc" needs "--disable-luajittex" ports 2.3.1 defect dports@… assigned 07/15/14
#44347 Privoxy is launched to early ports 2.3.1 defect macports-tickets@… new 07/16/14
#44349 port install broken permission-wise ports 2.3.1 defect krischik@… new 07/16/14
#44353 rpm @ 4.4.9 segfault querying rpm files ports 2.3.1 defect afb@… new 07/16/14
#44355 opencv @2.4.9 - build failure: Undefined symbols for architecture x86_64: "_main", referenced from: start in crt1.10.6.o (And probable fix) ports 2.3.1 defect stromnov@… new 07/16/14
#44358 cairo crash on simple testcase ports 2.3.1 defect ryandesign@… new 07/17/14
#44381 Add port:flex to graphviz build dependencies ports 2.3.1 defect ryandesign@… new 07/19/14
#44384 libpaper fails to build on OS X Tiger ports 2.3.1 defect macports-tickets@… new 07/20/14
#44395 glib2, glib2-devel: don't add -I${prefix}/include to glib-2.0.pc ports 2.3.1 defect ryandesign@… new 07/21/14
#44398 kdelibs4 configure failure ports 2.3.99 defect nicos@… new 07/21/14
#44402 jpilot has missing dependencies ports defect kristian.peters@… new 07/22/14
#44405 Ports should require perl5.16 not perl5.12 ports defect macports-tickets@… new 07/22/14
#44406 faust, faust-devel, faust2-devel: builds partially universal when not asked to do so ports 2.3.99 defect ryandesign@… new 07/23/14
#44415 qmail-spamcontrol @2.5.19: fatal error: 'nameser8_compat.h' file not found ports 2.3.1 defect compconsultant@… new 07/23/14
#44417 p5-opengl: fails on buildbot; _RegisterApplication(), FAILED TO establish the default connection to the WindowServer ports defect macports-tickets@… new 07/24/14
#44418 p5-sgmlspm: fix installation ports defect tlockhart1976@… new 07/24/14
#44419 psfex: undefined symbols _plwid ports 2.3.1 defect Deil.Christoph@… new 07/24/14
#44444 gnutls fails to build when nawk is installed ports 2.3.1 defect mschamschula@… new 07/26/14
#44447 p5-eperl fails to build with perl5.16 (with patch) ports 2.3.1 defect cal@… new 07/26/14
#44453 libsdl_pango: fix dependencies ports defect macports-tickets@… new 07/26/14
#44459 Togl build can't find tkInt.h ports 2.3.1 defect macports-tickets@… new 07/27/14
#44460 atlas @3.10.2+gcc48 fails to build on PPC ports 2.3.1 defect macports-tickets@… new 07/27/14
#44464 docbook-utils: build failure ("X21B6" is not a function name) ports defect tlockhart1976@… new 07/27/14
#44477 mysql56: check failed: 'field[1].type == MYSQL_TYPE_BLOB' ports 2.3.1 defect pixilla@… new 07/29/14
#44480 openjade 1.3.2_8 link: cannot find the library `/usr/lib/libiconv.la' ports 2.3.1 defect tlockhart1976@… new 07/29/14
#44481 Harmonize database variants ports 2.3.1 defect ryandesign@… new 07/29/14
#44484 Harmonize database variants ports 2.3.1 defect macports-tickets@… new 07/29/14
#44485 Compile Error in Open (GNU) Cobol when compiling in OS 10.9 Mavericks ( New Install ) ports 2.3.1 defect egall@… new 07/29/14
#44490 poppler: build appears to hang before completion ports defect devans@… assigned 07/29/14
#44495 Error installing kde, kile ports 2.3.1 defect macports-tickets@… new 07/30/14
#44496 startupitem_install not respected when installing from binary archive base 2.3.1 defect macports-tickets@… new 07/30/14
#44502 gnome-terminal install fails due to dependency on coreutils::gmkdir ports defect devans@… assigned 07/30/14
#44509 selfupdate tried to tell me to run selfupdate again ports 2.3.1 defect macports-tickets@… new 07/31/14
#44530 help for most actions has disappeared base 2.3.99 defect cal@… new 08/03/14
#44533 atlas +gcc48 does not build ports 2.3.1 defect vince@… new 08/03/14
#44547 phantomjs fails to build ports 2.3.1 defect stromnov@… new 08/05/14
#44549 Overriding autoreconf.cmd/autoconf.cmd/automake.cmd should delete default autoreconf.args/autoconf.args/automake.args base 2.3.99 defect macports-tickets@… new 08/05/14
#44550 crystfel @0.5.3a: error: variable has incomplete type 'struct termios' ports 2.3.1 defect rkirian@… new 08/05/14
#44553 atlas @3.10.2_1+Failed to install atlas ports 2.3.1 defect vince@… new 08/06/14
#44565 upnp-inspector @0.2.2 does not show any devices ports defect devans@… assigned 08/07/14
#44566 fontconfig: fc-cache fails on AFP/SMB homes, cache rebuilt on every launch ports 2.3.1 defect ryandesign@… new 08/07/14
#44572 org.macports.fetch for port antlr3 returned: fetch failed ports 2.3.1 defect macports-tickets@… new 08/08/14
#44575 mariadb @5.5.39 error "No LG_QUANTUM definition for architecture; specify via CPPFLAGS" ports 2.3.1 defect pixilla@… new 08/08/14
#44580 p5-unicode-linebreak: use /usr/bin/ar instead of ${prefix}/bin/ar ports defect macports-tickets@… new 08/08/14
#44605 gpsim @0.26.1_1: addition of default argument on redeclaration makes this constructor a default constructor ports 2.3.1 defect macports-tickets@… new 08/11/14
#44608 netcdf @4.3.2 error: expected declaration specifiers or '...' before 'off_t' ports 2.3.1 defect takeshi@… new 08/11/14
#44612 Python error while using pip with py33-virtualenv ports 2.3.1 defect macports-tickets@… new 08/11/14
#44616 Glom will not build with +quartz option ports 2.3.1 defect landonf@… new 08/11/14
#44624 vim+universal+ruby18 fails to build because of missing rb_num2uint symbol in i386 slice of libruby.dylib ports 2.3.1 defect raimue@… new 08/12/14
#44627 ceres-solver @1.9.0 library segfaults ports 2.3.1 defect mmoll@… new 08/13/14
#44634 alpine @2.00_5: build fails with duplicate function declaration ports 2.3.99 defect macports-tickets@… new 08/13/14
#44638 doxygen @1.8.7: build fails with old python ports 2.3.1 defect css@… new 08/13/14
Note: See TracReports for help on using and creating reports.