New Ticket     Tickets     Wiki     Browse Source     Timeline     Roadmap     Ticket Reports     Search

{8} Active Tickets, Mine first (3913 matches)

  • List all active tickets by priority.
  • Show all tickets owned by the logged in user in a group first.

Results (501 - 600 of 3913)

1 2 3 4 5 6 7 8 9 10 11 12 13 14 15 16

Active Tickets (100 matches)

Ticket Summary Component Version Milestone Type Owner Status Created
#32916 rabbitmq-server: launchctl script does not match created node ports 2.0.3 defect meyer@… new 01/17/12
#32919 arq_restore installs binaries into applications_dir ports 2.0.3 defect singingwolfboy@… new 01/18/12
#32957 ocamlsdl does not apply a needed patch ports 2.0.3 defect mww@… new 01/20/12
#32967 cvsps needs to be UsingTheRightCompiler ports defect macports-tickets@… new 01/21/12
#32994 build of valgrind 3.7.0 on Leopard fails; gcc version not detected properly ports 2.0.3 defect raimue@… assigned 01/23/12
#33008 gmic: update to 1.5.0.9 ports 2.0.3 defect assemlal@… new 01/24/12
#33045 cadabra: build fails with clang ports 2.0.3 defect macports-tickets@… new 01/28/12
#33065 sbcl @1.0.55 will not build on PPC under leopard 10.5.8 ports 2.0.3 defect easieste@… new 01/30/12
#33088 xemacs 21.4.22_4 crash when entering font-lock-mode ports 2.0.3 defect macports-tickets@… new 01/31/12
#33099 amarok: dyld: Symbol not found: __ZN6Amarok20qt_mac_set_dock_menuEP5QMenu ports 2.0.3 defect macports-tickets@… new 02/01/12
#33156 x264 @20111023 +universal Build failure - MMX error on i386 ports 2.0.3 defect devans@… new 02/06/12
#33166 fortune: limerick data file contains offensive fortunes ports 2.0.3 defect stuartwesterman@… new 02/06/12
#33187 kdeinit4 doesn't start: complains about dbus not running ports 2.0.3 defect macports-tickets@… new 02/07/12
#33193 mysql5-server: sudo port load: child killed: trace trap ports 2.0.3 defect ryandesign@… new 02/08/12
#33231 ccaudio @1.1.1 build failure ports 2.0.3 defect macports-tickets@… new 02/12/12
#33262 GTK2 build fails in 10.4.11 because system CUPS is too old ports 2.0.3 defect macports-tickets@… reopened 02/15/12
#33270 php5 build failure with distcc? ports 2.0.3 defect ryandesign@… new 02/16/12
#33292 Amarok @2.4.3 will not build! ports 2.0.3 defect macports-tickets@… new 02/18/12
#33299 --with-macports-user also sets the group base 2.0.3 defect macports-tickets@… new 02/19/12
#33326 cyrus-sasl2 @2.1.23 +universal +kerberos: libsasl2.la differs and cannot be merged ports 2.0.3 defect macports-tickets@… new 02/22/12
#33335 Pallet doesn't work (nothing happens); no documentation ports 2.0.3 defect macports-tickets@… new 02/23/12
#33341 android @16 Problem with permissions folder ports 2.0.3 defect krischik@… new 02/23/12
#33343 encoding x264 with ffmpeg does not use CPU capabilities on 64bit 10.7.3 ports 2.0.3 defect devans@… new 02/23/12
#33370 wget should use curl-ca-bundle by default ports 2.0.3 defect ryandesign@… new 02/27/12
#33382 gdbm @1.10 build failure ports 2.0.3 defect macports-tickets@… new 02/27/12
#33387 kbuildsycoca4 error 88500 after installing kdewebdev ports 2.0.3 defect nicos@… new 02/27/12
#33428 gcc44 @4.4.6: malloc.h: No such file or directory ports 2.0.4 defect mww@… new 02/29/12
#33474 AbiWord: ssize_t not defined? ports 2.0.4 defect macports-tickets@… new 03/04/12
#33475 gcc46 4.6.3 internal compiler error: in objc_eh_runtime_type ports 2.0.4 defect mww@… new 03/04/12
#33477 selfupdate failed from 2.0.3 to 2.0.4 @ 10.6.8, xcode 3.2 base 2.0.3 defect macports-tickets@… new 03/05/12
#33486 mysql5 doesn't start ports 2.0.4 defect ryandesign@… new 03/05/12
#33522 tovid package does not currently work ports 2.0.4 defect macports-tickets@… new 03/07/12
#33545 bullet: The following variables are used in this project, but they are set to NOTFOUND: OPENCL_LIBRARY ports 2.0.4 defect stromnov@… new 03/08/12
#33561 gcc48: Selecting 'mp-gcc48' for 'gcc' failed ... gcj": target ports 2.0.4 defect mww@… new 03/09/12
#33613 criticalmass: memalloc errors ports 2.0.4 defect macports-tickets@… new 03/13/12
#33647 perl p5 ports: 5.12.3: no such file or directory ports 2.0.4 defect macports-tickets@… new 03/16/12
#33658 gcc47 @4.7-20120225 on 10.5.8 PPC - internal compiler error ports 2.0.4 defect mww@… new 03/17/12
#33673 libpqxx: tests don't work ports 2.0.4 defect macports-tickets@… new 03/18/12
#33684 autogen 5.15 fails shell.hlp test case on case-insensitive filesystems ports 2.0.4 defect mww@… new 03/19/12
#33696 ffmpeg: Cannot build with XCode 4.3.1 for 64 bit ports 2.0.4 defect devans@… new 03/20/12
#33697 Incomplete uninstall script guide defect macports-tickets@… new 03/20/12
#33701 LyX spotlight plugin can't be loaded ports 2.3.99 defect khindenburg@… new 03/20/12
#33708 cuneiform @1.1.0_0 Error during execution: Abort trap: 6 ports 2.0.4 defect macports-tickets@… new 03/21/12
#33714 Awesome @3.4.11: cannot find default config ports 2.0.4 defect macports-tickets@… new 03/21/12
#33720 Cannot use non-ascii in the Python interactive shell ports 2.0.4 defect macports-tickets@… new 03/22/12
#33732 ccl 1.7.1 fails to compile on darwin 9.8.0 ports 2.0.4 defect easieste@… new 03/23/12
#33757 ipe @7.1.2 (graphics); build fails on image.o ports 2.0.4 defect m.thon@… new 03/25/12
#33766 cherokee: universal variant fails ports 2.0.4 defect michael@… new 03/26/12
#33767 cherokee links with libraries it doesn't declare dependencies on ports 2.0.4 defect michael@… new 03/26/12
#33772 texinfo: cannot display the flex documentation ports 2.0.4 defect macports-tickets@… new 03/26/12
#33788 exact-image looks for X11 in /usr/X11 ports defect macports@… new 03/27/12
#33792 libbonobo: ../idl/Bonobo.idl compilation failed ports 2.0.4 defect macports-tickets@… new 03/27/12
#33802 gtk2 build failure on 10.8: incomplete definition of type 'struct _ipp_s' ports 2.0.4 defect macports-tickets@… new 03/28/12
#33827 cairo: Undefined symbols _cairo_boilerplate_get_target_by_name _cairo_boilerplate_xrealloc _cairo_boilerplate_xmalloc, and links with libraries it doesn't declare dependencies on ports 2.0.4 defect ryandesign@… reopened 03/30/12
#33830 evince and gv both fail to display PostScript correctly ports 2.0.4 defect macports-tickets@… new 03/30/12
#33831 binutils: gnm reports negative symbol sizes ports 2.0.4 defect macports-tickets@… new 03/30/12
#33857 InsightToolkit: error: use of undeclared identifier 'equal' ports 2.0.4 defect macports-tickets@… new 04/01/12
#33859 p5.12-gtk2 does not compile on MacOS X Lion ports 2.0.4 defect macports-tickets@… new 04/02/12
#33860 sword: error: use of undeclared identifier 'find' ports 2.0.4 defect macports-tickets@… new 04/02/12
#33886 Startx script cannot handle fake domain names on PPC Tiger? ports 2.0.4 defect macports-tickets@… new 04/03/12
#33930 Ignore consequences of broken DNS servers base 2.0.4 defect ryandesign@… reopened 04/07/12
#33932 Erroneous "Missing subversion property on Portfile" error base 2.0.99 defect macports-tickets@… new 04/08/12
#33989 VTK: error: 'strcmp' was not declared in this scope ports 2.0.4 defect css@… new 04/10/12
#33998 no kdepim4 application work. ports 2.0.4 defect macports-tickets@… new 04/11/12
#34012 openal: error: 'CAStreamBasicDescription.h' file not found ports 2.0.4 defect macports-tickets@… new 04/12/12
#34063 pear-XML_Util- installer/bin/pear: No such file or directory ports 2.0.4 defect pixilla@… new 04/15/12
#34098 Cairo Build Issue ports 2.0.4 defect ryandesign@… new 04/17/12
#34124 openal: update to latest version ports defect macports-tickets@… new 04/19/12
#34129 groff @1.21_2 build failure: "fatal error: invalid device `html'" ports 2.0.4 defect macports-tickets@… new 04/19/12
#34183 gst-plugins-ugly @0.10.19_2 missing headers ports 2.0.4 defect macports-tickets@… new 04/23/12
#34186 evince @2.30.3 configure failure: "PDF support is disabled since poppler-glib library version 0.12.0 or newer not found" ports 2.0.4 defect devans@… new 04/23/12
#34212 liblrdf compilation problems ports 2.0.4 defect pixilla@… new 04/25/12
#34215 gst-plugins-base @0.10.36_1 +universal destroot failure ports 2.0.4 defect macports-tickets@… new 04/25/12
#34224 n2n: subversion check out failed, certificate issued for a different hostname ports 2.0.4 defect msmk@… new 04/25/12
#34228 php5: fsockopen don't work since php 5.3.10, with openssl 1.0.1b_0 ports 2.0.4 defect ryandesign@… new 04/26/12
#34231 ImageMagick: should not depend on pango + fix openMP ports 2.0.4 defect ryandesign@… new 04/27/12
#34256 tex-whizzytex @1.3.1 Configure failure: "Cannot run initex with any of the formats: latex latex" ports 2.0.4 defect macports-tickets@… new 04/29/12
#34264 digikam: Undefined symbols for architecture x86_64 ports 2.0.4 defect jan@… new 04/30/12
#34271 python27 2.7.3_0 py27-gtk 2.22.0_1 etc -- pkg-config files not installed correctly for python 2.6 and 2.7 versions of pygtk and pygobject ports 2.0.4 defect macports-tickets@… new 04/30/12
#34305 VTK: error: ‘FSSpec’ has no member named ‘name’ ports 2.0.4 defect css@… new 05/02/12
#34308 pkgconfig: Undefined symbols ports 2.0.4 defect ryandesign@… new 05/02/12
#34339 gdal +framework variant fails to install ports 2.0.4 defect vince@… new 05/04/12
#34383 curl @7.25.0 SFTP fails with "Failure establishing ssh session" (2) ports 2.0.4 defect ryandesign@… new 05/09/12
#34389 strategoxt fails to install ports 2.0.4 defect macports-tickets@… new 05/09/12
#34403 rpm activation fails on buildbot: __init__.py already exists ports 2.0.4 defect afb@… reopened 05/10/12
#34407 glw: libtool: link: require no space between `-L' and `-lXft' ports 2.0.4 defect css@… new 05/10/12
#34412 apt will not compile at the end ports 2.0.4 defect landonf@… new 05/11/12
#34415 dbus-devel: build fails ports 2.0.4 defect pixilla@… new 05/11/12
#34417 nu2: fatal error: 'Foundation/Foundation.h' file not found ports 2.0.4 defect macports-tickets@… new 05/11/12
#34427 playerstage-player: build uses /Library/Frameworks/Python.framework, fails ports 2.0.4 defect vincent@… new 05/12/12
#34447 freeciv 2.3.2 not compiling with global variants set to -x11 +no_x11 ports 2.0.4 defect macports-tickets@… new 05/14/12
#34470 xgraph segmentation fault ports 2.1.0 defect ryandesign@… assigned 05/16/12
#34502 ogre@1.7.3 - pbxcp command execution failed, build failed. ports 2.1.0 defect marin@… assigned 05/18/12
#34538 Soprano 2.7.4 fails to build with wrong-arch iodbc.framework in /Library/Frameworks ports 2.1.1 defect pixilla@… new 05/20/12
#34539 ophcrack: add fast and small variants ports 2.1.1 defect macports-tickets@… new 05/20/12
#34548 dansguardian doesn't start anymore since upgrade to macports 2.1.0 ports 2.1.1 defect macports-tickets@… new 05/20/12
#34566 unison: uigtk2.cmx and /opt/local/lib/ocaml/lablgtk2/lablgtk.cmxa make inconsistent assumptions over implementation GtkSignal ports 2.1.1 defect macports-tickets@… new 05/21/12
#34572 samba3 @3.6.5 fails to initialize on startup ports 2.1.1 defect macports-tickets@… new 05/21/12
#34592 ImageMagick: do not link with linkclparser.dylib on Snow Leopard ports 2.1.1 defect ryandesign@… new 05/23/12
#34639 gdc @0.24 Build failure due to redefinition of functions ports 2.1.1 defect mww@… new 05/27/12
1 2 3 4 5 6 7 8 9 10 11 12 13 14 15 16
Note: See TracReports for help on using and creating reports.