New Ticket     Tickets     Wiki     Browse Source     Timeline     Roadmap     Ticket Reports     Search

Timeline


and

06/25/10:

23:05 Ticket #25427 (encfs-1.5 Update to current stable release 1.6) created by Markus.Ueberall@…
From the original 1.6.0 (July 17, 2010) Change Log: * allow symlink …
20:10 Ticket #25366 (json_spirit 4.03 Port Submission) closed by snc@…
fixed: Committed in r69158.
20:09 Changeset [69158] by snc@…
add json_spirit, #25366
19:44 Ticket #25370 (Update py26-south to 0.7.1) closed by snc@…
fixed: Committed in r69157. Maintainer timeout.
19:43 Changeset [69157] by snc@…
update version, #25370. maintainer timeout
19:08 Ticket #25426 (GNUplot is not interacting properly with AuqaTerm) created by fehmtf@…
I installed gnuplot and aquaterm using macport. i got no errors during …
13:43 Ticket #25425 (vte patch phase fails when gtk2 is installed +no_x11) created by kthenriksson@…
The patch does not apply cleanly but also is not needed. The patch lines …
12:42 Changeset [69156] by jeremyhu@…
xterm: Don't list the sha256 hash since it's not yet supported. #25416
12:24 Ticket #25424 (gimp2 update to 2.6.9) created by sewebster@…
Patch to portfile attached to update to 2.6.9. If applied the gimp …
10:25 Ticket #25423 (gettext-0.18.1.1 configure failure: bad option # - build failure) created by jolz@…
I have Leopard Mac OS X 10.5.8 with XCode 4.1.3. build log: […] …
10:16 Ticket #25422 (libcroco fails to find glib2) created by snc@…
[…]
10:08 Ticket #25419 (readline does not provide /opt/local/lib/libreadline.dylib) closed by snc@…
worksforme: Alrighty.
09:43 Ticket #25269 (gimp: version should be bumped to 2.6.8) closed by snc@…
fixed: Updated in r69154. Since 2.6.9 is out, I also added a reminder in gimp2 to …
09:42 Changeset [69155] by snc@…
add reminder to bump metapackage version
09:41 Changeset [69154] by snc@…
bump metapackage version to match actual package, #25269
09:38 Ticket #25271 (upgrade py26-pywavelets to 0.2.0) closed by snc@…
fixed: Updated in r69152. Maintainer timeout.
09:38 Changeset [69153] by snc@…
whitespace
09:37 Changeset [69152] by snc@…
update version, #25271. Maintainer timeout
09:19 Changeset [69151] by snc@…
whitespace
09:18 Ticket #25323 (tcpdump: update to 4.1.1) closed by snc@…
fixed: Updated in r69150.
09:17 Changeset [69150] by snc@…
update version, #25323. Maintainer timeout.
09:07 Changeset [69149] by singingwolfboy@…
New port: rb19-metric_fu
08:57 Ticket #25421 (t1lib +psdoc: recursive dependency with texlive) created by dports@…
t1lib's +psdoc variant depends on texlive to build documentation: […] …
08:14 Ticket #25420 (grantlee 0.1.1 - new port) created by emanuel@…
New port for grantlee 0.1.0 attached.
08:02 Ticket #25346 (mapnik: mapnik.has_pycairo is False) closed by snc@…
fixed: Committed in r69148.
08:01 Changeset [69148] by snc@…
fix cairo includes, #25346
06:53 Ticket #25419 (readline does not provide /opt/local/lib/libreadline.dylib) created by thomas@…
Here's what I get when trying to install mysql5: […] The dependencies …
04:34 Ticket #25418 (mpfr upgrade failure: "Patch file patch01 is missing" on Snowleopard ...) created by nilstec_inc@…
[…]
04:28 Ticket #25417 (t1lib did not build /opt/local/lib/libt1.dylib) created by nilstec_inc@…
[…]
01:33 Ticket #25416 (xterm-260: checksum errors during build) created by trond.kandal@…
gcc version 4.2.1 (Apple Inc. build 5659) MacOSX 10.6.4 […]
01:05 Changeset [69147] by takanori@…
opensync: - unbreak with swig 2.0.0 - applied …

06/24/10:

21:19 Changeset [69146] by ryandesign@…
dash: make pkgconfig a build dep not a library dep
21:15 Ticket #25415 (dash universal variant fails) created by ryandesign@…
On Snow Leopard at least, the universal variant of dash fails: […] …
18:45 Ticket #25347 (Portfile for net/openconnect (new)) closed by snc@…
fixed: I also fixed the maintainer line. Committed in r69145.
18:45 Changeset [69145] by snc@…
add openconnect, #25347
18:30 Ticket #25414 (Can't selfupdate (as in Ticket #20559)) closed by jmr@…
invalid: Filesystem corruption or failing hardware are two possibilities that …
18:17 Ticket #24653 (munin: update to 1.4.4) closed by jmr@…
fixed: r69144 (maintainer timeout)
18:17 Changeset [69144] by jmr@…
munin: update to 1.4.4 (#24653, maintainer timeout)
18:10 Changeset [69143] by takeshi@…
hdfeos5: create shared libraries
18:08 Ticket #25413 (cfitsio checksum) closed by ram@…
fixed: fixed in r69142, thanks
18:07 Changeset [69142] by ram@…
science/cfitsio: stealth update :-( closes #25413
16:51 Changeset [69141] by jrozner@…
fixed spelling error for supplemental categories
16:46 Changeset [69140] by jrozner@…
removed undeeded routes
15:44 Changeset [69139] by jmr@…
cfitsio: fix gcc44 variant description
15:37 Ticket #25412 (libcaca-0.9_1 +x11 configure: error: cannot find X11 development files) closed by jmr@…
fixed: r69138
15:36 Changeset [69138] by jmr@…
libcaca: fix X11 detection (#25412)
13:59 Ticket #25348 (Portfile for dash (new)) closed by snc@…
fixed: Committed in r69134. Note there are lots of extra lines in your Portfile …
13:58 Changeset [69137] by snc@…
condense master_sites
13:57 Changeset [69136] by snc@…
whitespace
13:55 Changeset [69135] by snc@…
expand checksums, remove superfluous lines
13:52 Changeset [69134] by snc@…
add dash, #25348
13:39 Changeset [69133] by kimuraw@…
lang/ruby19: add patch to solve SocketError at TCPServer.open("localhost", …
13:20 Ticket #25414 (Can't selfupdate (as in Ticket #20559)) created by zullil@…
Tried to selfupdate from 1.8.2. Have OS X 10.6.4 and Developer …
12:39 Ticket #25413 (cfitsio checksum) created by mrtoftrash@…
Checksum for cfitsio3250.tar.gz from heasarc.gsfc.nasa.gov seems to be …
12:03 Ticket #19399 (webalizer 2.01-10 - port pkg does not incorporate all libs) closed by macsforever2000@…
worksforme
11:15 Changeset [69132] by snc@…
ui_msg to notes
11:11 Ticket #25412 (libcaca-0.9_1 +x11 configure: error: cannot find X11 development files) created by gvibe06@…
In Feb 2009...someone committed a change to libcaca requiring xorg-libX11 …
11:10 Changeset [69131] by snc@…
update version, restrict archs, #25405
11:08 Ticket #25411 (Update webalizer version to 2.21-02) created by mike.mclean@…
Patch attached which: * Updates webalizer to 2.21-02 * Updates the …
10:01 Changeset [69130] by dports@…
lynx: update to 2.8.7rel1
09:01 Changeset [69129] by snc@…
update version, add patches for weird getopt issues
07:30 Ticket #25410 (Update source-highlight to v3.1.4) closed by dports@…
fixed: Committed in r69128. Thanks!
07:30 Changeset [69128] by dports@…
source-highlight: update to v3.1.4 (#25410)
07:09 Ticket #25410 (Update source-highlight to v3.1.4) created by mike.mclean@…
Trivial patch to update source-highlight to current version
07:02 Ticket #25409 (py26-numpy fails during 'port upgrade') created by ssteinerX@…
After hours of chugging through upgrading all my ports (it's been a …
06:23 Ticket #25403 (mumble, murmur: build fails with "sed: can't read : No such file or ...) closed by ryandesign@…
fixed: Fixed in murmur in r69127.
06:22 Changeset [69127] by ryandesign@…
murmur: update to 1.2.2; add protobuf-cpp dependency; use 'reinplace' …
05:54 Changeset [69126] by kimuraw@…
lang/ruby: upgrade to 1.8.7-p299 - refactoring patch-bug15528.diff …
05:32 Ticket #25408 (ice-cpp: Exception.cpp:18:24: error: execinfo.h: No such file or directory) created by ryandesign@…
ice-cpp failed to build on my Tiger i386 machine. Log attached.
05:22 Ticket #25407 (gcc44 installation fails (sqlite error)) created by vinc17@…
On Mac OS X Tiger, with MaPorts 1.9.1: […] I support that this is a …
04:58 Ticket #25406 (murmur +universal ignores universal_archs; always uses ppc i386) created by ryandesign@…
murmur 1.1.8 on Mac OS X 10.6.4 x86_64 […]
04:41 Changeset [69125] by ryandesign@…
murmur: remove slash before ${prefix}; ${prefix} already begins with a …
04:35 Changeset [69124] by ryandesign@…
murmur: share the dist_subdir with mumble, since they use the same …
04:34 Changeset [69123] by ryandesign@…
mumble: remove a "sed" call which is no longer necessary in this version; …
04:03 Changeset [69122] by ryandesign@…
mumble: remove unnecessary directives
03:52 Changeset [69121] by ryandesign@…
mysql5-server, mysql5-server-devel: noarch
03:49 Changeset [69120] by ryandesign@…
pure-csv: update to 0.8
03:41 Changeset [69119] by ryandesign@…
xdotool: update to 2.20100623.2954 and fix formatting of notes
03:15 Ticket #25405 (mumble: update to 1.2.2) created by ryandesign@…
mumble should probably be updated to version 1.2.2. …
03:06 Ticket #25121 (Cannot launch kmymoney2 - dyld: Library not loaded: ...) closed by ryandesign@…
invalid: Closing due to lack of response. If rebuilding kdelibs3 did not solve this …
02:39 Ticket #25404 (mumble universal variant fails) created by ryandesign@…
mumble has a universal variant but it fails to even attempt to install …
01:58 Ticket #25403 (mumble, murmur: build fails with "sed: can't read : No such file or ...) created by Damien@…
Default variants are : +ipv6 +quartz +no_x11 -x11 +nls +tls +ssl …
01:49 Ticket #25402 (pinentry 0.8.0: add qt4 variant) created by emanuel@…
Variant qt4 added for pinentry version 0.8.0. Portfile patch attached.
01:30 Ticket #25401 (replaced ports are not deactivated automatically when the first conflict ...) created by vinc17@…
When trying to upgrade py25-numpy: […] However …
01:29 Ticket #25393 (py26-pip Patch to update Portfile from 0.6.3 to 0.7.2) closed by arthurk@…
fixed: Fixed in r69118. Thanks!
01:28 Changeset [69118] by arthurk@…
update py/py25/py26-pip to 0.7.2. fixes #25393
01:13 Ticket #25400 (sqlite error: database is locked) created by vinc17@…
Since MacPorts 1.9.x (at least 1.9.1), I sometimes get errors like […] …

06/23/10:

23:36 Ticket #25399 (problem when installing geany IDE) created by ramamneh@…
mac version 10.5.8 MacPorts 1.9.1 (installed from source) I got …
22:48 Changeset [69117] by jmr@…
when printing checksums line that matches the distfiles after a checksum …
22:43 Changeset [69116] by jmr@…
py26-sphinx: update to 0.6.7
21:02 Ticket #25365 (gnudatalanguage failing to build on snowleopard) closed by jmr@…
duplicate: #25312
19:20 Ticket #25398 (Errors install python25 on OSX 10.6 - xorg-util-macros dependecy fails) closed by jmr@…
duplicate
18:09 Ticket #25397 (qd-2.3.11 update) closed by ryandesign@…
fixed: Thanks, committed in r69115.
18:09 Changeset [69115] by ryandesign@…
qd: maintainer update to 2.3.11; see #25397
17:42 Ticket #25398 (Errors install python25 on OSX 10.6 - xorg-util-macros dependecy fails) created by jskopek@…
I seem to be unable to install python25 on a fresh installation of OSX …
17:09 Ticket #25394 (Gimp-app fails to build on OS X 10.6.4 with simple "port install gimp") closed by jmr@…
invalid: It didn't work in the first place because there was a bug in the old …
17:08 Ticket #25397 (qd-2.3.11 update) created by brad.froehle@…
Maintainer update for devel/qd. The diff to the Portfile is attached.
17:07 Ticket #25396 (xorg-util-macros 1.9.0 checksum problem) closed by ricci@…
fixed: resolved in r69114 by commenting out the sha256 checksum (doesn't work in …
17:06 Changeset [69114] by ricci@…
remove sha256 checksum as it does not work in MP 1.9.1. resolves #25396
16:33 Changeset [69113] by vinc17@…
Bump to version 3.0.0-p1.
16:12 Ticket #25396 (xorg-util-macros 1.9.0 checksum problem) created by sewebster@…
[…]
15:37 Changeset [69112] by snc@…
update version
15:12 Ticket #25394 (Gimp-app fails to build on OS X 10.6.4 with simple "port install gimp") reopened by ssteinerX@…
Ok, so I'm clearly an idiot, any moron should know that. Where does this …
15:11 Changeset [69111] by snc@…
update version
14:54 Changeset [69110] by ricci@…
move patch-hints_darwin.diff to patch-hints_darwin.sh.diff
14:40 Changeset [69109] by jeremyhu@…
xorg-util-macros: Bump to 1.9.0
14:39 Changeset [69108] by jeremyhu@…
xterm: Bump to version 260
14:37 Changeset [69107] by jmr@…
clean up formatting of conflicts message
14:31 Changeset [69106] by jmr@…
merge r69105 from trunk: check for conflicts when running activate target …
14:29 Ticket #25386 (conflicts aren't being detected) closed by jmr@…
fixed: r69105
14:29 Changeset [69105] by jmr@…
check for conflicts when running activate target (#25386)
14:15 Ticket #25389 (texlive-fontutils and t1utils conflict) closed by dports@…
fixed: Fixed in r69104 for texlive-fontutils and texlive-bin-extra. t1utils, …
14:13 Changeset [69104] by dports@…
texlive-bin-extra, texlive-fontutils: do not install manpages for binaries …
14:08 Ticket #25394 (Gimp-app fails to build on OS X 10.6.4 with simple "port install gimp") closed by jmr@…
invalid: You're clearly not using the current version of the port since your output …
13:54 Changeset [69103] by ricci@…
update hints/darwin.sh patchfile so it sets a better …
12:38 Ticket #25392 (texlive-basic @15576_1+doc fails to activate) closed by ram@…
worksforme: Replying to dports@…: > Any idea why it was there? It should …
12:24 Ticket #20920 (texlive_base fails to build when icu is installed) closed by dports@…
fixed: Replying to dports@…: > The TeX Live 2009 update is in, and I …
12:23 Ticket #25369 ("texlive -doc" installs documentation) closed by dports@…
fixed: Fixed in r69102
12:23 Changeset [69102] by dports@…
texlive-1.0 portgroup: fix removedocdepends by calling depends_lib-delete …
12:23 Changeset [69101] by ricci@…
move patch-hints_darwin.diff to patch-hints_darwin.sh.diff
12:19 Changeset [69100] by ricci@…
update hints/darwin.sh patchfile so it sets a better …
11:35 Ticket #25378 (texlive-bin: libjpeg.7.dylib not found) closed by dports@…
worksforme: Well, that's one way to fix it! Probably not the worst, either, given the …
10:24 Ticket #25395 (add gcc45 variant to py26-numpy) created by jabronson@…
I have gcc45 installed but not gcc43 or gcc44. I'd like to install numpy …
10:22 Ticket #25394 (Gimp-app fails to build on OS X 10.6.4 with simple "port install gimp") created by ssteinerX@…
Lots of sloppy coding warnings but those are probably not macports …
09:55 Ticket #25393 (py26-pip Patch to update Portfile from 0.6.3 to 0.7.2) created by list@…
Patch included updates Portfile for py26-pip to 0.7.2, the latest as of …
09:32 Changeset [69099] by jeremyhu@…
xorg-libXfont: Bump to 1.4.2
09:10 Ticket #25392 (texlive-basic @15576_1+doc fails to activate) created by ram@…
I'm trying to install texlive +full on a PPC Leopard machine and …
09:03 Changeset [69098] by jwa@…
version bump to 2.7rc2
08:52 Ticket #25391 (Update Guide to document support for bzr as fetch.type) created by mike.mclean@…
Closed ticket:23436 added bzr as a supported fetch.type. Update Section …
08:45 Changeset [69097] by singingwolfboy@…
New port: rb19-flay
08:37 Changeset [69096] by singingwolfboy@…
New port: rb19-flog
08:31 Changeset [69095] by singingwolfboy@…
New port: rb19-reek
08:30 MacPortsGUI_GSoC2010_Improvement edited by tzikis@…
(diff)
08:24 Changeset [69094] by singingwolfboy@…
New port: rb19-roodi
08:14 Changeset [69093] by singingwolfboy@…
New port: rb19-rails_best_practices
08:12 Ticket #25390 (Asymptote fail to build (missing texinfo.tex)) created by valerio@…
I tried to build asymptote resulting in an error message: […] By log …
08:06 Changeset [69092] by singingwolfboy@…
Added license line for rb19-ruby2ruby
08:04 Changeset [69091] by singingwolfboy@…
New port: rb19-ruby2ruby
07:54 Changeset [69090] by singingwolfboy@…
New port: rb19-churn
07:48 Changeset [69089] by singingwolfboy@…
New port: rb19-chronic
07:43 Changeset [69088] by singingwolfboy@…
New port: rb19-main
07:35 Changeset [69087] by singingwolfboy@…
New port: rb19-arrayfields
06:48 Ticket #25389 (texlive-fontutils and t1utils conflict) created by snc@…
[…]
05:43 archives edited by snc@…
(diff)
05:26 Ticket #25363 (pspp-devel: parallel build fails) closed by snc@…
fixed: Disabled in r69086.
05:24 Changeset [69086] by snc@…
disable parallel build, #25363
05:19 Ticket #25029 (kdebase4-runtime: cannot allocate an object of abstract type ...) closed by snc@…
duplicate: This is still a duplicate of #24947.
05:14 Changeset [69085] by snc@…
fix typo in tiger ldflags
05:04 Ticket #25388 ([Port Abandoned] grep) created by mjslouber@…
Ticket #24853 (new update) Opened 6 weeks ago Last modified 6 weeks ago …
04:31 Ticket #25387 (libev: update from version 3.6 to version 3.9 (patch)) created by jpo@…
Hi, The attached patch updates libev from version 3.6 to version 3.9. …
03:27 Ticket #25386 (conflicts aren't being detected) created by ryandesign@…
MacPorts isn't detecting conflicts that ports declare: […] 1.9 branch …
02:53 Changeset [69084] by jwa@…
reverting the erroneous commit done in r68981
02:01 Ticket #25168 (dsniff-devel installation on mac os snow leopard) closed by ryandesign@…
invalid
01:42 Changeset [69083] by ryandesign@…
mpich2: update to 1.2.1p1 and fix homepage and livecheck
01:28 Changeset [69082] by ryandesign@…
mpich2: disable universal variant which fails
00:25 Ticket #25228 (wine-crossover-games: update to 9.0.1) closed by ryandesign@…
fixed: Updated in r69081.
00:24 Changeset [69081] by ryandesign@…
wine-crossover-games: update to 9.0.1; see #25228

06/22/10:

23:56 Changeset [69080] by ryandesign@…
mpich: disable universal variant which fails
23:45 Ticket #25134 (libsndfile bad #include) closed by perry@…
worksforme: I'm resolving this as worksforme since it appears to build fine for all of …
23:38 Ticket #25381 (Update devel/boost-jam to 3.1.18) closed by ryandesign@…
fixed: Thanks; committed in r69079.
23:38 Changeset [69079] by ryandesign@…
boost-jam: maintainer update to 3.1.18; see #25381
23:37 Ticket #23855 (rdiff-backup-1.2.8 Unable to verify file checksums) closed by perry@…
fixed: I went through the list of savannah mirrors and removed some more in …
23:35 Changeset [69078] by perry@…
Remove dead savannah mirrors.
23:30 Ticket #23830 (mlt: Undefined symbols: _mlt_service_cache_purge) closed by ryandesign@…
fixed: Thanks, fixed in r69077.
23:30 Ticket #24698 (mlt fails to build) closed by ryandesign@…
fixed: Thanks, fixed in r69077.
23:30 Ticket #25374 (mlt 0.5.2: update to new upstream version) closed by ryandesign@…
fixed: Thanks, fixed in r69077.
23:30 Changeset [69077] by ryandesign@…
mlt: update to 0.5.6 (#25374), fix build error on 32-bit Intel Macs …
23:22 Changeset [69076] by ryandesign@…
frei0r-plugins: disable universal variant
23:20 Ticket #25385 (p5-net-twitter 1.04_0 perl interface to the Twitter APIs) created by aziiz.light@…
p5-net-twitter, namely [http://search.cpan.org/dist/Net-Twitter/
23:20 Ticket #22749 (libsndfile tries to use jack libraries) closed by perry@…
fixed: Since I haven't heard back, I assume this is no longer a problem.
23:05 Changeset [69075] by ryandesign@…
gv: create safe-gs-workdir so gv doesn't wait forever
23:04 Changeset [69074] by ryandesign@…
graphviz-devel, graphviz-gui-devel: update to 2.27.20100623.0445
22:57 Changeset [69073] by ryandesign@…
php5-solr: update to 0.9.11
22:51 Changeset [69072] by blair@…
New upstream 3.0.3 release.
22:08 Changeset [69071] by jmr@…
irssi: * add pkgconfig build dep * remove useless flags and unrecognised …
22:04 Changeset [69070] by toby@…
libevent 1.4.14b
20:29 Ticket #25383 (sudo port -v selfupdate fails) closed by jmr@…
invalid
19:12 Ticket #25384 (Update class-dump to 3.3.2) created by dwi@…
Hello, class-dump is up to 3.3.2 now. I've attached a diff for the …
18:24 Ticket #25383 (sudo port -v selfupdate fails) created by hasane@…
[…] I used the MacPorts-1.9.1.pkg on my Macbook Pro running OSX 10.6.4 …
17:29 Ticket #25382 (trac: "port is foo" query should match ticket with Port: foo bar) closed by wsiegrist@…
invalid: You got what you asked for. If you want tickets where the port field …
16:02 Ticket #25382 (trac: "port is foo" query should match ticket with Port: foo bar) created by swebster@…
Ideally if you perform a query for "Port" "is" "someport" then this will …
15:25 Ticket #25308 (websvn-2.3.1 fetch fails) closed by ryandesign@…
worksforme: Michael indicated via email that he was able to manually fetch the …
15:04 Changeset [69069] by devans@…
distfiles/ardour2: add ardour2 2.8.10 source dist.
14:53 Changeset [69068] by jeremyhu@…
xorg-server-devel: Bump to 1.8.99.903 (1.9 RC3)
12:55 Changeset [69067] by jrozner@…
updated active record associations for categories
12:09 Ticket #25381 (Update devel/boost-jam to 3.1.18) created by jon.olsson@…
Here's a simple update to the latest 3.1.18. Very lightly tested. …
12:02 Changeset [69066] by landonf@…
Update to 0.13. Fixes build on Snow Leopard.
11:37 Ticket #25309 (peekabot: update to version 0.7.2 + bugfixes) closed by wsiegrist@…
fixed: Fixed in r69065.
11:36 Changeset [69065] by wsiegrist@…
Remove peekabot-client Portfile text from the end of the peekabot-server …
11:36 Ticket #25380 (gcc45: command not found) closed by ram@…
invalid: The commands have the suffic -mp-${branch}, so gcc-mp-4.5 for example.
10:02 Changeset [69064] by singingwolfboy@…
New port: rb19-saikuro
09:54 Ticket #25358 (perl5 symlink points to wrong perl 5.10 and 5.12 binaries) closed by ricci@…
fixed: resolved in r69063 by bumping the versions of perl5.10 and perl5.12. …
09:53 Changeset [69063] by ricci@…
fix perl5.10 and perl5.12 installed versions add check that perl${version} …
09:49 Ticket #25380 (gcc45: command not found) created by macports@…
I installed gcc45 using Mac ports successfully on both my home and work …
09:34 Changeset [69062] by ricci@…
add conflicts w/ perl5.12 (and removal of same w/ +mangle_names)
09:15 Changeset [69061] by ricci@…
revert maintainer email address.
09:07 Ticket #25379 (Cairo 1.8.10 won't build MP1.91 / SL 10.6.4 (+no_x11 +quartz -universal)) created by gvibe06@…
Both Cairo and Cairo-Devel crash at the same place. Debug installed text …
08:50 Ticket #25309 (peekabot: update to version 0.7.2 + bugfixes) reopened by staffan@…
The Portfile committed in r69058 for peekabot-server has the Portfile for …
08:41 Changeset [69060] by jwa@…
add patch files copied from postgresql84 port
08:18 Ticket #25309 (peekabot: update to version 0.7.2 + bugfixes) closed by snc@…
fixed: Committed in r69058 and r69059.
08:17 Changeset [69059] by snc@…
add missing file from r69058
08:13 Changeset [69058] by snc@…
update version, branch into -client and -server, #25309
08:02 Ticket #25312 (gnudatalanguage build fails due to libtool "version mismatch error") closed by takeshi@…
fixed: With autoreconf, autoconf is redundant. r69057 fixes the lint warning.
08:01 Changeset [69057] by takeshi@…
gnudatalanguage: with autoreconf, autoconf is redundant
07:37 Changeset [69056] by takeshi@…
gnudatalanguage: fixes #25312 and gdl library path. Also use gcc44 in …
07:26 Ticket #25322 (libpcap: update to 1.1.1) closed by snc@…
fixed: Updated in r69055. Maintainer timeout.
07:24 Changeset [69055] by snc@…
update libpcap, fix malformed flags, #25322. maintainer timeout
07:09 Ticket #25330 (sane-backends 1.0.21 and variants to limit which backends are built) closed by snc@…
fixed: This ticket was resolved by Ryan in r68993 and by me in r69054.
07:08 Changeset [69054] by snc@…
add note about disabling backends for performance, #25330
07:02 Ticket #25334 (pianobar 0.0.0 console-based pandora.com player) closed by snc@…
fixed: Added in r69053 with above modifications.
06:37 Changeset [69053] by snc@…
add pianobar, #25334
06:34 Changeset [69052] by tzikis@…
Added alternative menus for all operations when pressing the Alt button
06:29 archives edited by snc@…
(diff)
06:14 snc edited by snc@…
(diff)
06:13 archives created by snc@…
adding walkthrough on signing archives
06:08 Ticket #25378 (texlive-bin: libjpeg.7.dylib not found) created by royger@…
Hello, I've just installed the following packets: texlive +medium …
06:01 Changeset [69051] by tzikis@…
Added some debugging info on install with variants
03:50 Ticket #25377 (rabbitmq-server build broken by erlang upgrade to R14A) created by david@…
The rabbitmq-server 1.7.2 port does not build after the upgrade to R14A. …
02:31 Ticket #25376 (ghostview fails to open files) created by valerio@…
Building and installing procedure ok, but when execute gv, trying to open …
01:26 Ticket #25371 (Can't sync the ports tree) closed by jmr@…
invalid: The server is working.

06/21/10:

23:44 Ticket #25375 (couchdb missing default.d local.d) created by daniel.terreros@…
Using OSX 10.6.4 both dmg package and from source on clean install. get a …
23:01 Ticket #24947 (kdebase4-runtime: cannot allocate an object of abstract type ...) reopened by julian@…
Replying to snc@…: > Included in r68608. so, unless r68608
21:14 Ticket #25374 (mlt 0.5.2: update to new upstream version) created by dan@…
Please also apply patch in ticket #23830 to close that issue. This upgrade …
20:48 Ticket #25373 (couchdb crash on start after erlang upgrade to R14A) created by jeff-macports@…
See apache issue [https://issues.apache.org/jira/browse/COUCHDB-805
18:19 Ticket #25372 (rb-activesupport: could not find gem locally or in a repository) created by gvibe06@…
I'll keep it simple. Using Macports, rb-activesupport no …
17:11 Changeset [69050] by jmr@…
fix typo in unarchive_init
17:09 Changeset [69049] by jmr@…
fix typo in _archive_available
16:56 Changeset [69048] by ryandesign@…
minivmac-devel: update to 3.3-20100620
16:51 Changeset [69047] by ryandesign@…
minivmac, minivmac-devel: enable universal variant, now that MacPorts 1.9 …
16:43 Changeset [69046] by ryandesign@…
bbcolors: fix livecheck
16:35 Ticket #25360 (sane-backends 1.0.21 fails to build, can't find tclIndex) closed by ryandesign@…
fixed: Replying to aguynamedryan+macports@…: > Please send me your …
16:35 Changeset [69045] by ryandesign@…
sane-backends: disable latex; see #25360
15:58 Changeset [69044] by jmr@…
use archive subdir in clean too
15:52 Changeset [69043] by jmr@…
move potentially time-consuming code from archivefetch_init to …
15:51 Changeset [69042] by jmr@…
move contents of extract_init to extract_start, as it consists entirely of …
15:04 Changeset [69041] by jmr@…
factor out archive subdir, add os.major to it, and use it in archivefetch
15:02 Ticket #25371 (Can't sync the ports tree) created by darrell@…
Is the server really not responding, or is some evil person blocking the …
14:56 Changeset [69040] by jrozner@…
Added recaptcha support for posting comments
14:53 Changeset [69039] by ryandesign@…
cassandra: fix license
14:37 Ticket #25356 (extracting zlib fails) closed by ryandesign@…
invalid: Received via email: […]
13:14 Mirrors edited by wsiegrist@…
Sort by country (diff)
13:11 Mirrors edited by wsiegrist@…
Use the new DNS names for Seattle mirror (diff)
12:51 Ticket #25370 (Update py26-south to 0.7.1) created by singingwolfboy@…
Python South is currently at version 0.7.1, while the port is at 0.6.2. …
12:21 Changeset [69038] by jmr@…
use sea.us.distfiles.macports.org alias for PNL mirror
12:20 Ticket #25369 ("texlive -doc" installs documentation) created by kurtjaeke@…
When installing texlive in variants "+full -doc", I end up having …
12:15 Ticket #25364 (poppler-data Unable to open port: invalid command name "supported_archs") closed by jmr@…
invalid: You're obviously not running 1.9.1. You need to selfupdate.
12:14 Changeset [69037] by jmr@…
new distfiles mirror courtesy of PNL
11:57 Ticket #25258 (gcc ports break after upgrading mpfr to 3.0.0) closed by jmr@…
fixed: Since gcc43 and gcc44 have now been broken for a week, I rev bumped them …
11:56 Changeset [69036] by jmr@…
gcc43, gcc44: rev bump for new mpfr (#25258), remove extra slash from …
11:49 Changeset [69035] by singingwolfboy@…
Updated Cassandra to 0.6.2
11:42 Ticket #25368 (policykit install fails) created by jpbn@…
Building policykit […]
11:39 Ticket #25367 (docbook-xml using wrong dependency type) created by jpbn@…
It seems that when install gtk-doc, if docbook-xml or docbook-xsl are …
10:03 Ticket #25366 (json_spirit 4.03 Port Submission) created by mail@…
A new Portfile for json_spirit
09:58 Changeset [69034] by dluke@…
Version bump, subversion and bindings ports to 1.6.12
09:35 Mirrors edited by timw@…
Added Pacific Northwest National Lab's new public mirror. (diff)
09:15 Ticket #25365 (gnudatalanguage failing to build on snowleopard) created by sibanda@…
Building gnudatalanguage fails with errors that have to do with the …
09:15 Ticket #25311 (imake: description should not be quoted) closed by snc@…
fixed: Fixed in r69030. Maintainer timeout.
08:06 Changeset [69033] by singingwolfboy@…
Updated rb19-gherkin to 2.0.2
07:58 Changeset [69032] by singingwolfboy@…
Update rb19-unicorn to 1.0.0
07:50 Changeset [69031] by singingwolfboy@…
New port: rb19-shoulda
07:42 Changeset [69030] by snc@…
fix description, #25311. maintainer timeout
07:08 Changeset [69029] by snc@…
fix livecheck
06:48 Changeset [69028] by snc@…
undo version changes, compliments to livecheck.version
05:24 Changeset [69027] by davidnichols@…
added qore freetds module port
02:09 Ticket #25325 (gcc44: libltdl: No such file or directory) closed by ryandesign@…
worksforme: Glad you got it working. Not sure why it failed the first time. You …
02:08 Ticket #25364 (poppler-data Unable to open port: invalid command name "supported_archs") created by maksim.borissov@…
poppler-data fails do build and exits with message Unable to open port: …
01:58 Ticket #25363 (pspp-devel: parallel build fails) created by ryandesign@…
pspp-devel fails to build when using more than one build make job, as is …
00:23 Ticket #18944 (linking with mpicc fails with undefined symbols) closed by jmr@…
duplicate: #10256
Note: See TracTimeline for information about the timeline view.