Ticket #13201: dpkg.log

File dpkg.log, 3.0 KB (added by terry@…, 13 years ago)
Line 
1--->  Fetching dpkg
2--->  Attempting to fetch dpkg_1.10.28.tar.gz from http://ftp.debian.org/debian/pool/main/d/dpkg/
3--->  Verifying checksum(s) for dpkg
4--->  Extracting dpkg
5--->  Applying patches to dpkg
6--->  Configuring dpkg
7--->  Building dpkg with target all
8Error: Target org.macports.build returned: shell command " cd "/opt/macports/var/macports/build/_opt_macports_var_macports_sources_rsync.macports.org_release_ports_sysutils_dpkg/work/dpkg-1.10.28" && gnumake all " returned error 2
9Command output: sed -e "s:^#![:space:]*/usr/bin/perl:#! /opt/macports/bin/perl:; \
10                s:\$dpkglibdir[[:space:]]*=[[:space:]]*['\"][^'\"]*['\"]:\$dpkglibdir=\"/opt/macports/lib/dpkg\":; \
11                s:\$admindir[[:space:]]*=[[:space:]]*['\"][^'\"]*['\"]:\$admindir=\"/opt/macports/var/db/dpkg\":; \
12                s:\$version[[:space:]]*=[[:space:]]*['\"][^'\"]*[\"']:\$version=\"1.10.28\":" \
13                < install-info.pl > install-info
14sed -e "s:^#![:space:]*/usr/bin/perl:#! /opt/macports/bin/perl:; \
15                s:\$dpkglibdir[[:space:]]*=[[:space:]]*['\"][^'\"]*['\"]:\$dpkglibdir=\"/opt/macports/lib/dpkg\":; \
16                s:\$admindir[[:space:]]*=[[:space:]]*['\"][^'\"]*['\"]:\$admindir=\"/opt/macports/var/db/dpkg\":; \
17                s:\$version[[:space:]]*=[[:space:]]*['\"][^'\"]*[\"']:\$version=\"1.10.28\":" \
18                < dpkg-divert.pl > dpkg-divert
19sed -e "s:^#![:space:]*/usr/bin/perl:#! /opt/macports/bin/perl:; \
20                s:\$dpkglibdir[[:space:]]*=[[:space:]]*['\"][^'\"]*['\"]:\$dpkglibdir=\"/opt/macports/lib/dpkg\":; \
21                s:\$admindir[[:space:]]*=[[:space:]]*['\"][^'\"]*['\"]:\$admindir=\"/opt/macports/var/db/dpkg\":; \
22                s:\$version[[:space:]]*=[[:space:]]*['\"][^'\"]*[\"']:\$version=\"1.10.28\":" \
23                < dpkg-statoverride.pl > dpkg-statoverride
24sed -e "s:^#![:space:]*/usr/bin/perl:#! /opt/macports/bin/perl:; \
25                s:\$dpkglibdir[[:space:]]*=[[:space:]]*['\"][^'\"]*['\"]:\$dpkglibdir=\"/opt/macports/lib/dpkg\":; \
26                s:\$admindir[[:space:]]*=[[:space:]]*['\"][^'\"]*['\"]:\$admindir=\"/opt/macports/var/db/dpkg\":; \
27                s:\$version[[:space:]]*=[[:space:]]*['\"][^'\"]*[\"']:\$version=\"1.10.28\":" \
28                < cleanup-info.pl > cleanup-info
29pod2man --section=1 dpkg-architecture.pl > dpkg-architecture.1
30pod2man --section=1 dpkg-scansources.pl > dpkg-scansources.1
31gnumake  -C "utils" "all"
32gcc -I/opt/macports/include -O2  -Wall  -Wwrite-strings -Wpointer-arith -Wimplicit -Wnested-externs -Wstrict-prototypes -Wmissing-prototypes -Wmissing-declarations -Wbad-function-cast -Wcast-qual -Wcast-align -Winline -Wmissing-noreturn -Wsign-compare -I../optlib -DHAVE_CONFIG_H -D_GNU_SOURCE -DLOCALEDIR=\"/opt/macports/share/locale\" -I../intl -I../intl -I../include -I.. -I. -I../include -I.. -I. -I../optlib -DUSE_ZLIB -DUSE_BZ2LIB -c start-stop-daemon.c
33start-stop-daemon.c:61:17: error: kvm.h: No such file or directory
34start-stop-daemon.c: In function 'parse_schedule':
35start-stop-daemon.c:418: warning: signed and unsigned type in conditional expression
36gnumake[2]: *** [start-stop-daemon.o] Error 1
37gnumake[1]: *** [all-utils] Error 2
38gnumake: *** [all-recursive] Error 2
39
40Error: Status 1 encountered during processing.