Ticket #20027: perl5.8.txt

File perl5.8.txt, 1.7 KB (added by uttam@…, 12 years ago)

perl5.8 build error

Line 
1Uttam:~ illuminati$ sudo port install wine
2--->  Building perl5.8
3Error: Target org.macports.build returned: shell command " cd "/opt/local/var/macports/build/_opt_local_var_macports_sources_rsync.macports.org_release_ports_lang_perl5.8/work/perl-5.8.9" && make all " returned error 2
4Command output: `sh  cflags "optimize='-O3'" toke.o`  toke.c
5          CCCMD =  /usr/bin/gcc-4.0 -DPERL_CORE -c -fno-common -DPERL_DARWIN -I/opt/local/include -no-cpp-precomp -fno-strict-aliasing -pipe -I/usr/local/include -I/opt/local/include  -std=c89 -O3 -Wall -ansi   -W -Wextra -Wdeclaration-after-statement -Wendif-labels
6toke.c: In function 'Perl_yylex':
7toke.c:5516: error: invalid lvalue in unary '&'
8toke.c:5516: error: invalid lvalue in unary '&'
9toke.c: In function 'S_pending_ident':
10toke.c:5755: error: invalid lvalue in unary '&'
11toke.c:5755: error: invalid lvalue in unary '&'
12toke.c: In function 'S_scan_heredoc':
13toke.c:9785: error: invalid operands to binary +
14toke.c:9785: error: invalid lvalue in unary '&'
15toke.c:9785: error: invalid lvalue in unary '&'
16toke.c: In function 'S_scan_formline':
17toke.c:10814: error: invalid operands to binary +
18toke.c:10814: error: invalid lvalue in unary '&'
19toke.c:10814: error: invalid lvalue in unary '&'
20make: *** [toke.o] Error 1
21
22Error: The following dependencies failed to build: autoconf help2man p5-locale-gettext perl5 perl5.8 m4 fontconfig freetype libxml2 libxslt mesa glut tcl xorg-dri2proto xorg-glproto xorg-libXfixes xorg-fixesproto xorg-libXi xorg-libXmu xorg-libXt automake libtool xorg-libsm xorg-libice xorg-util-macros xorg-libXcursor xorg-libXinerama xorg-xineramaproto xorg-libXxf86vm xorg-xf86vidmodeproto
23Error: Status 1 encountered during processing.
24Uttam:~ illuminati$ sudo port clean perl5.8
25--->  Cleaning perl5.8
26