Ticket #21536: cryptlib_compile_fail.txt

File cryptlib_compile_fail.txt, 4.2 KB (added by pkutzner+macports@…, 11 years ago)
Line 
1--->  Computing dependencies for cryptlib.
2--->  Fetching cryptlib
3--->  cl331.zip doesn't seem to exist in /opt/local/var/macports/distfiles/cryptlib
4--->  Attempting to fetch cl331.zip from http://distfiles.macports.org/cryptlib
5  % Total    % Received % Xferd  Average Speed   Time    Time     Time  Current
6                                 Dload  Upload   Total   Spent    Left  Speed
7100 3713k  100 3713k    0     0   144k      0  0:00:25  0:00:25 --:--:-- 94487
8--->  Verifying checksum(s) for cryptlib
9--->  Checksumming cl331.zip
10--->  Extracting cryptlib
11--->  Extracting cl331.zip
12--->  Configuring cryptlib
13--->  Building cryptlib
14mkdir: ./shared-obj: File exists
15make[1]: [directories] Error 1 (ignored)
16strip: can't move temporary file: /opt/local/var/macports/build/_opt_local_var_macports_sources_rsync.macports.org_release_ports_devel_cryptlib/work/cryptlib/tools/endian.strip to input file: /opt/local/var/macports/build/_opt_local_var_macports_sources_rsync.macports.org_release_ports_devel_cryptlib/work/cryptlib/tools/endian (No such file or directory)
17ODBC interface detected, enabling ODBC support.
18ODBC interface detected, enabling ODBC support.
19LDAP interface detected, enabling LDAP support
20LDAP interface detected, enabling LDAP support
21cc -c -D__UNIX__ -DNDEBUG -I. -DDATA_LITTLEENDIAN -DUSE_ODBC -DUSE_LDAP -march=pentium -std=gnu99 -DOSVERSION=1 -DUSE_ODBC -fomit-frame-pointer -O3 bn/bn_add.c -o ./static-obj/bn_add.o
22cc -c -D__UNIX__ -DNDEBUG -I. -fno-common -DDATA_LITTLEENDIAN -DUSE_ODBC -DUSE_LDAP -fPIC -march=pentium -std=gnu99                     -DOSVERSION=1 -DUSE_ODBC -fomit-frame-pointer -O3 bn/bn_add.c -o ./shared-obj/bn_add.o
23bn/bn_add.c:1: error: CPU you selected does not support x86-64 instruction set
24bn/bn_add.c:1: error: CPU you selected does not support x86-64 instruction setbn/bn_add.c:1: error: CPU you selected does not support x86-64 instruction set
25
26bn/bn_add.c:1: error: CPU you selected does not support x86-64 instruction set
27make[2]: *** [shared-obj/bn_add.o] Error 1
28make[1]: *** [Darwin] Error 2
29make[2]: *** [static-obj/bn_add.o] Error 1
30make[1]: *** [Darwin] Error 2
31make: *** [shared] Error 2
32make: *** Waiting for unfinished jobs....
33make: *** [default] Error 2
34Error: Target org.macports.build returned: shell command " cd "/opt/local/var/macports/build/_opt_local_var_macports_sources_rsync.macports.org_release_ports_devel_cryptlib/work/cryptlib" && /usr/bin/make -j2 default shared LIBDIR=/opt/local/lib " returned error 2
35Command output: mkdir: ./shared-obj: File exists
36make[1]: [directories] Error 1 (ignored)
37strip: can't move temporary file: /opt/local/var/macports/build/_opt_local_var_macports_sources_rsync.macports.org_release_ports_devel_cryptlib/work/cryptlib/tools/endian.strip to input file: /opt/local/var/macports/build/_opt_local_var_macports_sources_rsync.macports.org_release_ports_devel_cryptlib/work/cryptlib/tools/endian (No such file or directory)
38ODBC interface detected, enabling ODBC support.
39ODBC interface detected, enabling ODBC support.
40LDAP interface detected, enabling LDAP support
41LDAP interface detected, enabling LDAP support
42cc -c -D__UNIX__ -DNDEBUG -I. -DDATA_LITTLEENDIAN -DUSE_ODBC -DUSE_LDAP -march=pentium -std=gnu99 -DOSVERSION=1 -DUSE_ODBC -fomit-frame-pointer -O3 bn/bn_add.c -o ./static-obj/bn_add.o
43cc -c -D__UNIX__ -DNDEBUG -I. -fno-common -DDATA_LITTLEENDIAN -DUSE_ODBC -DUSE_LDAP -fPIC -march=pentium -std=gnu99                     -DOSVERSION=1 -DUSE_ODBC -fomit-frame-pointer -O3 bn/bn_add.c -o ./shared-obj/bn_add.o
44bn/bn_add.c:1: error: CPU you selected does not support x86-64 instruction set
45bn/bn_add.c:1: error: CPU you selected does not support x86-64 instruction setbn/bn_add.c:1: error: CPU you selected does not support x86-64 instruction set
46
47bn/bn_add.c:1: error: CPU you selected does not support x86-64 instruction set
48make[2]: *** [shared-obj/bn_add.o] Error 1
49make[1]: *** [Darwin] Error 2
50make[2]: *** [static-obj/bn_add.o] Error 1
51make[1]: *** [Darwin] Error 2
52make: *** [shared] Error 2
53make: *** Waiting for unfinished jobs....
54make: *** [default] Error 2
55
56Warning: the following items did not execute (for cryptlib): org.macports.activate org.macports.build org.macports.destroot org.macports.install
57Error: Status 1 encountered during processing.