Ticket #24738: postgresql82.log

File postgresql82.log, 201.5 KB (added by offline@…, 11 years ago)
Line 
1$ sudo port deactivate postgresql82; sudo port clean postgresql82; sudo port -d install postgresql82
2Error: port deactivate failed: Registry error: postgresql82 not registered as installed & active.
3--->  Cleaning postgresql82
4DEBUG: Found port in file:///opt/local/var/macports/sources/rsync.macports.org/release/ports/databases/postgresql82
5DEBUG: Changing to port directory: /opt/local/var/macports/sources/rsync.macports.org/release/ports/databases/postgresql82
6DEBUG: OS Platform: darwin
7DEBUG: OS Version: 10.3.0
8DEBUG: Mac OS X Version: 10.6
9DEBUG: System Arch: i386
10DEBUG: setting option os.universal_supported to yes
11DEBUG: org.macports.load registered provides 'load', a pre-existing procedure. Target override will not be provided
12DEBUG: org.macports.unload registered provides 'unload', a pre-existing procedure. Target override will not be provided
13DEBUG: org.macports.distfiles registered provides 'distfiles', a pre-existing procedure. Target override will not be provided
14DEBUG: adding the default universal variant
15DEBUG: Reading variant descriptions from /opt/local/var/macports/sources/rsync.macports.org/release/ports/_resources/port1.0/variant_descriptions.conf
16DEBUG: Requested variant darwin is not provided by port postgresql82.
17DEBUG: Requested variant i386 is not provided by port postgresql82.
18DEBUG: Requested variant no_x11 is not provided by port postgresql82.
19DEBUG: Requested variant macosx is not provided by port postgresql82.
20DEBUG: Executing variant universal provides universal
21DEBUG: Attempting ln -sf /opt/local/var/macports/build/_opt_local_var_macports_sources_rsync.macports.org_release_ports_databases_postgresql82/work /opt/local/var/macports/sources/rsync.macports.org/release/ports/databases/postgresql82/work
22DEBUG: Found port in file:///opt/local/var/macports/sources/rsync.macports.org/release/ports/devel/readline
23DEBUG: epoch: in tree: 0 installed: 0
24DEBUG: readline 6.1.000_1 exists in the ports tree
25DEBUG: readline 6.1.000_1 +darwin+universal is the latest installed
26DEBUG: readline 6.1.000_1 +darwin+universal is active
27DEBUG: Merging existing variants darwin universal into variants
28DEBUG: new fully merged portvariants: universal +
29DEBUG: Changing to port directory: /opt/local/var/macports/sources/rsync.macports.org/release/ports/devel/readline
30DEBUG: OS Platform: darwin
31DEBUG: OS Version: 10.3.0
32DEBUG: Mac OS X Version: 10.6
33DEBUG: System Arch: i386
34DEBUG: setting option os.universal_supported to yes
35DEBUG: org.macports.load registered provides 'load', a pre-existing procedure. Target override will not be provided
36DEBUG: org.macports.unload registered provides 'unload', a pre-existing procedure. Target override will not be provided
37DEBUG: org.macports.distfiles registered provides 'distfiles', a pre-existing procedure. Target override will not be provided
38DEBUG: Using group file /opt/local/var/macports/sources/rsync.macports.org/release/ports/_resources/port1.0/group/muniversal-1.0.tcl
39DEBUG: Reading variant descriptions from /opt/local/var/macports/sources/rsync.macports.org/release/ports/_resources/port1.0/variant_descriptions.conf
40DEBUG: universal variant already exists, so not adding the default one
41DEBUG: Requested variant i386 is not provided by port readline.
42DEBUG: Requested variant macosx is not provided by port readline.
43DEBUG: Executing variant universal provides universal
44DEBUG: Executing variant darwin provides darwin
45DEBUG: Found port in file:///opt/local/var/macports/sources/rsync.macports.org/release/ports/devel/ncurses
46DEBUG: epoch: in tree: 0 installed: 0
47DEBUG: ncurses 5.7_0 exists in the ports tree
48DEBUG: ncurses 5.7_0 +darwin_10 is the latest installed
49DEBUG: ncurses 5.7_0 +darwin_10+universal is active
50DEBUG: Merging existing variants darwin_10 universal into variants
51DEBUG: new fully merged portvariants: universal +
52DEBUG: Changing to port directory: /opt/local/var/macports/sources/rsync.macports.org/release/ports/devel/ncurses
53DEBUG: OS Platform: darwin
54DEBUG: OS Version: 10.3.0
55DEBUG: Mac OS X Version: 10.6
56DEBUG: System Arch: i386
57DEBUG: setting option os.universal_supported to yes
58DEBUG: org.macports.load registered provides 'load', a pre-existing procedure. Target override will not be provided
59DEBUG: org.macports.unload registered provides 'unload', a pre-existing procedure. Target override will not be provided
60DEBUG: org.macports.distfiles registered provides 'distfiles', a pre-existing procedure. Target override will not be provided
61DEBUG: Using group file /opt/local/var/macports/sources/rsync.macports.org/release/ports/_resources/port1.0/group/muniversal-1.0.tcl
62DEBUG: Reading variant descriptions from /opt/local/var/macports/sources/rsync.macports.org/release/ports/_resources/port1.0/variant_descriptions.conf
63DEBUG: universal variant already exists, so not adding the default one
64DEBUG: Requested variant darwin is not provided by port ncurses.
65DEBUG: Requested variant i386 is not provided by port ncurses.
66DEBUG: Requested variant macosx is not provided by port ncurses.
67DEBUG: Executing variant universal provides universal
68DEBUG: Executing variant darwin_10 provides darwin_10
69DEBUG: Found port in file:///opt/local/var/macports/sources/rsync.macports.org/release/ports/devel/ncursesw
70DEBUG: epoch: in tree: 0 installed: 0
71DEBUG: ncursesw 5.7_0 exists in the ports tree
72DEBUG: ncursesw 5.7_0 +darwin_10 is the latest installed
73DEBUG: ncursesw 5.7_0 +darwin_10+universal is active
74DEBUG: Merging existing variants darwin_10 universal into variants
75DEBUG: new fully merged portvariants: universal +
76DEBUG: Changing to port directory: /opt/local/var/macports/sources/rsync.macports.org/release/ports/devel/ncursesw
77DEBUG: OS Platform: darwin
78DEBUG: OS Version: 10.3.0
79DEBUG: Mac OS X Version: 10.6
80DEBUG: System Arch: i386
81DEBUG: setting option os.universal_supported to yes
82DEBUG: org.macports.load registered provides 'load', a pre-existing procedure. Target override will not be provided
83DEBUG: org.macports.unload registered provides 'unload', a pre-existing procedure. Target override will not be provided
84DEBUG: org.macports.distfiles registered provides 'distfiles', a pre-existing procedure. Target override will not be provided
85DEBUG: Using group file /opt/local/var/macports/sources/rsync.macports.org/release/ports/_resources/port1.0/group/muniversal-1.0.tcl
86DEBUG: Reading variant descriptions from /opt/local/var/macports/sources/rsync.macports.org/release/ports/_resources/port1.0/variant_descriptions.conf
87DEBUG: universal variant already exists, so not adding the default one
88DEBUG: Requested variant darwin is not provided by port ncursesw.
89DEBUG: Requested variant i386 is not provided by port ncursesw.
90DEBUG: Requested variant macosx is not provided by port ncursesw.
91DEBUG: Executing variant universal provides universal
92DEBUG: Executing variant darwin_10 provides darwin_10
93DEBUG: No need to upgrade! ncursesw 5.7_0 >= ncursesw 5.7_0
94DEBUG: No need to upgrade! ncurses 5.7_0 >= ncurses 5.7_0
95DEBUG: No need to upgrade! readline 6.1.000_1 >= readline 6.1.000_1
96DEBUG: Found port in file:///opt/local/var/macports/sources/rsync.macports.org/release/ports/devel/openssl
97DEBUG: epoch: in tree: 1 installed: 1
98DEBUG: openssl 0.9.8n_0 exists in the ports tree
99DEBUG: openssl 0.9.8n_0 +darwin+universal is the latest installed
100DEBUG: openssl 0.9.8n_0 +darwin+universal is active
101DEBUG: Merging existing variants darwin universal into variants
102DEBUG: new fully merged portvariants: universal +
103DEBUG: Changing to port directory: /opt/local/var/macports/sources/rsync.macports.org/release/ports/devel/openssl
104DEBUG: OS Platform: darwin
105DEBUG: OS Version: 10.3.0
106DEBUG: Mac OS X Version: 10.6
107DEBUG: System Arch: i386
108DEBUG: setting option os.universal_supported to yes
109DEBUG: org.macports.load registered provides 'load', a pre-existing procedure. Target override will not be provided
110DEBUG: org.macports.unload registered provides 'unload', a pre-existing procedure. Target override will not be provided
111DEBUG: org.macports.distfiles registered provides 'distfiles', a pre-existing procedure. Target override will not be provided
112DEBUG: Using group file /opt/local/var/macports/sources/rsync.macports.org/release/ports/_resources/port1.0/group/muniversal-1.0.tcl
113DEBUG: Reading variant descriptions from /opt/local/var/macports/sources/rsync.macports.org/release/ports/_resources/port1.0/variant_descriptions.conf
114DEBUG: universal variant already exists, so not adding the default one
115DEBUG: Requested variant i386 is not provided by port openssl.
116DEBUG: Requested variant macosx is not provided by port openssl.
117DEBUG: Executing variant universal provides universal
118DEBUG: Executing variant darwin provides darwin
119DEBUG: Found port in file:///opt/local/var/macports/sources/rsync.macports.org/release/ports/archivers/zlib
120DEBUG: epoch: in tree: 0 installed: 0
121DEBUG: zlib 1.2.5_0 exists in the ports tree
122DEBUG: zlib 1.2.5_0 +universal is the latest installed
123DEBUG: zlib 1.2.5_0 +universal is active
124DEBUG: Merging existing variants universal into variants
125DEBUG: new fully merged portvariants: universal +
126DEBUG: Changing to port directory: /opt/local/var/macports/sources/rsync.macports.org/release/ports/archivers/zlib
127DEBUG: OS Platform: darwin
128DEBUG: OS Version: 10.3.0
129DEBUG: Mac OS X Version: 10.6
130DEBUG: System Arch: i386
131DEBUG: setting option os.universal_supported to yes
132DEBUG: org.macports.load registered provides 'load', a pre-existing procedure. Target override will not be provided
133DEBUG: org.macports.unload registered provides 'unload', a pre-existing procedure. Target override will not be provided
134DEBUG: org.macports.distfiles registered provides 'distfiles', a pre-existing procedure. Target override will not be provided
135DEBUG: adding the default universal variant
136DEBUG: Reading variant descriptions from /opt/local/var/macports/sources/rsync.macports.org/release/ports/_resources/port1.0/variant_descriptions.conf
137DEBUG: Requested variant darwin is not provided by port zlib.
138DEBUG: Requested variant i386 is not provided by port zlib.
139DEBUG: Requested variant macosx is not provided by port zlib.
140DEBUG: Executing variant universal provides universal
141DEBUG: No need to upgrade! zlib 1.2.5_0 >= zlib 1.2.5_0
142DEBUG: No need to upgrade! openssl 0.9.8n_0 >= openssl 0.9.8n_0
143DEBUG: Found port in file:///opt/local/var/macports/sources/rsync.macports.org/release/ports/textproc/libxml2
144DEBUG: epoch: in tree: 0 installed: 0
145DEBUG: libxml2 2.7.7_0 exists in the ports tree
146DEBUG: libxml2 2.7.7_0 +universal is the latest installed
147DEBUG: libxml2 2.7.7_0 +universal is active
148DEBUG: Merging existing variants universal into variants
149DEBUG: new fully merged portvariants: universal +
150DEBUG: Changing to port directory: /opt/local/var/macports/sources/rsync.macports.org/release/ports/textproc/libxml2
151DEBUG: OS Platform: darwin
152DEBUG: OS Version: 10.3.0
153DEBUG: Mac OS X Version: 10.6
154DEBUG: System Arch: i386
155DEBUG: setting option os.universal_supported to yes
156DEBUG: org.macports.load registered provides 'load', a pre-existing procedure. Target override will not be provided
157DEBUG: org.macports.unload registered provides 'unload', a pre-existing procedure. Target override will not be provided
158DEBUG: org.macports.distfiles registered provides 'distfiles', a pre-existing procedure. Target override will not be provided
159DEBUG: Using group file /opt/local/var/macports/sources/rsync.macports.org/release/ports/_resources/port1.0/group/archcheck-1.0.tcl
160DEBUG: adding the default universal variant
161DEBUG: Reading variant descriptions from /opt/local/var/macports/sources/rsync.macports.org/release/ports/_resources/port1.0/variant_descriptions.conf
162DEBUG: Requested variant darwin is not provided by port libxml2.
163DEBUG: Requested variant i386 is not provided by port libxml2.
164DEBUG: Requested variant macosx is not provided by port libxml2.
165DEBUG: Executing variant universal provides universal
166DEBUG: Found port in file:///opt/local/var/macports/sources/rsync.macports.org/release/ports/textproc/libiconv
167DEBUG: epoch: in tree: 0 installed: 0
168DEBUG: libiconv 1.13.1_0 exists in the ports tree
169DEBUG: libiconv 1.13.1_0  is the latest installed
170DEBUG: libiconv 1.13.1_0 +universal is active
171DEBUG: Merging existing variants universal into variants
172DEBUG: new fully merged portvariants: universal +
173DEBUG: Changing to port directory: /opt/local/var/macports/sources/rsync.macports.org/release/ports/textproc/libiconv
174DEBUG: OS Platform: darwin
175DEBUG: OS Version: 10.3.0
176DEBUG: Mac OS X Version: 10.6
177DEBUG: System Arch: i386
178DEBUG: setting option os.universal_supported to yes
179DEBUG: org.macports.load registered provides 'load', a pre-existing procedure. Target override will not be provided
180DEBUG: org.macports.unload registered provides 'unload', a pre-existing procedure. Target override will not be provided
181DEBUG: org.macports.distfiles registered provides 'distfiles', a pre-existing procedure. Target override will not be provided
182DEBUG: Using group file /opt/local/var/macports/sources/rsync.macports.org/release/ports/_resources/port1.0/group/muniversal-1.0.tcl
183DEBUG: Reading variant descriptions from /opt/local/var/macports/sources/rsync.macports.org/release/ports/_resources/port1.0/variant_descriptions.conf
184DEBUG: universal variant already exists, so not adding the default one
185DEBUG: Requested variant darwin is not provided by port libiconv.
186DEBUG: Requested variant i386 is not provided by port libiconv.
187DEBUG: Requested variant macosx is not provided by port libiconv.
188DEBUG: Executing variant universal provides universal
189DEBUG: Found port in file:///opt/local/var/macports/sources/rsync.macports.org/release/ports/devel/gperf
190DEBUG: epoch: in tree: 0 installed: 0
191DEBUG: gperf 3.0.4_0 exists in the ports tree
192DEBUG: gperf 3.0.4_0  is the latest installed
193DEBUG: gperf 3.0.4_0 +universal is active
194DEBUG: Merging existing variants universal into variants
195DEBUG: new fully merged portvariants: universal +
196DEBUG: Changing to port directory: /opt/local/var/macports/sources/rsync.macports.org/release/ports/devel/gperf
197DEBUG: OS Platform: darwin
198DEBUG: OS Version: 10.3.0
199DEBUG: Mac OS X Version: 10.6
200DEBUG: System Arch: i386
201DEBUG: setting option os.universal_supported to yes
202DEBUG: org.macports.load registered provides 'load', a pre-existing procedure. Target override will not be provided
203DEBUG: org.macports.unload registered provides 'unload', a pre-existing procedure. Target override will not be provided
204DEBUG: org.macports.distfiles registered provides 'distfiles', a pre-existing procedure. Target override will not be provided
205DEBUG: Using group file /opt/local/var/macports/sources/rsync.macports.org/release/ports/_resources/port1.0/group/muniversal-1.0.tcl
206DEBUG: Reading variant descriptions from /opt/local/var/macports/sources/rsync.macports.org/release/ports/_resources/port1.0/variant_descriptions.conf
207DEBUG: universal variant already exists, so not adding the default one
208DEBUG: Requested variant darwin is not provided by port gperf.
209DEBUG: Requested variant i386 is not provided by port gperf.
210DEBUG: Requested variant macosx is not provided by port gperf.
211DEBUG: Executing variant universal provides universal
212DEBUG: No need to upgrade! gperf 3.0.4_0 >= gperf 3.0.4_0
213DEBUG: No need to upgrade! libiconv 1.13.1_0 >= libiconv 1.13.1_0
214DEBUG: No need to upgrade! libxml2 2.7.7_0 >= libxml2 2.7.7_0
215DEBUG: Found port in file:///opt/local/var/macports/sources/rsync.macports.org/release/ports/textproc/libxslt
216DEBUG: epoch: in tree: 0 installed: 0
217DEBUG: libxslt 1.1.26_0 exists in the ports tree
218DEBUG: libxslt 1.1.26_0  is the latest installed
219DEBUG: libxslt 1.1.26_0 +universal is active
220DEBUG: Merging existing variants universal into variants
221DEBUG: new fully merged portvariants: universal +
222DEBUG: Changing to port directory: /opt/local/var/macports/sources/rsync.macports.org/release/ports/textproc/libxslt
223DEBUG: OS Platform: darwin
224DEBUG: OS Version: 10.3.0
225DEBUG: Mac OS X Version: 10.6
226DEBUG: System Arch: i386
227DEBUG: setting option os.universal_supported to yes
228DEBUG: org.macports.load registered provides 'load', a pre-existing procedure. Target override will not be provided
229DEBUG: org.macports.unload registered provides 'unload', a pre-existing procedure. Target override will not be provided
230DEBUG: org.macports.distfiles registered provides 'distfiles', a pre-existing procedure. Target override will not be provided
231DEBUG: Using group file /opt/local/var/macports/sources/rsync.macports.org/release/ports/_resources/port1.0/group/muniversal-1.0.tcl
232DEBUG: Reading variant descriptions from /opt/local/var/macports/sources/rsync.macports.org/release/ports/_resources/port1.0/variant_descriptions.conf
233DEBUG: universal variant already exists, so not adding the default one
234DEBUG: Requested variant darwin is not provided by port libxslt.
235DEBUG: Requested variant i386 is not provided by port libxslt.
236DEBUG: Requested variant macosx is not provided by port libxslt.
237DEBUG: Executing variant universal provides universal
238DEBUG: No need to upgrade! libxslt 1.1.26_0 >= libxslt 1.1.26_0
239DEBUG: Found port in file:///opt/local/var/macports/sources/rsync.macports.org/release/ports/devel/bison
240DEBUG: epoch: in tree: 0 installed: 0
241DEBUG: bison 2.4.2_0 exists in the ports tree
242DEBUG: bison 2.4.2_0 +universal is the latest installed
243DEBUG: bison 2.4.2_0 +universal is active
244DEBUG: Merging existing variants universal into variants
245DEBUG: new fully merged portvariants: universal +
246DEBUG: Changing to port directory: /opt/local/var/macports/sources/rsync.macports.org/release/ports/devel/bison
247DEBUG: OS Platform: darwin
248DEBUG: OS Version: 10.3.0
249DEBUG: Mac OS X Version: 10.6
250DEBUG: System Arch: i386
251DEBUG: setting option os.universal_supported to yes
252DEBUG: org.macports.load registered provides 'load', a pre-existing procedure. Target override will not be provided
253DEBUG: org.macports.unload registered provides 'unload', a pre-existing procedure. Target override will not be provided
254DEBUG: org.macports.distfiles registered provides 'distfiles', a pre-existing procedure. Target override will not be provided
255DEBUG: adding the default universal variant
256DEBUG: Reading variant descriptions from /opt/local/var/macports/sources/rsync.macports.org/release/ports/_resources/port1.0/variant_descriptions.conf
257DEBUG: Requested variant darwin is not provided by port bison.
258DEBUG: Requested variant i386 is not provided by port bison.
259DEBUG: Requested variant macosx is not provided by port bison.
260DEBUG: Executing variant universal provides universal
261DEBUG: Found port in file:///opt/local/var/macports/sources/rsync.macports.org/release/ports/devel/gettext
262DEBUG: epoch: in tree: 0 installed: 0
263DEBUG: gettext 0.17_4 exists in the ports tree
264DEBUG: gettext 0.17_4  is the latest installed
265DEBUG: gettext 0.17_4 +universal is active
266DEBUG: Merging existing variants universal into variants
267DEBUG: new fully merged portvariants: universal +
268DEBUG: Changing to port directory: /opt/local/var/macports/sources/rsync.macports.org/release/ports/devel/gettext
269DEBUG: OS Platform: darwin
270DEBUG: OS Version: 10.3.0
271DEBUG: Mac OS X Version: 10.6
272DEBUG: System Arch: i386
273DEBUG: setting option os.universal_supported to yes
274DEBUG: org.macports.load registered provides 'load', a pre-existing procedure. Target override will not be provided
275DEBUG: org.macports.unload registered provides 'unload', a pre-existing procedure. Target override will not be provided
276DEBUG: org.macports.distfiles registered provides 'distfiles', a pre-existing procedure. Target override will not be provided
277DEBUG: Using group file /opt/local/var/macports/sources/rsync.macports.org/release/ports/_resources/port1.0/group/muniversal-1.0.tcl
278DEBUG: Reading variant descriptions from /opt/local/var/macports/sources/rsync.macports.org/release/ports/_resources/port1.0/variant_descriptions.conf
279DEBUG: Using group file /opt/local/var/macports/sources/rsync.macports.org/release/ports/_resources/port1.0/group/archcheck-1.0.tcl
280DEBUG: universal variant already exists, so not adding the default one
281DEBUG: Requested variant darwin is not provided by port gettext.
282DEBUG: Requested variant i386 is not provided by port gettext.
283DEBUG: Requested variant macosx is not provided by port gettext.
284DEBUG: Executing variant universal provides universal
285DEBUG: Found port in file:///opt/local/var/macports/sources/rsync.macports.org/release/ports/textproc/expat
286DEBUG: epoch: in tree: 0 installed: 0
287DEBUG: expat 2.0.1_0 exists in the ports tree
288DEBUG: expat 2.0.1_0  is the latest installed
289DEBUG: expat 2.0.1_0 +universal is active
290DEBUG: Merging existing variants universal into variants
291DEBUG: new fully merged portvariants: universal +
292DEBUG: Changing to port directory: /opt/local/var/macports/sources/rsync.macports.org/release/ports/textproc/expat
293DEBUG: OS Platform: darwin
294DEBUG: OS Version: 10.3.0
295DEBUG: Mac OS X Version: 10.6
296DEBUG: System Arch: i386
297DEBUG: setting option os.universal_supported to yes
298DEBUG: org.macports.load registered provides 'load', a pre-existing procedure. Target override will not be provided
299DEBUG: org.macports.unload registered provides 'unload', a pre-existing procedure. Target override will not be provided
300DEBUG: org.macports.distfiles registered provides 'distfiles', a pre-existing procedure. Target override will not be provided
301DEBUG: adding the default universal variant
302DEBUG: Reading variant descriptions from /opt/local/var/macports/sources/rsync.macports.org/release/ports/_resources/port1.0/variant_descriptions.conf
303DEBUG: Requested variant darwin is not provided by port expat.
304DEBUG: Requested variant i386 is not provided by port expat.
305DEBUG: Requested variant macosx is not provided by port expat.
306DEBUG: Executing variant universal provides universal
307DEBUG: No need to upgrade! expat 2.0.1_0 >= expat 2.0.1_0
308DEBUG: No need to upgrade! gettext 0.17_4 >= gettext 0.17_4
309DEBUG: Found port in file:///opt/local/var/macports/sources/rsync.macports.org/release/ports/devel/m4
310DEBUG: epoch: in tree: 0 installed: 0
311DEBUG: m4 1.4.14_0 exists in the ports tree
312DEBUG: m4 1.4.14_0 +universal is the latest installed
313DEBUG: m4 1.4.14_0 +universal is active
314DEBUG: Merging existing variants universal into variants
315DEBUG: new fully merged portvariants: universal +
316DEBUG: Changing to port directory: /opt/local/var/macports/sources/rsync.macports.org/release/ports/devel/m4
317DEBUG: OS Platform: darwin
318DEBUG: OS Version: 10.3.0
319DEBUG: Mac OS X Version: 10.6
320DEBUG: System Arch: i386
321DEBUG: setting option os.universal_supported to yes
322DEBUG: org.macports.load registered provides 'load', a pre-existing procedure. Target override will not be provided
323DEBUG: org.macports.unload registered provides 'unload', a pre-existing procedure. Target override will not be provided
324DEBUG: org.macports.distfiles registered provides 'distfiles', a pre-existing procedure. Target override will not be provided
325DEBUG: adding the default universal variant
326DEBUG: Reading variant descriptions from /opt/local/var/macports/sources/rsync.macports.org/release/ports/_resources/port1.0/variant_descriptions.conf
327DEBUG: Requested variant darwin is not provided by port m4.
328DEBUG: Requested variant i386 is not provided by port m4.
329DEBUG: Requested variant macosx is not provided by port m4.
330DEBUG: Executing variant universal provides universal
331DEBUG: No need to upgrade! m4 1.4.14_0 >= m4 1.4.14_0
332DEBUG: No need to upgrade! bison 2.4.2_0 >= bison 2.4.2_0
333--->  Computing dependencies for postgresql82
334DEBUG: Searching for dependency: readline
335DEBUG: Found Dependency: receipt exists for readline
336DEBUG: Searching for dependency: openssl
337DEBUG: Found Dependency: receipt exists for openssl
338DEBUG: Searching for dependency: zlib
339DEBUG: Found Dependency: receipt exists for zlib
340DEBUG: Searching for dependency: libxml2
341DEBUG: Found Dependency: receipt exists for libxml2
342DEBUG: Searching for dependency: libxslt
343DEBUG: Found Dependency: receipt exists for libxslt
344DEBUG: Searching for dependency: bison
345DEBUG: Found Dependency: receipt exists for bison
346DEBUG: Executing org.macports.main (postgresql82)
347--->  Fetching postgresql82
348DEBUG: Executing org.macports.fetch (postgresql82)
349--->  Verifying checksum(s) for postgresql82
350DEBUG: Executing org.macports.checksum (postgresql82)
351--->  Checksumming postgresql-8.2.16.tar.bz2
352DEBUG: Correct (md5) checksum for postgresql-8.2.16.tar.bz2
353DEBUG: Correct (sha1) checksum for postgresql-8.2.16.tar.bz2
354DEBUG: Correct (rmd160) checksum for postgresql-8.2.16.tar.bz2
355DEBUG: setting option extract.cmd to /usr/bin/bzip2
356--->  Extracting postgresql82
357DEBUG: Executing org.macports.extract (postgresql82)
358--->  Extracting postgresql-8.2.16.tar.bz2
359DEBUG: setting option extract.args to /opt/local/var/macports/distfiles/postgresql82/postgresql-8.2.16.tar.bz2
360DEBUG: Environment: MACOSX_DEPLOYMENT_TARGET='10.6'
361DEBUG: Assembled command: 'cd "/opt/local/var/macports/build/_opt_local_var_macports_sources_rsync.macports.org_release_ports_databases_postgresql82/work" && /usr/bin/bzip2 -dc /opt/local/var/macports/distfiles/postgresql82/postgresql-8.2.16.tar.bz2 | /usr/bin/gnutar --no-same-owner -xf -'
362DEBUG: Executing org.macports.patch (postgresql82)
363--->  Configuring postgresql82
364DEBUG: Using compiler 'Mac OS X gcc 4.2'
365DEBUG: Executing org.macports.configure (postgresql82)
366DEBUG: Environment: CFLAGS='-O2 -arch ppc -arch i386' CPPFLAGS='-I/opt/local/include' CXXFLAGS='-O2 -arch ppc -arch i386' MACOSX_DEPLOYMENT_TARGET='10.6' CXX='/usr/bin/g++-4.2' F90FLAGS='-O2' LDFLAGS='-L/opt/local/lib -arch ppc -arch i386' OBJC='/usr/bin/gcc-4.2' FCFLAGS='-O2' INSTALL='/usr/bin/install -c' OBJCFLAGS='-O2 -arch ppc -arch i386' FFLAGS='-O2' CC='/usr/bin/gcc-4.2'
367DEBUG: Assembled command: 'cd "/opt/local/var/macports/build/_opt_local_var_macports_sources_rsync.macports.org_release_ports_databases_postgresql82/work/postgresql-8.2.16" && ./configure --prefix=/opt/local --disable-dependency-tracking --sysconfdir=/opt/local/etc/postgresql82 --bindir=/opt/local/lib/postgresql82/bin --libdir=/opt/local/lib/postgresql82 --includedir=/opt/local/include/postgresql82 --datadir=/opt/local/share/postgresql82 --mandir=/opt/local/share/man --without-docdir --with-includes=/opt/local/include --with-libraries=/opt/local/lib --with-openssl --with-bonjour --with-readline --with-zlib --enable-thread-safety --enable-integer-datetimes'
368checking build system type... i386-apple-darwin10.3.0
369checking host system type... i386-apple-darwin10.3.0
370checking which template to use... darwin
371checking whether to build with 64-bit integer date/time support... yes
372checking whether NLS is wanted... no
373checking for default port number... 5432
374checking for C compiler default output file name... a.out
375checking whether the C compiler works... yes
376checking whether we are cross compiling... no
377checking for suffix of executables...
378checking for suffix of object files... o
379checking whether we are using the GNU C compiler... yes
380checking whether /usr/bin/gcc-4.2 accepts -g... yes
381checking for /usr/bin/gcc-4.2 option to accept ANSI C... none needed
382checking if /usr/bin/gcc-4.2 -no-cpp-precomp supports -Wdeclaration-after-statement... yes
383checking if /usr/bin/gcc-4.2 -no-cpp-precomp supports -Wendif-labels... yes
384checking if /usr/bin/gcc-4.2 -no-cpp-precomp supports -fno-strict-aliasing... yes
385checking if /usr/bin/gcc-4.2 -no-cpp-precomp supports -fwrapv... yes
386configure: using CFLAGS=-O2 -arch ppc -arch i386 -Wall -Wmissing-prototypes -Wpointer-arith -Winline -Wdeclaration-after-statement -Wendif-labels -fno-strict-aliasing -fwrapv
387checking whether the C compiler still works... yes
388checking how to run the C preprocessor... /usr/bin/gcc-4.2 -no-cpp-precomp -E
389checking allow thread-safe client libraries... yes
390checking whether to build with Tcl... no
391checking whether to build Perl modules... no
392checking whether to build Python modules... no
393checking whether to build with Kerberos 5 support... no
394checking whether to build with PAM support... no
395checking whether to build with LDAP support... no
396checking whether to build with Bonjour support... yes
397checking whether to build with OpenSSL support... yes
398checking for egrep... grep -E
399configure: using CPPFLAGS=-I/opt/local/include  -I/opt/local/include
400configure: using LDFLAGS=-L/opt/local/lib -arch ppc -arch i386  -L/opt/local/lib
401checking for gawk... gawk
402checking for flex... /usr/bin/flex
403checking whether ln -s works... yes
404checking for ld used by GCC... /usr/libexec/gcc/i686-apple-darwin10/4.2.1/ld
405checking if the linker (/usr/libexec/gcc/i686-apple-darwin10/4.2.1/ld) is GNU ld... no
406checking for ranlib... ranlib
407checking for tar... /usr/bin/tar
408checking for strip... strip
409checking whether it is possible to strip libraries... no
410checking for bison... bison -y
411checking for perl... /opt/local/bin/perl
412checking for main in -lm... yes
413checking for library containing setproctitle... no
414checking for library containing dlopen... none required
415checking for library containing socket... none required
416checking for library containing shl_load... no
417checking for library containing getopt_long... none required
418checking for library containing crypt... none required
419checking for library containing fdatasync... none required
420checking for library containing shmget... none required
421checking for -lreadline... yes (-lreadline)
422checking for inflate in -lz... yes
423checking for CRYPTO_new_ex_data in -lcrypto... yes
424checking for SSL_library_init in -lssl... yes
425checking for ANSI C header files... yes
426checking for sys/types.h... yes
427checking for sys/stat.h... yes
428checking for stdlib.h... yes
429checking for string.h... yes
430checking for memory.h... yes
431checking for strings.h... yes
432checking for inttypes.h... yes
433checking for stdint.h... yes
434checking for unistd.h... yes
435checking crypt.h usability... no
436checking crypt.h presence... no
437checking for crypt.h... no
438checking dld.h usability... no
439checking dld.h presence... no
440checking for dld.h... no
441checking endian.h usability... no
442checking endian.h presence... no
443checking for endian.h... no
444checking fp_class.h usability... no
445checking fp_class.h presence... no
446checking for fp_class.h... no
447checking getopt.h usability... yes
448checking getopt.h presence... yes
449checking for getopt.h... yes
450checking ieeefp.h usability... no
451checking ieeefp.h presence... no
452checking for ieeefp.h... no
453checking langinfo.h usability... yes
454checking langinfo.h presence... yes
455checking for langinfo.h... yes
456checking poll.h usability... yes
457checking poll.h presence... yes
458checking for poll.h... yes
459checking pwd.h usability... yes
460checking pwd.h presence... yes
461checking for pwd.h... yes
462checking sys/ipc.h usability... yes
463checking sys/ipc.h presence... yes
464checking for sys/ipc.h... yes
465checking sys/poll.h usability... yes
466checking sys/poll.h presence... yes
467checking for sys/poll.h... yes
468checking sys/pstat.h usability... no
469checking sys/pstat.h presence... no
470checking for sys/pstat.h... no
471checking sys/resource.h usability... yes
472checking sys/resource.h presence... yes
473checking for sys/resource.h... yes
474checking sys/select.h usability... yes
475checking sys/select.h presence... yes
476checking for sys/select.h... yes
477checking sys/sem.h usability... yes
478checking sys/sem.h presence... yes
479checking for sys/sem.h... yes
480checking sys/socket.h usability... yes
481checking sys/socket.h presence... yes
482checking for sys/socket.h... yes
483checking sys/shm.h usability... yes
484checking sys/shm.h presence... yes
485checking for sys/shm.h... yes
486checking sys/time.h usability... yes
487checking sys/time.h presence... yes
488checking for sys/time.h... yes
489checking sys/un.h usability... yes
490checking sys/un.h presence... yes
491checking for sys/un.h... yes
492checking termios.h usability... yes
493checking termios.h presence... yes
494checking for termios.h... yes
495checking utime.h usability... yes
496checking utime.h presence... yes
497checking for utime.h... yes
498checking wchar.h usability... yes
499checking wchar.h presence... yes
500checking for wchar.h... yes
501checking wctype.h usability... yes
502checking wctype.h presence... yes
503checking for wctype.h... yes
504checking kernel/OS.h usability... no
505checking kernel/OS.h presence... no
506checking for kernel/OS.h... no
507checking kernel/image.h usability... no
508checking kernel/image.h presence... no
509checking for kernel/image.h... no
510checking SupportDefs.h usability... no
511checking SupportDefs.h presence... no
512checking for SupportDefs.h... no
513checking netinet/in.h usability... yes
514checking netinet/in.h presence... yes
515checking for netinet/in.h... yes
516checking for netinet/tcp.h... yes
517checking readline/readline.h usability... yes
518checking readline/readline.h presence... yes
519checking for readline/readline.h... yes
520checking readline/history.h usability... yes
521checking readline/history.h presence... yes
522checking for readline/history.h... yes
523checking zlib.h usability... yes
524checking zlib.h presence... yes
525checking for zlib.h... yes
526checking openssl/ssl.h usability... yes
527checking openssl/ssl.h presence... yes
528checking for openssl/ssl.h... yes
529checking openssl/err.h usability... yes
530checking openssl/err.h presence... yes
531checking for openssl/err.h... yes
532checking DNSServiceDiscovery/DNSServiceDiscovery.h usability... yes
533checking DNSServiceDiscovery/DNSServiceDiscovery.h presence... yes
534checking for DNSServiceDiscovery/DNSServiceDiscovery.h... yes
535checking for an ANSI C-conforming const... yes
536checking for inline... inline
537checking for preprocessor stringizing operator... yes
538checking for signed types... yes
539checking for working volatile... yes
540checking for __func__... yes
541checking whether struct tm is in sys/time.h or time.h... time.h
542checking for struct tm.tm_zone... yes
543checking for tzname... yes
544checking for union semun... yes
545checking for struct sockaddr_un... yes
546checking for struct sockaddr_storage... yes
547checking for struct sockaddr_storage.ss_family... yes
548checking for struct sockaddr_storage.__ss_family... no
549checking for struct sockaddr_storage.ss_len... yes
550checking for struct sockaddr_storage.__ss_len... no
551checking for struct sockaddr.sa_len... yes
552checking for struct addrinfo... yes
553checking for struct cmsgcred... no
554checking for struct fcred... no
555checking for struct sockcred... no
556checking for struct option... yes
557checking for z_streamp... yes
558checking for int timezone... yes
559checking types of arguments for accept()... int, int, struct sockaddr *, socklen_t *
560checking whether gettimeofday takes only one argument... no
561checking for cbrt... yes
562checking for dlopen... yes
563checking for fcvt... yes
564checking for fdatasync... yes
565checking for getpeereid... yes
566checking for getrlimit... yes
567checking for memmove... yes
568checking for poll... yes
569checking for pstat... no
570checking for readlink... yes
571checking for setproctitle... no
572checking for setsid... yes
573checking for sigprocmask... yes
574checking for symlink... yes
575checking for sysconf... yes
576checking for towlower... yes
577checking for utime... yes
578checking for utimes... yes
579checking for waitpid... yes
580checking for wcstombs... yes
581checking whether fdatasync is declared... no
582checking whether posix_fadvise is declared... no
583checking whether strlcpy is declared... yes
584checking whether F_FULLFSYNC is declared... yes
585checking for struct sockaddr_in6... yes
586checking for PS_STRINGS... no
587checking for snprintf... yes
588checking for vsnprintf... yes
589checking whether snprintf is declared... yes
590checking whether vsnprintf is declared... yes
591checking for isinf... yes
592checking for crypt... yes
593checking for fseeko... yes
594checking for getopt... yes
595checking for getrusage... yes
596checking for inet_aton... yes
597checking for random... yes
598checking for rint... yes
599checking for srandom... yes
600checking for strdup... yes
601checking for strerror... yes
602checking for strlcpy... yes
603checking for strtol... yes
604checking for strtoul... yes
605checking for unsetenv... yes
606checking for getaddrinfo... yes
607checking for getopt_long... yes
608checking for rl_completion_append_character... yes
609checking for rl_completion_matches... yes
610checking for rl_filename_completion_function... yes
611checking for replace_history_entry... yes
612checking for finite... yes
613checking for sigsetjmp... yes
614checking for syslog... yes
615checking syslog.h usability... yes
616checking syslog.h presence... yes
617checking for syslog.h... yes
618checking for optreset... yes
619checking for strtoll... yes
620checking for strtoull... yes
621checking for atexit... yes
622checking for _LARGEFILE_SOURCE value needed for large files... no
623checking for fseeko... (cached) yes
624checking for the pthreads library -lpthreads... no
625checking whether pthreads work without any flags... yes
626checking whether pthreads work with -Kthread... yes
627checking whether pthreads work with -kthread... yes
628checking for the pthreads library -llthread... no
629checking whether pthreads work with -pthread... yes
630checking whether pthreads work with -pthreads... yes
631checking whether pthreads work with -mthreads... no
632checking for the pthreads library -lpthread... yes
633checking whether pthreads work with --thread-safe... no
634checking whether pthreads work with -mt... no
635checking for the pthreads library -lpthreadGC2... no
636checking pthread.h usability... yes
637checking pthread.h presence... yes
638checking for pthread.h... yes
639checking for strerror_r... yes
640checking for getpwuid_r... yes
641checking for gethostbyname_r... no
642checking whether getpwuid_r takes a fifth argument... yes
643checking whether strerror_r returns int... yes
644checking test program... ok
645checking whether long int is 64 bits... no
646checking whether long long int is 64 bits... yes
647checking snprintf format for long long int... %lld
648checking for unsigned long... yes
649checking size of unsigned long... 4
650checking for size_t... yes
651checking size of size_t... 4
652checking for short... yes
653checking alignment of short... 2
654checking for int... yes
655checking alignment of int... 4
656checking for long... yes
657checking alignment of long... 4
658checking for long long int... yes
659checking alignment of long long int... 4
660checking for double... yes
661checking alignment of double... 4
662checking for int8... no
663checking for uint8... no
664checking for int64... no
665checking for uint64... no
666checking for sig_atomic_t... yes
667checking for POSIX signal interface... yes
668checking for special C compiler options needed for large files... no
669checking for _FILE_OFFSET_BITS value needed for large files... no
670checking for _LARGE_FILES value needed for large files... no
671checking for working memcmp... yes
672checking for onsgmls... no
673checking for nsgmls... no
674checking for openjade... no
675checking for jade... no
676checking for DocBook V4.2... no
677checking for DocBook stylesheets... no
678checking for collateindex.pl... no
679checking for sgmlspl... no
680checking thread safety of required library functions... yes
681configure: creating ./config.status
682config.status: creating GNUmakefile
683config.status: creating src/Makefile.global
684config.status: creating src/include/pg_config.h
685config.status: creating src/interfaces/ecpg/include/ecpg_config.h
686config.status: linking ./src/backend/port/tas/dummy.s to src/backend/port/tas.s
687config.status: linking ./src/backend/port/dynloader/darwin.c to src/backend/port/dynloader.c
688config.status: linking ./src/backend/port/posix_sema.c to src/backend/port/pg_sema.c
689config.status: linking ./src/backend/port/sysv_shmem.c to src/backend/port/pg_shmem.c
690config.status: linking ./src/backend/port/dynloader/darwin.h to src/include/dynloader.h
691config.status: linking ./src/include/port/darwin.h to src/include/pg_config_os.h
692config.status: linking ./src/makefiles/Makefile.darwin to src/Makefile.port
693configure: WARNING: option ignored: --enable-dependency-tracking
694--->  Building postgresql82
695DEBUG: Executing org.macports.build (postgresql82)
696DEBUG: Environment: MACOSX_DEPLOYMENT_TARGET='10.6'
697DEBUG: Assembled command: 'cd "/opt/local/var/macports/build/_opt_local_var_macports_sources_rsync.macports.org_release_ports_databases_postgresql82/work/postgresql-8.2.16" && /usr/bin/gnumake -j1'
698/usr/bin/gnumake -C doc all
699gzip -d -c man.tar.gz | /usr/bin/tar xf -
700for file in man1/*.1; do \
701          mv $file $file.bak && \
702          sed -e 's/\\fR(l)/\\fR(7)/' $file.bak >$file && \
703          rm -f $file.bak || exit; \
704        done
705/bin/sh ../config/mkinstalldirs man7
706mkdir man7
707for file in manl/*.l; do \
708          sed -e '/^\.TH/s/"l"/"7"/'   \
709              -e 's/\\fR(l)/\\fR(7)/' \
710              $file >man7/`basename $file | sed 's/.l$/.7/'` || exit; \
711        done
712/usr/bin/gnumake -C src all
713/usr/bin/gnumake -C port all
714/usr/bin/gcc-4.2 -no-cpp-precomp -O2 -arch ppc -arch i386 -Wall -Wmissing-prototypes -Wpointer-arith -Winline -Wdeclaration-after-statement -Wendif-labels -fno-strict-aliasing -fwrapv -I../../src/port -DFRONTEND -I../../src/include -I/opt/local/include  -I/opt/local/include  -c -o copydir.o copydir.c
715/usr/bin/gcc-4.2 -no-cpp-precomp -O2 -arch ppc -arch i386 -Wall -Wmissing-prototypes -Wpointer-arith -Winline -Wdeclaration-after-statement -Wendif-labels -fno-strict-aliasing -fwrapv -I../../src/port -DFRONTEND -I../../src/include -I/opt/local/include  -I/opt/local/include  -c -o dirmod.o dirmod.c
716/usr/bin/gcc-4.2 -no-cpp-precomp -O2 -arch ppc -arch i386 -Wall -Wmissing-prototypes -Wpointer-arith -Winline -Wdeclaration-after-statement -Wendif-labels -fno-strict-aliasing -fwrapv -I../../src/port -DFRONTEND -I../../src/include -I/opt/local/include  -I/opt/local/include  -c -o exec.o exec.c
717/usr/bin/gcc-4.2 -no-cpp-precomp -O2 -arch ppc -arch i386 -Wall -Wmissing-prototypes -Wpointer-arith -Winline -Wdeclaration-after-statement -Wendif-labels -fno-strict-aliasing -fwrapv -I../../src/port -DFRONTEND -I../../src/include -I/opt/local/include  -I/opt/local/include  -c -o noblock.o noblock.c
718echo "#define PGBINDIR \"/opt/local/lib/postgresql82/bin\"" >pg_config_paths.h
719echo "#define PGSHAREDIR \"/opt/local/share/postgresql82\"" >>pg_config_paths.h
720echo "#define SYSCONFDIR \"/opt/local/etc/postgresql82\"" >>pg_config_paths.h
721echo "#define INCLUDEDIR \"/opt/local/include/postgresql82\"" >>pg_config_paths.h
722echo "#define PKGINCLUDEDIR \"/opt/local/include/postgresql82\"" >>pg_config_paths.h
723echo "#define INCLUDEDIRSERVER \"/opt/local/include/postgresql82/server\"" >>pg_config_paths.h
724echo "#define LIBDIR \"/opt/local/lib/postgresql82\"" >>pg_config_paths.h
725echo "#define PKGLIBDIR \"/opt/local/lib/postgresql82\"" >>pg_config_paths.h
726echo "#define LOCALEDIR \"\"" >>pg_config_paths.h
727echo "#define DOCDIR \"\"" >>pg_config_paths.h
728echo "#define MANDIR \"/opt/local/share/man\"" >>pg_config_paths.h
729/usr/bin/gcc-4.2 -no-cpp-precomp -O2 -arch ppc -arch i386 -Wall -Wmissing-prototypes -Wpointer-arith -Winline -Wdeclaration-after-statement -Wendif-labels -fno-strict-aliasing -fwrapv -I../../src/port -DFRONTEND -I../../src/include -I/opt/local/include  -I/opt/local/include  -c -o path.o path.c
730/usr/bin/gcc-4.2 -no-cpp-precomp -O2 -arch ppc -arch i386 -Wall -Wmissing-prototypes -Wpointer-arith -Winline -Wdeclaration-after-statement -Wendif-labels -fno-strict-aliasing -fwrapv -I../../src/port -DFRONTEND -I../../src/include -I/opt/local/include  -I/opt/local/include  -c -o pipe.o pipe.c
731/usr/bin/gcc-4.2 -no-cpp-precomp -O2 -arch ppc -arch i386 -Wall -Wmissing-prototypes -Wpointer-arith -Winline -Wdeclaration-after-statement -Wendif-labels -fno-strict-aliasing -fwrapv -I../../src/port -DFRONTEND -I../../src/include -I/opt/local/include  -I/opt/local/include  -c -o pgsleep.o pgsleep.c
732/usr/bin/gcc-4.2 -no-cpp-precomp -O2 -arch ppc -arch i386 -Wall -Wmissing-prototypes -Wpointer-arith -Winline -Wdeclaration-after-statement -Wendif-labels -fno-strict-aliasing -fwrapv -I../../src/port -DFRONTEND -I../../src/include -I/opt/local/include  -I/opt/local/include  -c -o pgstrcasecmp.o pgstrcasecmp.c
733/usr/bin/gcc-4.2 -no-cpp-precomp -O2 -arch ppc -arch i386 -Wall -Wmissing-prototypes -Wpointer-arith -Winline -Wdeclaration-after-statement -Wendif-labels -fno-strict-aliasing -fwrapv -I../../src/port -DFRONTEND -I../../src/include -I/opt/local/include  -I/opt/local/include  -c -o qsort.o qsort.c
734/usr/bin/gcc-4.2 -no-cpp-precomp -O2 -arch ppc -arch i386 -Wall -Wmissing-prototypes -Wpointer-arith -Winline -Wdeclaration-after-statement -Wendif-labels -fno-strict-aliasing -fwrapv -I../../src/port -DFRONTEND -I../../src/include -I/opt/local/include  -I/opt/local/include  -c -o qsort_arg.o qsort_arg.c
735/usr/bin/gcc-4.2 -no-cpp-precomp -O2 -arch ppc -arch i386 -Wall -Wmissing-prototypes -Wpointer-arith -Winline -Wdeclaration-after-statement -Wendif-labels -fno-strict-aliasing -fwrapv -I../../src/port -DFRONTEND -I../../src/include -I/opt/local/include  -I/opt/local/include  -c -o sprompt.o sprompt.c
736/usr/bin/gcc-4.2 -no-cpp-precomp -O2 -arch ppc -arch i386 -Wall -Wmissing-prototypes -Wpointer-arith -Winline -Wdeclaration-after-statement -Wendif-labels -fno-strict-aliasing -fwrapv -I../../src/port -DFRONTEND -I../../src/include -I/opt/local/include  -I/opt/local/include -Kthread -kthread -pthread -pthreads  -D_REENTRANT -D_THREAD_SAFE -D_POSIX_PTHREAD_SEMANTICS -c thread.c
737ar crs libpgport.a copydir.o dirmod.o exec.o noblock.o path.o pipe.o pgsleep.o pgstrcasecmp.o qsort.o qsort_arg.o sprompt.o thread.o
738/usr/bin/ranlib: archive library: libpgport.a will be fat and ar(1) will not be able to operate on it
739/usr/bin/ranlib: for architecture: ppc file: libpgport.a(pipe.o) has no symbols
740/usr/bin/ranlib: for architecture: i386 file: libpgport.a(pipe.o) has no symbols
741/usr/bin/gcc-4.2 -no-cpp-precomp -O2 -arch ppc -arch i386 -Wall -Wmissing-prototypes -Wpointer-arith -Winline -Wdeclaration-after-statement -Wendif-labels -fno-strict-aliasing -fwrapv  -I../../src/port  -I../../src/include -I/opt/local/include  -I/opt/local/include -c copydir.c -o copydir_srv.o
742/usr/bin/gcc-4.2 -no-cpp-precomp -O2 -arch ppc -arch i386 -Wall -Wmissing-prototypes -Wpointer-arith -Winline -Wdeclaration-after-statement -Wendif-labels -fno-strict-aliasing -fwrapv  -I../../src/port  -I../../src/include -I/opt/local/include  -I/opt/local/include -c dirmod.c -o dirmod_srv.o
743/usr/bin/gcc-4.2 -no-cpp-precomp -O2 -arch ppc -arch i386 -Wall -Wmissing-prototypes -Wpointer-arith -Winline -Wdeclaration-after-statement -Wendif-labels -fno-strict-aliasing -fwrapv  -I../../src/port  -I../../src/include -I/opt/local/include  -I/opt/local/include -c exec.c -o exec_srv.o
744/usr/bin/gcc-4.2 -no-cpp-precomp -O2 -arch ppc -arch i386 -Wall -Wmissing-prototypes -Wpointer-arith -Winline -Wdeclaration-after-statement -Wendif-labels -fno-strict-aliasing -fwrapv  -I../../src/port  -I../../src/include -I/opt/local/include  -I/opt/local/include -c noblock.c -o noblock_srv.o
745/usr/bin/gcc-4.2 -no-cpp-precomp -O2 -arch ppc -arch i386 -Wall -Wmissing-prototypes -Wpointer-arith -Winline -Wdeclaration-after-statement -Wendif-labels -fno-strict-aliasing -fwrapv  -I../../src/port  -I../../src/include -I/opt/local/include  -I/opt/local/include -c path.c -o path_srv.o
746/usr/bin/gcc-4.2 -no-cpp-precomp -O2 -arch ppc -arch i386 -Wall -Wmissing-prototypes -Wpointer-arith -Winline -Wdeclaration-after-statement -Wendif-labels -fno-strict-aliasing -fwrapv  -I../../src/port  -I../../src/include -I/opt/local/include  -I/opt/local/include -c pipe.c -o pipe_srv.o
747/usr/bin/gcc-4.2 -no-cpp-precomp -O2 -arch ppc -arch i386 -Wall -Wmissing-prototypes -Wpointer-arith -Winline -Wdeclaration-after-statement -Wendif-labels -fno-strict-aliasing -fwrapv  -I../../src/port  -I../../src/include -I/opt/local/include  -I/opt/local/include -c pgsleep.c -o pgsleep_srv.o
748/usr/bin/gcc-4.2 -no-cpp-precomp -O2 -arch ppc -arch i386 -Wall -Wmissing-prototypes -Wpointer-arith -Winline -Wdeclaration-after-statement -Wendif-labels -fno-strict-aliasing -fwrapv  -I../../src/port  -I../../src/include -I/opt/local/include  -I/opt/local/include -c pgstrcasecmp.c -o pgstrcasecmp_srv.o
749/usr/bin/gcc-4.2 -no-cpp-precomp -O2 -arch ppc -arch i386 -Wall -Wmissing-prototypes -Wpointer-arith -Winline -Wdeclaration-after-statement -Wendif-labels -fno-strict-aliasing -fwrapv  -I../../src/port  -I../../src/include -I/opt/local/include  -I/opt/local/include -c qsort.c -o qsort_srv.o
750/usr/bin/gcc-4.2 -no-cpp-precomp -O2 -arch ppc -arch i386 -Wall -Wmissing-prototypes -Wpointer-arith -Winline -Wdeclaration-after-statement -Wendif-labels -fno-strict-aliasing -fwrapv  -I../../src/port  -I../../src/include -I/opt/local/include  -I/opt/local/include -c qsort_arg.c -o qsort_arg_srv.o
751/usr/bin/gcc-4.2 -no-cpp-precomp -O2 -arch ppc -arch i386 -Wall -Wmissing-prototypes -Wpointer-arith -Winline -Wdeclaration-after-statement -Wendif-labels -fno-strict-aliasing -fwrapv  -I../../src/port  -I../../src/include -I/opt/local/include  -I/opt/local/include -c sprompt.c -o sprompt_srv.o
752/usr/bin/gcc-4.2 -no-cpp-precomp -O2 -arch ppc -arch i386 -Wall -Wmissing-prototypes -Wpointer-arith -Winline -Wdeclaration-after-statement -Wendif-labels -fno-strict-aliasing -fwrapv  -I../../src/port  -I../../src/include -I/opt/local/include  -I/opt/local/include -c thread.c -o thread_srv.o
753ar crs libpgport_srv.a copydir_srv.o dirmod_srv.o exec_srv.o noblock_srv.o path_srv.o pipe_srv.o pgsleep_srv.o pgstrcasecmp_srv.o qsort_srv.o qsort_arg_srv.o sprompt_srv.o thread_srv.o
754/usr/bin/ranlib: archive library: libpgport_srv.a will be fat and ar(1) will not be able to operate on it
755/usr/bin/ranlib: for architecture: ppc file: libpgport_srv.a(pipe_srv.o) has no symbols
756/usr/bin/ranlib: for architecture: i386 file: libpgport_srv.a(pipe_srv.o) has no symbols
757/usr/bin/gnumake -C timezone all
758/usr/bin/gcc-4.2 -no-cpp-precomp -O2 -arch ppc -arch i386 -Wall -Wmissing-prototypes -Wpointer-arith -Winline -Wdeclaration-after-statement -Wendif-labels -fno-strict-aliasing -fwrapv -I../../src/include -I/opt/local/include  -I/opt/local/include  -c -o localtime.o localtime.c
759/usr/bin/gcc-4.2 -no-cpp-precomp -O2 -arch ppc -arch i386 -Wall -Wmissing-prototypes -Wpointer-arith -Winline -Wdeclaration-after-statement -Wendif-labels -fno-strict-aliasing -fwrapv -I../../src/include -I/opt/local/include  -I/opt/local/include  -c -o strftime.o strftime.c
760/usr/bin/gcc-4.2 -no-cpp-precomp -O2 -arch ppc -arch i386 -Wall -Wmissing-prototypes -Wpointer-arith -Winline -Wdeclaration-after-statement -Wendif-labels -fno-strict-aliasing -fwrapv -I../../src/include -I/opt/local/include  -I/opt/local/include  -c -o pgtz.o pgtz.c
761/usr/libexec/gcc/i686-apple-darwin10/4.2.1/ld -r -o SUBSYS.o localtime.o strftime.o pgtz.o
762ld: warning: -arch not specified
763ld: warning: in localtime.o, missing required architecture x86_64 in file
764ld: warning: in strftime.o, missing required architecture x86_64 in file
765ld: warning: in pgtz.o, missing required architecture x86_64 in file
766/usr/bin/gnumake -C ../../src/port all
767gnumake[3]: Nothing to be done for `all'.
768/usr/bin/gcc-4.2 -no-cpp-precomp -O2 -arch ppc -arch i386 -Wall -Wmissing-prototypes -Wpointer-arith -Winline -Wdeclaration-after-statement -Wendif-labels -fno-strict-aliasing -fwrapv -I../../src/include -I/opt/local/include  -I/opt/local/include  -c -o zic.o zic.c
769/usr/bin/gcc-4.2 -no-cpp-precomp -O2 -arch ppc -arch i386 -Wall -Wmissing-prototypes -Wpointer-arith -Winline -Wdeclaration-after-statement -Wendif-labels -fno-strict-aliasing -fwrapv -I../../src/include -I/opt/local/include  -I/opt/local/include  -c -o ialloc.o ialloc.c
770/usr/bin/gcc-4.2 -no-cpp-precomp -O2 -arch ppc -arch i386 -Wall -Wmissing-prototypes -Wpointer-arith -Winline -Wdeclaration-after-statement -Wendif-labels -fno-strict-aliasing -fwrapv -I../../src/include -I/opt/local/include  -I/opt/local/include  -c -o scheck.o scheck.c
771/usr/bin/gcc-4.2 -no-cpp-precomp -O2 -arch ppc -arch i386 -Wall -Wmissing-prototypes -Wpointer-arith -Winline -Wdeclaration-after-statement -Wendif-labels -fno-strict-aliasing -fwrapv zic.o ialloc.o scheck.o localtime.o -L../../src/port -L/opt/local/lib -arch ppc -arch i386  -L/opt/local/lib  -lpgport -lssl -lcrypto -lz -lreadline -lm  -o zic
772/usr/bin/gnumake -C backend all
773/usr/bin/gnumake -C ../../src/port all
774gnumake[3]: Nothing to be done for `all'.
775prereqdir=`cd parser/ >/dev/null && pwd` && \
776          cd ../../src/include/parser/ && rm -f parse.h && \
777          ln -s "$prereqdir/parse.h" .
778/usr/bin/gnumake -C utils fmgroids.h
779AWK='awk' /bin/sh Gen_fmgrtab.sh ../../../src/include/catalog/pg_proc.h
780cd ../../src/include/utils/ && rm -f fmgroids.h && \
781            ln -s ../../../src/backend/utils/fmgroids.h .
782/usr/bin/gnumake -C access all
783/usr/bin/gnumake -C common SUBSYS.o
784/usr/bin/gcc-4.2 -no-cpp-precomp -O2 -arch ppc -arch i386 -Wall -Wmissing-prototypes -Wpointer-arith -Winline -Wdeclaration-after-statement -Wendif-labels -fno-strict-aliasing -fwrapv -I../../../../src/include -I/opt/local/include  -I/opt/local/include  -c -o heaptuple.o heaptuple.c
785/usr/bin/gcc-4.2 -no-cpp-precomp -O2 -arch ppc -arch i386 -Wall -Wmissing-prototypes -Wpointer-arith -Winline -Wdeclaration-after-statement -Wendif-labels -fno-strict-aliasing -fwrapv -I../../../../src/include -I/opt/local/include  -I/opt/local/include  -c -o indextuple.o indextuple.c
786/usr/bin/gcc-4.2 -no-cpp-precomp -O2 -arch ppc -arch i386 -Wall -Wmissing-prototypes -Wpointer-arith -Winline -Wdeclaration-after-statement -Wendif-labels -fno-strict-aliasing -fwrapv -I../../../../src/include -I/opt/local/include  -I/opt/local/include  -c -o printtup.o printtup.c
787/usr/bin/gcc-4.2 -no-cpp-precomp -O2 -arch ppc -arch i386 -Wall -Wmissing-prototypes -Wpointer-arith -Winline -Wdeclaration-after-statement -Wendif-labels -fno-strict-aliasing -fwrapv -I../../../../src/include -I/opt/local/include  -I/opt/local/include  -c -o reloptions.o reloptions.c
788/usr/bin/gcc-4.2 -no-cpp-precomp -O2 -arch ppc -arch i386 -Wall -Wmissing-prototypes -Wpointer-arith -Winline -Wdeclaration-after-statement -Wendif-labels -fno-strict-aliasing -fwrapv -I../../../../src/include -I/opt/local/include  -I/opt/local/include  -c -o scankey.o scankey.c
789/usr/bin/gcc-4.2 -no-cpp-precomp -O2 -arch ppc -arch i386 -Wall -Wmissing-prototypes -Wpointer-arith -Winline -Wdeclaration-after-statement -Wendif-labels -fno-strict-aliasing -fwrapv -I../../../../src/include -I/opt/local/include  -I/opt/local/include  -c -o tupdesc.o tupdesc.c
790/usr/libexec/gcc/i686-apple-darwin10/4.2.1/ld -r -o SUBSYS.o heaptuple.o indextuple.o printtup.o reloptions.o scankey.o tupdesc.o 
791ld: warning: -arch not specified
792ld: warning: in heaptuple.o, missing required architecture x86_64 in file
793ld: warning: in indextuple.o, missing required architecture x86_64 in file
794ld: warning: in printtup.o, missing required architecture x86_64 in file
795ld: warning: in reloptions.o, missing required architecture x86_64 in file
796ld: warning: in scankey.o, missing required architecture x86_64 in file
797ld: warning: in tupdesc.o, missing required architecture x86_64 in file
798/usr/bin/gnumake -C gist SUBSYS.o
799/usr/bin/gcc-4.2 -no-cpp-precomp -O2 -arch ppc -arch i386 -Wall -Wmissing-prototypes -Wpointer-arith -Winline -Wdeclaration-after-statement -Wendif-labels -fno-strict-aliasing -fwrapv -I../../../../src/include -I/opt/local/include  -I/opt/local/include  -c -o gist.o gist.c
800/usr/bin/gcc-4.2 -no-cpp-precomp -O2 -arch ppc -arch i386 -Wall -Wmissing-prototypes -Wpointer-arith -Winline -Wdeclaration-after-statement -Wendif-labels -fno-strict-aliasing -fwrapv -I../../../../src/include -I/opt/local/include  -I/opt/local/include  -c -o gistutil.o gistutil.c
801/usr/bin/gcc-4.2 -no-cpp-precomp -O2 -arch ppc -arch i386 -Wall -Wmissing-prototypes -Wpointer-arith -Winline -Wdeclaration-after-statement -Wendif-labels -fno-strict-aliasing -fwrapv -I../../../../src/include -I/opt/local/include  -I/opt/local/include  -c -o gistxlog.o gistxlog.c
802/usr/bin/gcc-4.2 -no-cpp-precomp -O2 -arch ppc -arch i386 -Wall -Wmissing-prototypes -Wpointer-arith -Winline -Wdeclaration-after-statement -Wendif-labels -fno-strict-aliasing -fwrapv -I../../../../src/include -I/opt/local/include  -I/opt/local/include  -c -o gistvacuum.o gistvacuum.c
803/usr/bin/gcc-4.2 -no-cpp-precomp -O2 -arch ppc -arch i386 -Wall -Wmissing-prototypes -Wpointer-arith -Winline -Wdeclaration-after-statement -Wendif-labels -fno-strict-aliasing -fwrapv -I../../../../src/include -I/opt/local/include  -I/opt/local/include  -c -o gistget.o gistget.c
804/usr/bin/gcc-4.2 -no-cpp-precomp -O2 -arch ppc -arch i386 -Wall -Wmissing-prototypes -Wpointer-arith -Winline -Wdeclaration-after-statement -Wendif-labels -fno-strict-aliasing -fwrapv -I../../../../src/include -I/opt/local/include  -I/opt/local/include  -c -o gistscan.o gistscan.c
805/usr/bin/gcc-4.2 -no-cpp-precomp -O2 -arch ppc -arch i386 -Wall -Wmissing-prototypes -Wpointer-arith -Winline -Wdeclaration-after-statement -Wendif-labels -fno-strict-aliasing -fwrapv -I../../../../src/include -I/opt/local/include  -I/opt/local/include  -c -o gistproc.o gistproc.c
806/usr/bin/gcc-4.2 -no-cpp-precomp -O2 -arch ppc -arch i386 -Wall -Wmissing-prototypes -Wpointer-arith -Winline -Wdeclaration-after-statement -Wendif-labels -fno-strict-aliasing -fwrapv -I../../../../src/include -I/opt/local/include  -I/opt/local/include  -c -o gistsplit.o gistsplit.c
807/usr/libexec/gcc/i686-apple-darwin10/4.2.1/ld -r -o SUBSYS.o gist.o gistutil.o gistxlog.o gistvacuum.o gistget.o gistscan.o gistproc.o gistsplit.o
808ld: warning: -arch not specified
809ld: warning: in gist.o, missing required architecture x86_64 in file
810ld: warning: in gistutil.o, missing required architecture x86_64 in file
811ld: warning: in gistxlog.o, missing required architecture x86_64 in file
812ld: warning: in gistvacuum.o, missing required architecture x86_64 in file
813ld: warning: in gistget.o, missing required architecture x86_64 in file
814ld: warning: in gistscan.o, missing required architecture x86_64 in file
815ld: warning: in gistproc.o, missing required architecture x86_64 in file
816ld: warning: in gistsplit.o, missing required architecture x86_64 in file
817/usr/bin/gnumake -C hash SUBSYS.o
818/usr/bin/gcc-4.2 -no-cpp-precomp -O2 -arch ppc -arch i386 -Wall -Wmissing-prototypes -Wpointer-arith -Winline -Wdeclaration-after-statement -Wendif-labels -fno-strict-aliasing -fwrapv -I../../../../src/include -I/opt/local/include  -I/opt/local/include  -c -o hash.o hash.c
819/usr/bin/gcc-4.2 -no-cpp-precomp -O2 -arch ppc -arch i386 -Wall -Wmissing-prototypes -Wpointer-arith -Winline -Wdeclaration-after-statement -Wendif-labels -fno-strict-aliasing -fwrapv -I../../../../src/include -I/opt/local/include  -I/opt/local/include  -c -o hashfunc.o hashfunc.c
820/usr/bin/gcc-4.2 -no-cpp-precomp -O2 -arch ppc -arch i386 -Wall -Wmissing-prototypes -Wpointer-arith -Winline -Wdeclaration-after-statement -Wendif-labels -fno-strict-aliasing -fwrapv -I../../../../src/include -I/opt/local/include  -I/opt/local/include  -c -o hashinsert.o hashinsert.c
821/usr/bin/gcc-4.2 -no-cpp-precomp -O2 -arch ppc -arch i386 -Wall -Wmissing-prototypes -Wpointer-arith -Winline -Wdeclaration-after-statement -Wendif-labels -fno-strict-aliasing -fwrapv -I../../../../src/include -I/opt/local/include  -I/opt/local/include  -c -o hashovfl.o hashovfl.c
822/usr/bin/gcc-4.2 -no-cpp-precomp -O2 -arch ppc -arch i386 -Wall -Wmissing-prototypes -Wpointer-arith -Winline -Wdeclaration-after-statement -Wendif-labels -fno-strict-aliasing -fwrapv -I../../../../src/include -I/opt/local/include  -I/opt/local/include  -c -o hashpage.o hashpage.c
823/usr/bin/gcc-4.2 -no-cpp-precomp -O2 -arch ppc -arch i386 -Wall -Wmissing-prototypes -Wpointer-arith -Winline -Wdeclaration-after-statement -Wendif-labels -fno-strict-aliasing -fwrapv -I../../../../src/include -I/opt/local/include  -I/opt/local/include  -c -o hashscan.o hashscan.c
824/usr/bin/gcc-4.2 -no-cpp-precomp -O2 -arch ppc -arch i386 -Wall -Wmissing-prototypes -Wpointer-arith -Winline -Wdeclaration-after-statement -Wendif-labels -fno-strict-aliasing -fwrapv -I../../../../src/include -I/opt/local/include  -I/opt/local/include  -c -o hashsearch.o hashsearch.c
825/usr/bin/gcc-4.2 -no-cpp-precomp -O2 -arch ppc -arch i386 -Wall -Wmissing-prototypes -Wpointer-arith -Winline -Wdeclaration-after-statement -Wendif-labels -fno-strict-aliasing -fwrapv -I../../../../src/include -I/opt/local/include  -I/opt/local/include  -c -o hashutil.o hashutil.c
826/usr/libexec/gcc/i686-apple-darwin10/4.2.1/ld -r -o SUBSYS.o hash.o hashfunc.o hashinsert.o hashovfl.o hashpage.o hashscan.o hashsearch.o hashutil.o
827ld: warning: -arch not specified
828ld: warning: in hash.o, missing required architecture x86_64 in file
829ld: warning: in hashfunc.o, missing required architecture x86_64 in file
830ld: warning: in hashinsert.o, missing required architecture x86_64 in file
831ld: warning: in hashovfl.o, missing required architecture x86_64 in file
832ld: warning: in hashpage.o, missing required architecture x86_64 in file
833ld: warning: in hashscan.o, missing required architecture x86_64 in file
834ld: warning: in hashsearch.o, missing required architecture x86_64 in file
835ld: warning: in hashutil.o, missing required architecture x86_64 in file
836/usr/bin/gnumake -C heap SUBSYS.o
837/usr/bin/gcc-4.2 -no-cpp-precomp -O2 -arch ppc -arch i386 -Wall -Wmissing-prototypes -Wpointer-arith -Winline -Wdeclaration-after-statement -Wendif-labels -fno-strict-aliasing -fwrapv -I../../../../src/include -I/opt/local/include  -I/opt/local/include  -c -o heapam.o heapam.c
838/usr/bin/gcc-4.2 -no-cpp-precomp -O2 -arch ppc -arch i386 -Wall -Wmissing-prototypes -Wpointer-arith -Winline -Wdeclaration-after-statement -Wendif-labels -fno-strict-aliasing -fwrapv -I../../../../src/include -I/opt/local/include  -I/opt/local/include  -c -o hio.o hio.c
839/usr/bin/gcc-4.2 -no-cpp-precomp -O2 -arch ppc -arch i386 -Wall -Wmissing-prototypes -Wpointer-arith -Winline -Wdeclaration-after-statement -Wendif-labels -fno-strict-aliasing -fwrapv -I../../../../src/include -I/opt/local/include  -I/opt/local/include  -c -o tuptoaster.o tuptoaster.c
840/usr/libexec/gcc/i686-apple-darwin10/4.2.1/ld -r -o SUBSYS.o heapam.o hio.o tuptoaster.o
841ld: warning: -arch not specified
842ld: warning: in heapam.o, missing required architecture x86_64 in file
843ld: warning: in hio.o, missing required architecture x86_64 in file
844ld: warning: in tuptoaster.o, missing required architecture x86_64 in file
845/usr/bin/gnumake -C index SUBSYS.o
846/usr/bin/gcc-4.2 -no-cpp-precomp -O2 -arch ppc -arch i386 -Wall -Wmissing-prototypes -Wpointer-arith -Winline -Wdeclaration-after-statement -Wendif-labels -fno-strict-aliasing -fwrapv -I../../../../src/include -I/opt/local/include  -I/opt/local/include  -c -o genam.o genam.c
847/usr/bin/gcc-4.2 -no-cpp-precomp -O2 -arch ppc -arch i386 -Wall -Wmissing-prototypes -Wpointer-arith -Winline -Wdeclaration-after-statement -Wendif-labels -fno-strict-aliasing -fwrapv -I../../../../src/include -I/opt/local/include  -I/opt/local/include  -c -o indexam.o indexam.c
848/usr/libexec/gcc/i686-apple-darwin10/4.2.1/ld -r -o SUBSYS.o genam.o indexam.o
849ld: warning: -arch not specified
850ld: warning: in genam.o, missing required architecture x86_64 in file
851ld: warning: in indexam.o, missing required architecture x86_64 in file
852/usr/bin/gnumake -C nbtree SUBSYS.o
853/usr/bin/gcc-4.2 -no-cpp-precomp -O2 -arch ppc -arch i386 -Wall -Wmissing-prototypes -Wpointer-arith -Winline -Wdeclaration-after-statement -Wendif-labels -fno-strict-aliasing -fwrapv -I../../../../src/include -I/opt/local/include  -I/opt/local/include  -c -o nbtcompare.o nbtcompare.c
854/usr/bin/gcc-4.2 -no-cpp-precomp -O2 -arch ppc -arch i386 -Wall -Wmissing-prototypes -Wpointer-arith -Winline -Wdeclaration-after-statement -Wendif-labels -fno-strict-aliasing -fwrapv -I../../../../src/include -I/opt/local/include  -I/opt/local/include  -c -o nbtinsert.o nbtinsert.c
855/usr/bin/gcc-4.2 -no-cpp-precomp -O2 -arch ppc -arch i386 -Wall -Wmissing-prototypes -Wpointer-arith -Winline -Wdeclaration-after-statement -Wendif-labels -fno-strict-aliasing -fwrapv -I../../../../src/include -I/opt/local/include  -I/opt/local/include  -c -o nbtpage.o nbtpage.c
856/usr/bin/gcc-4.2 -no-cpp-precomp -O2 -arch ppc -arch i386 -Wall -Wmissing-prototypes -Wpointer-arith -Winline -Wdeclaration-after-statement -Wendif-labels -fno-strict-aliasing -fwrapv -I../../../../src/include -I/opt/local/include  -I/opt/local/include  -c -o nbtree.o nbtree.c
857/usr/bin/gcc-4.2 -no-cpp-precomp -O2 -arch ppc -arch i386 -Wall -Wmissing-prototypes -Wpointer-arith -Winline -Wdeclaration-after-statement -Wendif-labels -fno-strict-aliasing -fwrapv -I../../../../src/include -I/opt/local/include  -I/opt/local/include  -c -o nbtsearch.o nbtsearch.c
858/usr/bin/gcc-4.2 -no-cpp-precomp -O2 -arch ppc -arch i386 -Wall -Wmissing-prototypes -Wpointer-arith -Winline -Wdeclaration-after-statement -Wendif-labels -fno-strict-aliasing -fwrapv -I../../../../src/include -I/opt/local/include  -I/opt/local/include  -c -o nbtutils.o nbtutils.c
859/usr/bin/gcc-4.2 -no-cpp-precomp -O2 -arch ppc -arch i386 -Wall -Wmissing-prototypes -Wpointer-arith -Winline -Wdeclaration-after-statement -Wendif-labels -fno-strict-aliasing -fwrapv -I../../../../src/include -I/opt/local/include  -I/opt/local/include  -c -o nbtsort.o nbtsort.c
860/usr/bin/gcc-4.2 -no-cpp-precomp -O2 -arch ppc -arch i386 -Wall -Wmissing-prototypes -Wpointer-arith -Winline -Wdeclaration-after-statement -Wendif-labels -fno-strict-aliasing -fwrapv -I../../../../src/include -I/opt/local/include  -I/opt/local/include  -c -o nbtxlog.o nbtxlog.c
861/usr/libexec/gcc/i686-apple-darwin10/4.2.1/ld -r -o SUBSYS.o nbtcompare.o nbtinsert.o nbtpage.o nbtree.o nbtsearch.o nbtutils.o nbtsort.o nbtxlog.o
862ld: warning: -arch not specified
863ld: warning: in nbtcompare.o, missing required architecture x86_64 in file
864ld: warning: in nbtinsert.o, missing required architecture x86_64 in file
865ld: warning: in nbtpage.o, missing required architecture x86_64 in file
866ld: warning: in nbtree.o, missing required architecture x86_64 in file
867ld: warning: in nbtsearch.o, missing required architecture x86_64 in file
868ld: warning: in nbtutils.o, missing required architecture x86_64 in file
869ld: warning: in nbtsort.o, missing required architecture x86_64 in file
870ld: warning: in nbtxlog.o, missing required architecture x86_64 in file
871/usr/bin/gnumake -C transam SUBSYS.o
872/usr/bin/gcc-4.2 -no-cpp-precomp -O2 -arch ppc -arch i386 -Wall -Wmissing-prototypes -Wpointer-arith -Winline -Wdeclaration-after-statement -Wendif-labels -fno-strict-aliasing -fwrapv -I../../../../src/include -I/opt/local/include  -I/opt/local/include  -c -o clog.o clog.c
873/usr/bin/gcc-4.2 -no-cpp-precomp -O2 -arch ppc -arch i386 -Wall -Wmissing-prototypes -Wpointer-arith -Winline -Wdeclaration-after-statement -Wendif-labels -fno-strict-aliasing -fwrapv -I../../../../src/include -I/opt/local/include  -I/opt/local/include  -c -o transam.o transam.c
874/usr/bin/gcc-4.2 -no-cpp-precomp -O2 -arch ppc -arch i386 -Wall -Wmissing-prototypes -Wpointer-arith -Winline -Wdeclaration-after-statement -Wendif-labels -fno-strict-aliasing -fwrapv -I../../../../src/include -I/opt/local/include  -I/opt/local/include  -c -o varsup.o varsup.c
875/usr/bin/gcc-4.2 -no-cpp-precomp -O2 -arch ppc -arch i386 -Wall -Wmissing-prototypes -Wpointer-arith -Winline -Wdeclaration-after-statement -Wendif-labels -fno-strict-aliasing -fwrapv -I../../../../src/include -I/opt/local/include  -I/opt/local/include  -c -o xact.o xact.c
876/usr/bin/gcc-4.2 -no-cpp-precomp -O2 -arch ppc -arch i386 -Wall -Wmissing-prototypes -Wpointer-arith -Winline -Wdeclaration-after-statement -Wendif-labels -fno-strict-aliasing -fwrapv -I../../../../src/include -I/opt/local/include  -I/opt/local/include  -c -o xlog.o xlog.c
877/usr/bin/gcc-4.2 -no-cpp-precomp -O2 -arch ppc -arch i386 -Wall -Wmissing-prototypes -Wpointer-arith -Winline -Wdeclaration-after-statement -Wendif-labels -fno-strict-aliasing -fwrapv -I../../../../src/include -I/opt/local/include  -I/opt/local/include  -c -o xlogutils.o xlogutils.c
878/usr/bin/gcc-4.2 -no-cpp-precomp -O2 -arch ppc -arch i386 -Wall -Wmissing-prototypes -Wpointer-arith -Winline -Wdeclaration-after-statement -Wendif-labels -fno-strict-aliasing -fwrapv -I../../../../src/include -I/opt/local/include  -I/opt/local/include  -c -o rmgr.o rmgr.c
879/usr/bin/gcc-4.2 -no-cpp-precomp -O2 -arch ppc -arch i386 -Wall -Wmissing-prototypes -Wpointer-arith -Winline -Wdeclaration-after-statement -Wendif-labels -fno-strict-aliasing -fwrapv -I../../../../src/include -I/opt/local/include  -I/opt/local/include  -c -o slru.o slru.c
880/usr/bin/gcc-4.2 -no-cpp-precomp -O2 -arch ppc -arch i386 -Wall -Wmissing-prototypes -Wpointer-arith -Winline -Wdeclaration-after-statement -Wendif-labels -fno-strict-aliasing -fwrapv -I../../../../src/include -I/opt/local/include  -I/opt/local/include  -c -o subtrans.o subtrans.c
881/usr/bin/gcc-4.2 -no-cpp-precomp -O2 -arch ppc -arch i386 -Wall -Wmissing-prototypes -Wpointer-arith -Winline -Wdeclaration-after-statement -Wendif-labels -fno-strict-aliasing -fwrapv -I../../../../src/include -I/opt/local/include  -I/opt/local/include  -c -o multixact.o multixact.c
882/usr/bin/gcc-4.2 -no-cpp-precomp -O2 -arch ppc -arch i386 -Wall -Wmissing-prototypes -Wpointer-arith -Winline -Wdeclaration-after-statement -Wendif-labels -fno-strict-aliasing -fwrapv -I../../../../src/include -I/opt/local/include  -I/opt/local/include  -c -o twophase.o twophase.c
883/usr/bin/gcc-4.2 -no-cpp-precomp -O2 -arch ppc -arch i386 -Wall -Wmissing-prototypes -Wpointer-arith -Winline -Wdeclaration-after-statement -Wendif-labels -fno-strict-aliasing -fwrapv -I../../../../src/include -I/opt/local/include  -I/opt/local/include  -c -o twophase_rmgr.o twophase_rmgr.c
884/usr/libexec/gcc/i686-apple-darwin10/4.2.1/ld -r -o SUBSYS.o clog.o transam.o varsup.o xact.o xlog.o xlogutils.o rmgr.o slru.o subtrans.o multixact.o twophase.o twophase_rmgr.o
885ld: warning: -arch not specified
886ld: warning: in clog.o, missing required architecture x86_64 in file
887ld: warning: in transam.o, missing required architecture x86_64 in file
888ld: warning: in varsup.o, missing required architecture x86_64 in file
889ld: warning: in xact.o, missing required architecture x86_64 in file
890ld: warning: in xlog.o, missing required architecture x86_64 in file
891ld: warning: in xlogutils.o, missing required architecture x86_64 in file
892ld: warning: in rmgr.o, missing required architecture x86_64 in file
893ld: warning: in slru.o, missing required architecture x86_64 in file
894ld: warning: in subtrans.o, missing required architecture x86_64 in file
895ld: warning: in multixact.o, missing required architecture x86_64 in file
896ld: warning: in twophase.o, missing required architecture x86_64 in file
897ld: warning: in twophase_rmgr.o, missing required architecture x86_64 in file
898/usr/bin/gnumake -C gin SUBSYS.o
899/usr/bin/gcc-4.2 -no-cpp-precomp -O2 -arch ppc -arch i386 -Wall -Wmissing-prototypes -Wpointer-arith -Winline -Wdeclaration-after-statement -Wendif-labels -fno-strict-aliasing -fwrapv -I../../../../src/include -I/opt/local/include  -I/opt/local/include  -c -o ginutil.o ginutil.c
900/usr/bin/gcc-4.2 -no-cpp-precomp -O2 -arch ppc -arch i386 -Wall -Wmissing-prototypes -Wpointer-arith -Winline -Wdeclaration-after-statement -Wendif-labels -fno-strict-aliasing -fwrapv -I../../../../src/include -I/opt/local/include  -I/opt/local/include  -c -o gininsert.o gininsert.c
901/usr/bin/gcc-4.2 -no-cpp-precomp -O2 -arch ppc -arch i386 -Wall -Wmissing-prototypes -Wpointer-arith -Winline -Wdeclaration-after-statement -Wendif-labels -fno-strict-aliasing -fwrapv -I../../../../src/include -I/opt/local/include  -I/opt/local/include  -c -o ginxlog.o ginxlog.c
902/usr/bin/gcc-4.2 -no-cpp-precomp -O2 -arch ppc -arch i386 -Wall -Wmissing-prototypes -Wpointer-arith -Winline -Wdeclaration-after-statement -Wendif-labels -fno-strict-aliasing -fwrapv -I../../../../src/include -I/opt/local/include  -I/opt/local/include  -c -o ginentrypage.o ginentrypage.c
903/usr/bin/gcc-4.2 -no-cpp-precomp -O2 -arch ppc -arch i386 -Wall -Wmissing-prototypes -Wpointer-arith -Winline -Wdeclaration-after-statement -Wendif-labels -fno-strict-aliasing -fwrapv -I../../../../src/include -I/opt/local/include  -I/opt/local/include  -c -o gindatapage.o gindatapage.c
904/usr/bin/gcc-4.2 -no-cpp-precomp -O2 -arch ppc -arch i386 -Wall -Wmissing-prototypes -Wpointer-arith -Winline -Wdeclaration-after-statement -Wendif-labels -fno-strict-aliasing -fwrapv -I../../../../src/include -I/opt/local/include  -I/opt/local/include  -c -o ginbtree.o ginbtree.c
905/usr/bin/gcc-4.2 -no-cpp-precomp -O2 -arch ppc -arch i386 -Wall -Wmissing-prototypes -Wpointer-arith -Winline -Wdeclaration-after-statement -Wendif-labels -fno-strict-aliasing -fwrapv -I../../../../src/include -I/opt/local/include  -I/opt/local/include  -c -o ginscan.o ginscan.c
906/usr/bin/gcc-4.2 -no-cpp-precomp -O2 -arch ppc -arch i386 -Wall -Wmissing-prototypes -Wpointer-arith -Winline -Wdeclaration-after-statement -Wendif-labels -fno-strict-aliasing -fwrapv -I../../../../src/include -I/opt/local/include  -I/opt/local/include  -c -o ginget.o ginget.c
907/usr/bin/gcc-4.2 -no-cpp-precomp -O2 -arch ppc -arch i386 -Wall -Wmissing-prototypes -Wpointer-arith -Winline -Wdeclaration-after-statement -Wendif-labels -fno-strict-aliasing -fwrapv -I../../../../src/include -I/opt/local/include  -I/opt/local/include  -c -o ginvacuum.o ginvacuum.c
908/usr/bin/gcc-4.2 -no-cpp-precomp -O2 -arch ppc -arch i386 -Wall -Wmissing-prototypes -Wpointer-arith -Winline -Wdeclaration-after-statement -Wendif-labels -fno-strict-aliasing -fwrapv -I../../../../src/include -I/opt/local/include  -I/opt/local/include  -c -o ginarrayproc.o ginarrayproc.c
909/usr/bin/gcc-4.2 -no-cpp-precomp -O2 -arch ppc -arch i386 -Wall -Wmissing-prototypes -Wpointer-arith -Winline -Wdeclaration-after-statement -Wendif-labels -fno-strict-aliasing -fwrapv -I../../../../src/include -I/opt/local/include  -I/opt/local/include  -c -o ginbulk.o ginbulk.c
910/usr/libexec/gcc/i686-apple-darwin10/4.2.1/ld -r -o SUBSYS.o ginutil.o gininsert.o ginxlog.o ginentrypage.o gindatapage.o ginbtree.o ginscan.o ginget.o ginvacuum.o ginarrayproc.o ginbulk.o
911ld: warning: -arch not specified
912ld: warning: in ginutil.o, missing required architecture x86_64 in file
913ld: warning: in gininsert.o, missing required architecture x86_64 in file
914ld: warning: in ginxlog.o, missing required architecture x86_64 in file
915ld: warning: in ginentrypage.o, missing required architecture x86_64 in file
916ld: warning: in gindatapage.o, missing required architecture x86_64 in file
917ld: warning: in ginbtree.o, missing required architecture x86_64 in file
918ld: warning: in ginscan.o, missing required architecture x86_64 in file
919ld: warning: in ginget.o, missing required architecture x86_64 in file
920ld: warning: in ginvacuum.o, missing required architecture x86_64 in file
921ld: warning: in ginarrayproc.o, missing required architecture x86_64 in file
922ld: warning: in ginbulk.o, missing required architecture x86_64 in file
923/usr/libexec/gcc/i686-apple-darwin10/4.2.1/ld -r -o SUBSYS.o common/SUBSYS.o gist/SUBSYS.o hash/SUBSYS.o heap/SUBSYS.o index/SUBSYS.o nbtree/SUBSYS.o transam/SUBSYS.o gin/SUBSYS.o
924/usr/bin/gnumake -C bootstrap all
925/usr/bin/gcc-4.2 -no-cpp-precomp -O2 -arch ppc -arch i386 -Wall -Wmissing-prototypes -Wpointer-arith -Winline -Wdeclaration-after-statement -Wendif-labels -fno-strict-aliasing -fwrapv -I. -I../../../src/include -I/opt/local/include  -I/opt/local/include  -c -o bootparse.o bootparse.c
926/usr/bin/gcc-4.2 -no-cpp-precomp -O2 -arch ppc -arch i386 -Wall -Wmissing-prototypes -Wpointer-arith -Winline -Wdeclaration-after-statement -Wendif-labels -fno-strict-aliasing -fwrapv -I. -I../../../src/include -I/opt/local/include  -I/opt/local/include  -c -o bootstrap.o bootstrap.c
927/usr/libexec/gcc/i686-apple-darwin10/4.2.1/ld -r -o SUBSYS.o bootparse.o bootstrap.o
928ld: warning: -arch not specified
929ld: warning: in bootparse.o, missing required architecture x86_64 in file
930ld: warning: in bootstrap.o, missing required architecture x86_64 in file
931/usr/bin/gnumake -C catalog all
932/usr/bin/gcc-4.2 -no-cpp-precomp -O2 -arch ppc -arch i386 -Wall -Wmissing-prototypes -Wpointer-arith -Winline -Wdeclaration-after-statement -Wendif-labels -fno-strict-aliasing -fwrapv -I../../../src/include -I/opt/local/include  -I/opt/local/include  -c -o catalog.o catalog.c
933/usr/bin/gcc-4.2 -no-cpp-precomp -O2 -arch ppc -arch i386 -Wall -Wmissing-prototypes -Wpointer-arith -Winline -Wdeclaration-after-statement -Wendif-labels -fno-strict-aliasing -fwrapv -I../../../src/include -I/opt/local/include  -I/opt/local/include  -c -o dependency.o dependency.c
934/usr/bin/gcc-4.2 -no-cpp-precomp -O2 -arch ppc -arch i386 -Wall -Wmissing-prototypes -Wpointer-arith -Winline -Wdeclaration-after-statement -Wendif-labels -fno-strict-aliasing -fwrapv -I../../../src/include -I/opt/local/include  -I/opt/local/include  -c -o heap.o heap.c
935/usr/bin/gcc-4.2 -no-cpp-precomp -O2 -arch ppc -arch i386 -Wall -Wmissing-prototypes -Wpointer-arith -Winline -Wdeclaration-after-statement -Wendif-labels -fno-strict-aliasing -fwrapv -I../../../src/include -I/opt/local/include  -I/opt/local/include  -c -o index.o index.c
936/usr/bin/gcc-4.2 -no-cpp-precomp -O2 -arch ppc -arch i386 -Wall -Wmissing-prototypes -Wpointer-arith -Winline -Wdeclaration-after-statement -Wendif-labels -fno-strict-aliasing -fwrapv -I../../../src/include -I/opt/local/include  -I/opt/local/include  -c -o indexing.o indexing.c
937/usr/bin/gcc-4.2 -no-cpp-precomp -O2 -arch ppc -arch i386 -Wall -Wmissing-prototypes -Wpointer-arith -Winline -Wdeclaration-after-statement -Wendif-labels -fno-strict-aliasing -fwrapv -I../../../src/include -I/opt/local/include  -I/opt/local/include  -c -o namespace.o namespace.c
938/usr/bin/gcc-4.2 -no-cpp-precomp -O2 -arch ppc -arch i386 -Wall -Wmissing-prototypes -Wpointer-arith -Winline -Wdeclaration-after-statement -Wendif-labels -fno-strict-aliasing -fwrapv -I../../../src/include -I/opt/local/include  -I/opt/local/include  -c -o aclchk.o aclchk.c
939/usr/bin/gcc-4.2 -no-cpp-precomp -O2 -arch ppc -arch i386 -Wall -Wmissing-prototypes -Wpointer-arith -Winline -Wdeclaration-after-statement -Wendif-labels -fno-strict-aliasing -fwrapv -I../../../src/include -I/opt/local/include  -I/opt/local/include  -c -o pg_aggregate.o pg_aggregate.c
940/usr/bin/gcc-4.2 -no-cpp-precomp -O2 -arch ppc -arch i386 -Wall -Wmissing-prototypes -Wpointer-arith -Winline -Wdeclaration-after-statement -Wendif-labels -fno-strict-aliasing -fwrapv -I../../../src/include -I/opt/local/include  -I/opt/local/include  -c -o pg_constraint.o pg_constraint.c
941/usr/bin/gcc-4.2 -no-cpp-precomp -O2 -arch ppc -arch i386 -Wall -Wmissing-prototypes -Wpointer-arith -Winline -Wdeclaration-after-statement -Wendif-labels -fno-strict-aliasing -fwrapv -I../../../src/include -I/opt/local/include  -I/opt/local/include  -c -o pg_conversion.o pg_conversion.c
942/usr/bin/gcc-4.2 -no-cpp-precomp -O2 -arch ppc -arch i386 -Wall -Wmissing-prototypes -Wpointer-arith -Winline -Wdeclaration-after-statement -Wendif-labels -fno-strict-aliasing -fwrapv -I../../../src/include -I/opt/local/include  -I/opt/local/include  -c -o pg_depend.o pg_depend.c
943/usr/bin/gcc-4.2 -no-cpp-precomp -O2 -arch ppc -arch i386 -Wall -Wmissing-prototypes -Wpointer-arith -Winline -Wdeclaration-after-statement -Wendif-labels -fno-strict-aliasing -fwrapv -I../../../src/include -I/opt/local/include  -I/opt/local/include  -c -o pg_largeobject.o pg_largeobject.c
944/usr/bin/gcc-4.2 -no-cpp-precomp -O2 -arch ppc -arch i386 -Wall -Wmissing-prototypes -Wpointer-arith -Winline -Wdeclaration-after-statement -Wendif-labels -fno-strict-aliasing -fwrapv -I../../../src/include -I/opt/local/include  -I/opt/local/include  -c -o pg_namespace.o pg_namespace.c
945/usr/bin/gcc-4.2 -no-cpp-precomp -O2 -arch ppc -arch i386 -Wall -Wmissing-prototypes -Wpointer-arith -Winline -Wdeclaration-after-statement -Wendif-labels -fno-strict-aliasing -fwrapv -I../../../src/include -I/opt/local/include  -I/opt/local/include  -c -o pg_operator.o pg_operator.c
946/usr/bin/gcc-4.2 -no-cpp-precomp -O2 -arch ppc -arch i386 -Wall -Wmissing-prototypes -Wpointer-arith -Winline -Wdeclaration-after-statement -Wendif-labels -fno-strict-aliasing -fwrapv -I../../../src/include -I/opt/local/include  -I/opt/local/include  -c -o pg_proc.o pg_proc.c
947/usr/bin/gcc-4.2 -no-cpp-precomp -O2 -arch ppc -arch i386 -Wall -Wmissing-prototypes -Wpointer-arith -Winline -Wdeclaration-after-statement -Wendif-labels -fno-strict-aliasing -fwrapv -I../../../src/include -I/opt/local/include  -I/opt/local/include  -c -o pg_shdepend.o pg_shdepend.c
948/usr/bin/gcc-4.2 -no-cpp-precomp -O2 -arch ppc -arch i386 -Wall -Wmissing-prototypes -Wpointer-arith -Winline -Wdeclaration-after-statement -Wendif-labels -fno-strict-aliasing -fwrapv -I../../../src/include -I/opt/local/include  -I/opt/local/include  -c -o pg_type.o pg_type.c
949/usr/bin/gcc-4.2 -no-cpp-precomp -O2 -arch ppc -arch i386 -Wall -Wmissing-prototypes -Wpointer-arith -Winline -Wdeclaration-after-statement -Wendif-labels -fno-strict-aliasing -fwrapv -I../../../src/include -I/opt/local/include  -I/opt/local/include  -c -o toasting.o toasting.c
950/usr/libexec/gcc/i686-apple-darwin10/4.2.1/ld -r -o SUBSYS.o catalog.o dependency.o heap.o index.o indexing.o namespace.o aclchk.o pg_aggregate.o pg_constraint.o pg_conversion.o pg_depend.o pg_largeobject.o pg_namespace.o pg_operator.o pg_proc.o pg_shdepend.o pg_type.o toasting.o
951ld: warning: -arch not specified
952ld: warning: in catalog.o, missing required architecture x86_64 in file
953ld: warning: in dependency.o, missing required architecture x86_64 in file
954ld: warning: in heap.o, missing required architecture x86_64 in file
955ld: warning: in index.o, missing required architecture x86_64 in file
956ld: warning: in indexing.o, missing required architecture x86_64 in file
957ld: warning: in namespace.o, missing required architecture x86_64 in file
958ld: warning: in aclchk.o, missing required architecture x86_64 in file
959ld: warning: in pg_aggregate.o, missing required architecture x86_64 in file
960ld: warning: in pg_constraint.o, missing required architecture x86_64 in file
961ld: warning: in pg_conversion.o, missing required architecture x86_64 in file
962ld: warning: in pg_depend.o, missing required architecture x86_64 in file
963ld: warning: in pg_largeobject.o, missing required architecture x86_64 in file
964ld: warning: in pg_namespace.o, missing required architecture x86_64 in file
965ld: warning: in pg_operator.o, missing required architecture x86_64 in file
966ld: warning: in pg_proc.o, missing required architecture x86_64 in file
967ld: warning: in pg_shdepend.o, missing required architecture x86_64 in file
968ld: warning: in pg_type.o, missing required architecture x86_64 in file
969ld: warning: in toasting.o, missing required architecture x86_64 in file
970AWK='awk' /bin/sh genbki.sh -I../../../src/include --set-version=8.2.16 -o postgres ../../../src/include/catalog/pg_proc.h ../../../src/include/catalog/pg_type.h ../../../src/include/catalog/pg_attribute.h ../../../src/include/catalog/pg_class.h ../../../src/include/catalog/pg_autovacuum.h ../../../src/include/catalog/pg_attrdef.h ../../../src/include/catalog/pg_constraint.h ../../../src/include/catalog/pg_inherits.h ../../../src/include/catalog/pg_index.h ../../../src/include/catalog/pg_operator.h ../../../src/include/catalog/pg_opclass.h ../../../src/include/catalog/pg_am.h ../../../src/include/catalog/pg_amop.h ../../../src/include/catalog/pg_amproc.h ../../../src/include/catalog/pg_language.h ../../../src/include/catalog/pg_largeobject.h ../../../src/include/catalog/pg_aggregate.h ../../../src/include/catalog/pg_statistic.h ../../../src/include/catalog/pg_rewrite.h ../../../src/include/catalog/pg_trigger.h ../../../src/include/catalog/pg_listener.h ../../../src/include/catalog/pg_description.h ../../../src/include/catalog/pg_cast.h ../../../src/include/catalog/pg_namespace.h ../../../src/include/catalog/pg_conversion.h ../../../src/include/catalog/pg_depend.h ../../../src/include/catalog/pg_database.h ../../../src/include/catalog/pg_tablespace.h ../../../src/include/catalog/pg_pltemplate.h ../../../src/include/catalog/pg_authid.h ../../../src/include/catalog/pg_auth_members.h ../../../src/include/catalog/pg_shdepend.h ../../../src/include/catalog/pg_shdescription.h ../../../src/include/catalog/toasting.h ../../../src/include/catalog/indexing.h
971/usr/bin/gnumake -C parser all
972/usr/bin/gcc-4.2 -no-cpp-precomp -O2 -arch ppc -arch i386 -Wall -Wmissing-prototypes -Wpointer-arith -Winline -Wdeclaration-after-statement -Wendif-labels -fno-strict-aliasing -fwrapv -I. -I../../../src/include -I/opt/local/include  -I/opt/local/include  -c -o analyze.o analyze.c
973/usr/bin/gcc-4.2 -no-cpp-precomp -O2 -arch ppc -arch i386 -Wall -Wmissing-prototypes -Wpointer-arith -Winline -Wdeclaration-after-statement -Wendif-labels -fno-strict-aliasing -fwrapv -I. -I../../../src/include -I/opt/local/include  -I/opt/local/include  -c -o gram.o gram.c
974/usr/bin/gcc-4.2 -no-cpp-precomp -O2 -arch ppc -arch i386 -Wall -Wmissing-prototypes -Wpointer-arith -Winline -Wdeclaration-after-statement -Wendif-labels -fno-strict-aliasing -fwrapv -I. -I../../../src/include -I/opt/local/include  -I/opt/local/include  -c -o keywords.o keywords.c
975/usr/bin/gcc-4.2 -no-cpp-precomp -O2 -arch ppc -arch i386 -Wall -Wmissing-prototypes -Wpointer-arith -Winline -Wdeclaration-after-statement -Wendif-labels -fno-strict-aliasing -fwrapv -I. -I../../../src/include -I/opt/local/include  -I/opt/local/include  -c -o parser.o parser.c
976/usr/bin/gcc-4.2 -no-cpp-precomp -O2 -arch ppc -arch i386 -Wall -Wmissing-prototypes -Wpointer-arith -Winline -Wdeclaration-after-statement -Wendif-labels -fno-strict-aliasing -fwrapv -I. -I../../../src/include -I/opt/local/include  -I/opt/local/include  -c -o parse_agg.o parse_agg.c
977/usr/bin/gcc-4.2 -no-cpp-precomp -O2 -arch ppc -arch i386 -Wall -Wmissing-prototypes -Wpointer-arith -Winline -Wdeclaration-after-statement -Wendif-labels -fno-strict-aliasing -fwrapv -I. -I../../../src/include -I/opt/local/include  -I/opt/local/include  -c -o parse_clause.o parse_clause.c
978/usr/bin/gcc-4.2 -no-cpp-precomp -O2 -arch ppc -arch i386 -Wall -Wmissing-prototypes -Wpointer-arith -Winline -Wdeclaration-after-statement -Wendif-labels -fno-strict-aliasing -fwrapv -I. -I../../../src/include -I/opt/local/include  -I/opt/local/include  -c -o parse_expr.o parse_expr.c
979/usr/bin/gcc-4.2 -no-cpp-precomp -O2 -arch ppc -arch i386 -Wall -Wmissing-prototypes -Wpointer-arith -Winline -Wdeclaration-after-statement -Wendif-labels -fno-strict-aliasing -fwrapv -I. -I../../../src/include -I/opt/local/include  -I/opt/local/include  -c -o parse_func.o parse_func.c
980/usr/bin/gcc-4.2 -no-cpp-precomp -O2 -arch ppc -arch i386 -Wall -Wmissing-prototypes -Wpointer-arith -Winline -Wdeclaration-after-statement -Wendif-labels -fno-strict-aliasing -fwrapv -I. -I../../../src/include -I/opt/local/include  -I/opt/local/include  -c -o parse_node.o parse_node.c
981/usr/bin/gcc-4.2 -no-cpp-precomp -O2 -arch ppc -arch i386 -Wall -Wmissing-prototypes -Wpointer-arith -Winline -Wdeclaration-after-statement -Wendif-labels -fno-strict-aliasing -fwrapv -I. -I../../../src/include -I/opt/local/include  -I/opt/local/include  -c -o parse_oper.o parse_oper.c
982/usr/bin/gcc-4.2 -no-cpp-precomp -O2 -arch ppc -arch i386 -Wall -Wmissing-prototypes -Wpointer-arith -Winline -Wdeclaration-after-statement -Wendif-labels -fno-strict-aliasing -fwrapv -I. -I../../../src/include -I/opt/local/include  -I/opt/local/include  -c -o parse_relation.o parse_relation.c
983/usr/bin/gcc-4.2 -no-cpp-precomp -O2 -arch ppc -arch i386 -Wall -Wmissing-prototypes -Wpointer-arith -Winline -Wdeclaration-after-statement -Wendif-labels -fno-strict-aliasing -fwrapv -I. -I../../../src/include -I/opt/local/include  -I/opt/local/include  -c -o parse_type.o parse_type.c
984/usr/bin/gcc-4.2 -no-cpp-precomp -O2 -arch ppc -arch i386 -Wall -Wmissing-prototypes -Wpointer-arith -Winline -Wdeclaration-after-statement -Wendif-labels -fno-strict-aliasing -fwrapv -I. -I../../../src/include -I/opt/local/include  -I/opt/local/include  -c -o parse_coerce.o parse_coerce.c
985/usr/bin/gcc-4.2 -no-cpp-precomp -O2 -arch ppc -arch i386 -Wall -Wmissing-prototypes -Wpointer-arith -Winline -Wdeclaration-after-statement -Wendif-labels -fno-strict-aliasing -fwrapv -I. -I../../../src/include -I/opt/local/include  -I/opt/local/include  -c -o parse_target.o parse_target.c
986/usr/bin/gcc-4.2 -no-cpp-precomp -O2 -arch ppc -arch i386 -Wall -Wmissing-prototypes -Wpointer-arith -Winline -Wdeclaration-after-statement -Wendif-labels -fno-strict-aliasing -fwrapv -I. -I../../../src/include -I/opt/local/include  -I/opt/local/include  -c -o scansup.o scansup.c
987/usr/libexec/gcc/i686-apple-darwin10/4.2.1/ld -r -o SUBSYS.o analyze.o gram.o keywords.o parser.o parse_agg.o parse_clause.o parse_expr.o parse_func.o parse_node.o parse_oper.o parse_relation.o parse_type.o parse_coerce.o parse_target.o scansup.o
988ld: warning: -arch not specified
989ld: warning: in analyze.o, missing required architecture x86_64 in file
990ld: warning: in gram.o, missing required architecture x86_64 in file
991ld: warning: in keywords.o, missing required architecture x86_64 in file
992ld: warning: in parser.o, missing required architecture x86_64 in file
993ld: warning: in parse_agg.o, missing required architecture x86_64 in file
994ld: warning: in parse_clause.o, missing required architecture x86_64 in file
995ld: warning: in parse_expr.o, missing required architecture x86_64 in file
996ld: warning: in parse_func.o, missing required architecture x86_64 in file
997ld: warning: in parse_node.o, missing required architecture x86_64 in file
998ld: warning: in parse_oper.o, missing required architecture x86_64 in file
999ld: warning: in parse_relation.o, missing required architecture x86_64 in file
1000ld: warning: in parse_type.o, missing required architecture x86_64 in file
1001ld: warning: in parse_coerce.o, missing required architecture x86_64 in file
1002ld: warning: in parse_target.o, missing required architecture x86_64 in file
1003ld: warning: in scansup.o, missing required architecture x86_64 in file
1004/usr/bin/gnumake -C commands all
1005/usr/bin/gcc-4.2 -no-cpp-precomp -O2 -arch ppc -arch i386 -Wall -Wmissing-prototypes -Wpointer-arith -Winline -Wdeclaration-after-statement -Wendif-labels -fno-strict-aliasing -fwrapv -I../../../src/include -I/opt/local/include  -I/opt/local/include  -c -o aggregatecmds.o aggregatecmds.c
1006/usr/bin/gcc-4.2 -no-cpp-precomp -O2 -arch ppc -arch i386 -Wall -Wmissing-prototypes -Wpointer-arith -Winline -Wdeclaration-after-statement -Wendif-labels -fno-strict-aliasing -fwrapv -I../../../src/include -I/opt/local/include  -I/opt/local/include  -c -o alter.o alter.c
1007/usr/bin/gcc-4.2 -no-cpp-precomp -O2 -arch ppc -arch i386 -Wall -Wmissing-prototypes -Wpointer-arith -Winline -Wdeclaration-after-statement -Wendif-labels -fno-strict-aliasing -fwrapv -I../../../src/include -I/opt/local/include  -I/opt/local/include  -c -o analyze.o analyze.c
1008/usr/bin/gcc-4.2 -no-cpp-precomp -O2 -arch ppc -arch i386 -Wall -Wmissing-prototypes -Wpointer-arith -Winline -Wdeclaration-after-statement -Wendif-labels -fno-strict-aliasing -fwrapv -I../../../src/include -I/opt/local/include  -I/opt/local/include  -c -o async.o async.c
1009/usr/bin/gcc-4.2 -no-cpp-precomp -O2 -arch ppc -arch i386 -Wall -Wmissing-prototypes -Wpointer-arith -Winline -Wdeclaration-after-statement -Wendif-labels -fno-strict-aliasing -fwrapv -I../../../src/include -I/opt/local/include  -I/opt/local/include  -c -o cluster.o cluster.c
1010/usr/bin/gcc-4.2 -no-cpp-precomp -O2 -arch ppc -arch i386 -Wall -Wmissing-prototypes -Wpointer-arith -Winline -Wdeclaration-after-statement -Wendif-labels -fno-strict-aliasing -fwrapv -I../../../src/include -I/opt/local/include  -I/opt/local/include  -c -o comment.o comment.c
1011/usr/bin/gcc-4.2 -no-cpp-precomp -O2 -arch ppc -arch i386 -Wall -Wmissing-prototypes -Wpointer-arith -Winline -Wdeclaration-after-statement -Wendif-labels -fno-strict-aliasing -fwrapv -I../../../src/include -I/opt/local/include  -I/opt/local/include  -c -o conversioncmds.o conversioncmds.c
1012/usr/bin/gcc-4.2 -no-cpp-precomp -O2 -arch ppc -arch i386 -Wall -Wmissing-prototypes -Wpointer-arith -Winline -Wdeclaration-after-statement -Wendif-labels -fno-strict-aliasing -fwrapv -I../../../src/include -I/opt/local/include  -I/opt/local/include  -c -o copy.o copy.c
1013/usr/bin/gcc-4.2 -no-cpp-precomp -O2 -arch ppc -arch i386 -Wall -Wmissing-prototypes -Wpointer-arith -Winline -Wdeclaration-after-statement -Wendif-labels -fno-strict-aliasing -fwrapv -I../../../src/include -I/opt/local/include  -I/opt/local/include  -c -o dbcommands.o dbcommands.c
1014/usr/bin/gcc-4.2 -no-cpp-precomp -O2 -arch ppc -arch i386 -Wall -Wmissing-prototypes -Wpointer-arith -Winline -Wdeclaration-after-statement -Wendif-labels -fno-strict-aliasing -fwrapv -I../../../src/include -I/opt/local/include  -I/opt/local/include  -c -o define.o define.c
1015/usr/bin/gcc-4.2 -no-cpp-precomp -O2 -arch ppc -arch i386 -Wall -Wmissing-prototypes -Wpointer-arith -Winline -Wdeclaration-after-statement -Wendif-labels -fno-strict-aliasing -fwrapv -I../../../src/include -I/opt/local/include  -I/opt/local/include  -c -o explain.o explain.c
1016/usr/bin/gcc-4.2 -no-cpp-precomp -O2 -arch ppc -arch i386 -Wall -Wmissing-prototypes -Wpointer-arith -Winline -Wdeclaration-after-statement -Wendif-labels -fno-strict-aliasing -fwrapv -I../../../src/include -I/opt/local/include  -I/opt/local/include  -c -o functioncmds.o functioncmds.c
1017/usr/bin/gcc-4.2 -no-cpp-precomp -O2 -arch ppc -arch i386 -Wall -Wmissing-prototypes -Wpointer-arith -Winline -Wdeclaration-after-statement -Wendif-labels -fno-strict-aliasing -fwrapv -I../../../src/include -I/opt/local/include  -I/opt/local/include  -c -o indexcmds.o indexcmds.c
1018/usr/bin/gcc-4.2 -no-cpp-precomp -O2 -arch ppc -arch i386 -Wall -Wmissing-prototypes -Wpointer-arith -Winline -Wdeclaration-after-statement -Wendif-labels -fno-strict-aliasing -fwrapv -I../../../src/include -I/opt/local/include  -I/opt/local/include  -c -o lockcmds.o lockcmds.c
1019/usr/bin/gcc-4.2 -no-cpp-precomp -O2 -arch ppc -arch i386 -Wall -Wmissing-prototypes -Wpointer-arith -Winline -Wdeclaration-after-statement -Wendif-labels -fno-strict-aliasing -fwrapv -I../../../src/include -I/opt/local/include  -I/opt/local/include  -c -o operatorcmds.o operatorcmds.c
1020/usr/bin/gcc-4.2 -no-cpp-precomp -O2 -arch ppc -arch i386 -Wall -Wmissing-prototypes -Wpointer-arith -Winline -Wdeclaration-after-statement -Wendif-labels -fno-strict-aliasing -fwrapv -I../../../src/include -I/opt/local/include  -I/opt/local/include  -c -o opclasscmds.o opclasscmds.c
1021/usr/bin/gcc-4.2 -no-cpp-precomp -O2 -arch ppc -arch i386 -Wall -Wmissing-prototypes -Wpointer-arith -Winline -Wdeclaration-after-statement -Wendif-labels -fno-strict-aliasing -fwrapv -I../../../src/include -I/opt/local/include  -I/opt/local/include  -c -o portalcmds.o portalcmds.c
1022/usr/bin/gcc-4.2 -no-cpp-precomp -O2 -arch ppc -arch i386 -Wall -Wmissing-prototypes -Wpointer-arith -Winline -Wdeclaration-after-statement -Wendif-labels -fno-strict-aliasing -fwrapv -I../../../src/include -I/opt/local/include  -I/opt/local/include  -c -o prepare.o prepare.c
1023/usr/bin/gcc-4.2 -no-cpp-precomp -O2 -arch ppc -arch i386 -Wall -Wmissing-prototypes -Wpointer-arith -Winline -Wdeclaration-after-statement -Wendif-labels -fno-strict-aliasing -fwrapv -I../../../src/include -I/opt/local/include  -I/opt/local/include  -c -o proclang.o proclang.c
1024/usr/bin/gcc-4.2 -no-cpp-precomp -O2 -arch ppc -arch i386 -Wall -Wmissing-prototypes -Wpointer-arith -Winline -Wdeclaration-after-statement -Wendif-labels -fno-strict-aliasing -fwrapv -I../../../src/include -I/opt/local/include  -I/opt/local/include  -c -o schemacmds.o schemacmds.c
1025/usr/bin/gcc-4.2 -no-cpp-precomp -O2 -arch ppc -arch i386 -Wall -Wmissing-prototypes -Wpointer-arith -Winline -Wdeclaration-after-statement -Wendif-labels -fno-strict-aliasing -fwrapv -I../../../src/include -I/opt/local/include  -I/opt/local/include  -c -o sequence.o sequence.c
1026/usr/bin/gcc-4.2 -no-cpp-precomp -O2 -arch ppc -arch i386 -Wall -Wmissing-prototypes -Wpointer-arith -Winline -Wdeclaration-after-statement -Wendif-labels -fno-strict-aliasing -fwrapv -I../../../src/include -I/opt/local/include  -I/opt/local/include  -c -o tablecmds.o tablecmds.c
1027/usr/bin/gcc-4.2 -no-cpp-precomp -O2 -arch ppc -arch i386 -Wall -Wmissing-prototypes -Wpointer-arith -Winline -Wdeclaration-after-statement -Wendif-labels -fno-strict-aliasing -fwrapv -I../../../src/include -I/opt/local/include  -I/opt/local/include  -c -o tablespace.o tablespace.c
1028/usr/bin/gcc-4.2 -no-cpp-precomp -O2 -arch ppc -arch i386 -Wall -Wmissing-prototypes -Wpointer-arith -Winline -Wdeclaration-after-statement -Wendif-labels -fno-strict-aliasing -fwrapv -I../../../src/include -I/opt/local/include  -I/opt/local/include  -c -o trigger.o trigger.c
1029/usr/bin/gcc-4.2 -no-cpp-precomp -O2 -arch ppc -arch i386 -Wall -Wmissing-prototypes -Wpointer-arith -Winline -Wdeclaration-after-statement -Wendif-labels -fno-strict-aliasing -fwrapv -I../../../src/include -I/opt/local/include  -I/opt/local/include  -c -o typecmds.o typecmds.c
1030/usr/bin/gcc-4.2 -no-cpp-precomp -O2 -arch ppc -arch i386 -Wall -Wmissing-prototypes -Wpointer-arith -Winline -Wdeclaration-after-statement -Wendif-labels -fno-strict-aliasing -fwrapv -I../../../src/include -I/opt/local/include  -I/opt/local/include  -c -o user.o user.c
1031/usr/bin/gcc-4.2 -no-cpp-precomp -O2 -arch ppc -arch i386 -Wall -Wmissing-prototypes -Wpointer-arith -Winline -Wdeclaration-after-statement -Wendif-labels -fno-strict-aliasing -fwrapv -I../../../src/include -I/opt/local/include  -I/opt/local/include  -c -o vacuum.o vacuum.c
1032/usr/bin/gcc-4.2 -no-cpp-precomp -O2 -arch ppc -arch i386 -Wall -Wmissing-prototypes -Wpointer-arith -Winline -Wdeclaration-after-statement -Wendif-labels -fno-strict-aliasing -fwrapv -I../../../src/include -I/opt/local/include  -I/opt/local/include  -c -o vacuumlazy.o vacuumlazy.c
1033/usr/bin/gcc-4.2 -no-cpp-precomp -O2 -arch ppc -arch i386 -Wall -Wmissing-prototypes -Wpointer-arith -Winline -Wdeclaration-after-statement -Wendif-labels -fno-strict-aliasing -fwrapv -I../../../src/include -I/opt/local/include  -I/opt/local/include  -c -o variable.o variable.c
1034/usr/bin/gcc-4.2 -no-cpp-precomp -O2 -arch ppc -arch i386 -Wall -Wmissing-prototypes -Wpointer-arith -Winline -Wdeclaration-after-statement -Wendif-labels -fno-strict-aliasing -fwrapv -I../../../src/include -I/opt/local/include  -I/opt/local/include  -c -o view.o view.c
1035/usr/libexec/gcc/i686-apple-darwin10/4.2.1/ld -r -o SUBSYS.o aggregatecmds.o alter.o analyze.o async.o cluster.o comment.o conversioncmds.o copy.o dbcommands.o define.o explain.o functioncmds.o indexcmds.o lockcmds.o operatorcmds.o opclasscmds.o portalcmds.o prepare.o proclang.o schemacmds.o sequence.o tablecmds.o tablespace.o trigger.o typecmds.o user.o vacuum.o vacuumlazy.o variable.o view.o
1036ld: warning: -arch not specified
1037ld: warning: in aggregatecmds.o, missing required architecture x86_64 in file
1038ld: warning: in alter.o, missing required architecture x86_64 in file
1039ld: warning: in analyze.o, missing required architecture x86_64 in file
1040ld: warning: in async.o, missing required architecture x86_64 in file
1041ld: warning: in cluster.o, missing required architecture x86_64 in file
1042ld: warning: in comment.o, missing required architecture x86_64 in file
1043ld: warning: in conversioncmds.o, missing required architecture x86_64 in file
1044ld: warning: in copy.o, missing required architecture x86_64 in file
1045ld: warning: in dbcommands.o, missing required architecture x86_64 in file
1046ld: warning: in define.o, missing required architecture x86_64 in file
1047ld: warning: in explain.o, missing required architecture x86_64 in file
1048ld: warning: in functioncmds.o, missing required architecture x86_64 in file
1049ld: warning: in indexcmds.o, missing required architecture x86_64 in file
1050ld: warning: in lockcmds.o, missing required architecture x86_64 in file
1051ld: warning: in operatorcmds.o, missing required architecture x86_64 in file
1052ld: warning: in opclasscmds.o, missing required architecture x86_64 in file
1053ld: warning: in portalcmds.o, missing required architecture x86_64 in file
1054ld: warning: in prepare.o, missing required architecture x86_64 in file
1055ld: warning: in proclang.o, missing required architecture x86_64 in file
1056ld: warning: in schemacmds.o, missing required architecture x86_64 in file
1057ld: warning: in sequence.o, missing required architecture x86_64 in file
1058ld: warning: in tablecmds.o, missing required architecture x86_64 in file
1059ld: warning: in tablespace.o, missing required architecture x86_64 in file
1060ld: warning: in trigger.o, missing required architecture x86_64 in file
1061ld: warning: in typecmds.o, missing required architecture x86_64 in file
1062ld: warning: in user.o, missing required architecture x86_64 in file
1063ld: warning: in vacuum.o, missing required architecture x86_64 in file
1064ld: warning: in vacuumlazy.o, missing required architecture x86_64 in file
1065ld: warning: in variable.o, missing required architecture x86_64 in file
1066ld: warning: in view.o, missing required architecture x86_64 in file
1067/usr/bin/gnumake -C executor all
1068/usr/bin/gcc-4.2 -no-cpp-precomp -O2 -arch ppc -arch i386 -Wall -Wmissing-prototypes -Wpointer-arith -Winline -Wdeclaration-after-statement -Wendif-labels -fno-strict-aliasing -fwrapv -I../../../src/include -I/opt/local/include  -I/opt/local/include  -c -o execAmi.o execAmi.c
1069/usr/bin/gcc-4.2 -no-cpp-precomp -O2 -arch ppc -arch i386 -Wall -Wmissing-prototypes -Wpointer-arith -Winline -Wdeclaration-after-statement -Wendif-labels -fno-strict-aliasing -fwrapv -I../../../src/include -I/opt/local/include  -I/opt/local/include  -c -o execGrouping.o execGrouping.c
1070/usr/bin/gcc-4.2 -no-cpp-precomp -O2 -arch ppc -arch i386 -Wall -Wmissing-prototypes -Wpointer-arith -Winline -Wdeclaration-after-statement -Wendif-labels -fno-strict-aliasing -fwrapv -I../../../src/include -I/opt/local/include  -I/opt/local/include  -c -o execJunk.o execJunk.c
1071/usr/bin/gcc-4.2 -no-cpp-precomp -O2 -arch ppc -arch i386 -Wall -Wmissing-prototypes -Wpointer-arith -Winline -Wdeclaration-after-statement -Wendif-labels -fno-strict-aliasing -fwrapv -I../../../src/include -I/opt/local/include  -I/opt/local/include  -c -o execMain.o execMain.c
1072/usr/bin/gcc-4.2 -no-cpp-precomp -O2 -arch ppc -arch i386 -Wall -Wmissing-prototypes -Wpointer-arith -Winline -Wdeclaration-after-statement -Wendif-labels -fno-strict-aliasing -fwrapv -I../../../src/include -I/opt/local/include  -I/opt/local/include  -c -o execProcnode.o execProcnode.c
1073/usr/bin/gcc-4.2 -no-cpp-precomp -O2 -arch ppc -arch i386 -Wall -Wmissing-prototypes -Wpointer-arith -Winline -Wdeclaration-after-statement -Wendif-labels -fno-strict-aliasing -fwrapv -I../../../src/include -I/opt/local/include  -I/opt/local/include  -c -o execQual.o execQual.c
1074/usr/bin/gcc-4.2 -no-cpp-precomp -O2 -arch ppc -arch i386 -Wall -Wmissing-prototypes -Wpointer-arith -Winline -Wdeclaration-after-statement -Wendif-labels -fno-strict-aliasing -fwrapv -I../../../src/include -I/opt/local/include  -I/opt/local/include  -c -o execScan.o execScan.c
1075/usr/bin/gcc-4.2 -no-cpp-precomp -O2 -arch ppc -arch i386 -Wall -Wmissing-prototypes -Wpointer-arith -Winline -Wdeclaration-after-statement -Wendif-labels -fno-strict-aliasing -fwrapv -I../../../src/include -I/opt/local/include  -I/opt/local/include  -c -o execTuples.o execTuples.c
1076/usr/bin/gcc-4.2 -no-cpp-precomp -O2 -arch ppc -arch i386 -Wall -Wmissing-prototypes -Wpointer-arith -Winline -Wdeclaration-after-statement -Wendif-labels -fno-strict-aliasing -fwrapv -I../../../src/include -I/opt/local/include  -I/opt/local/include  -c -o execUtils.o execUtils.c
1077/usr/bin/gcc-4.2 -no-cpp-precomp -O2 -arch ppc -arch i386 -Wall -Wmissing-prototypes -Wpointer-arith -Winline -Wdeclaration-after-statement -Wendif-labels -fno-strict-aliasing -fwrapv -I../../../src/include -I/opt/local/include  -I/opt/local/include  -c -o functions.o functions.c
1078/usr/bin/gcc-4.2 -no-cpp-precomp -O2 -arch ppc -arch i386 -Wall -Wmissing-prototypes -Wpointer-arith -Winline -Wdeclaration-after-statement -Wendif-labels -fno-strict-aliasing -fwrapv -I../../../src/include -I/opt/local/include  -I/opt/local/include  -c -o instrument.o instrument.c
1079/usr/bin/gcc-4.2 -no-cpp-precomp -O2 -arch ppc -arch i386 -Wall -Wmissing-prototypes -Wpointer-arith -Winline -Wdeclaration-after-statement -Wendif-labels -fno-strict-aliasing -fwrapv -I../../../src/include -I/opt/local/include  -I/opt/local/include  -c -o nodeAppend.o nodeAppend.c
1080/usr/bin/gcc-4.2 -no-cpp-precomp -O2 -arch ppc -arch i386 -Wall -Wmissing-prototypes -Wpointer-arith -Winline -Wdeclaration-after-statement -Wendif-labels -fno-strict-aliasing -fwrapv -I../../../src/include -I/opt/local/include  -I/opt/local/include  -c -o nodeAgg.o nodeAgg.c
1081/usr/bin/gcc-4.2 -no-cpp-precomp -O2 -arch ppc -arch i386 -Wall -Wmissing-prototypes -Wpointer-arith -Winline -Wdeclaration-after-statement -Wendif-labels -fno-strict-aliasing -fwrapv -I../../../src/include -I/opt/local/include  -I/opt/local/include  -c -o nodeBitmapAnd.o nodeBitmapAnd.c
1082/usr/bin/gcc-4.2 -no-cpp-precomp -O2 -arch ppc -arch i386 -Wall -Wmissing-prototypes -Wpointer-arith -Winline -Wdeclaration-after-statement -Wendif-labels -fno-strict-aliasing -fwrapv -I../../../src/include -I/opt/local/include  -I/opt/local/include  -c -o nodeBitmapOr.o nodeBitmapOr.c
1083/usr/bin/gcc-4.2 -no-cpp-precomp -O2 -arch ppc -arch i386 -Wall -Wmissing-prototypes -Wpointer-arith -Winline -Wdeclaration-after-statement -Wendif-labels -fno-strict-aliasing -fwrapv -I../../../src/include -I/opt/local/include  -I/opt/local/include  -c -o nodeBitmapHeapscan.o nodeBitmapHeapscan.c
1084/usr/bin/gcc-4.2 -no-cpp-precomp -O2 -arch ppc -arch i386 -Wall -Wmissing-prototypes -Wpointer-arith -Winline -Wdeclaration-after-statement -Wendif-labels -fno-strict-aliasing -fwrapv -I../../../src/include -I/opt/local/include  -I/opt/local/include  -c -o nodeBitmapIndexscan.o nodeBitmapIndexscan.c
1085/usr/bin/gcc-4.2 -no-cpp-precomp -O2 -arch ppc -arch i386 -Wall -Wmissing-prototypes -Wpointer-arith -Winline -Wdeclaration-after-statement -Wendif-labels -fno-strict-aliasing -fwrapv -I../../../src/include -I/opt/local/include  -I/opt/local/include  -c -o nodeHash.o nodeHash.c
1086/usr/bin/gcc-4.2 -no-cpp-precomp -O2 -arch ppc -arch i386 -Wall -Wmissing-prototypes -Wpointer-arith -Winline -Wdeclaration-after-statement -Wendif-labels -fno-strict-aliasing -fwrapv -I../../../src/include -I/opt/local/include  -I/opt/local/include  -c -o nodeHashjoin.o nodeHashjoin.c
1087/usr/bin/gcc-4.2 -no-cpp-precomp -O2 -arch ppc -arch i386 -Wall -Wmissing-prototypes -Wpointer-arith -Winline -Wdeclaration-after-statement -Wendif-labels -fno-strict-aliasing -fwrapv -I../../../src/include -I/opt/local/include  -I/opt/local/include  -c -o nodeIndexscan.o nodeIndexscan.c
1088/usr/bin/gcc-4.2 -no-cpp-precomp -O2 -arch ppc -arch i386 -Wall -Wmissing-prototypes -Wpointer-arith -Winline -Wdeclaration-after-statement -Wendif-labels -fno-strict-aliasing -fwrapv -I../../../src/include -I/opt/local/include  -I/opt/local/include  -c -o nodeMaterial.o nodeMaterial.c
1089/usr/bin/gcc-4.2 -no-cpp-precomp -O2 -arch ppc -arch i386 -Wall -Wmissing-prototypes -Wpointer-arith -Winline -Wdeclaration-after-statement -Wendif-labels -fno-strict-aliasing -fwrapv -I../../../src/include -I/opt/local/include  -I/opt/local/include  -c -o nodeMergejoin.o nodeMergejoin.c
1090/usr/bin/gcc-4.2 -no-cpp-precomp -O2 -arch ppc -arch i386 -Wall -Wmissing-prototypes -Wpointer-arith -Winline -Wdeclaration-after-statement -Wendif-labels -fno-strict-aliasing -fwrapv -I../../../src/include -I/opt/local/include  -I/opt/local/include  -c -o nodeNestloop.o nodeNestloop.c
1091/usr/bin/gcc-4.2 -no-cpp-precomp -O2 -arch ppc -arch i386 -Wall -Wmissing-prototypes -Wpointer-arith -Winline -Wdeclaration-after-statement -Wendif-labels -fno-strict-aliasing -fwrapv -I../../../src/include -I/opt/local/include  -I/opt/local/include  -c -o nodeFunctionscan.o nodeFunctionscan.c
1092/usr/bin/gcc-4.2 -no-cpp-precomp -O2 -arch ppc -arch i386 -Wall -Wmissing-prototypes -Wpointer-arith -Winline -Wdeclaration-after-statement -Wendif-labels -fno-strict-aliasing -fwrapv -I../../../src/include -I/opt/local/include  -I/opt/local/include  -c -o nodeResult.o nodeResult.c
1093/usr/bin/gcc-4.2 -no-cpp-precomp -O2 -arch ppc -arch i386 -Wall -Wmissing-prototypes -Wpointer-arith -Winline -Wdeclaration-after-statement -Wendif-labels -fno-strict-aliasing -fwrapv -I../../../src/include -I/opt/local/include  -I/opt/local/include  -c -o nodeSeqscan.o nodeSeqscan.c
1094/usr/bin/gcc-4.2 -no-cpp-precomp -O2 -arch ppc -arch i386 -Wall -Wmissing-prototypes -Wpointer-arith -Winline -Wdeclaration-after-statement -Wendif-labels -fno-strict-aliasing -fwrapv -I../../../src/include -I/opt/local/include  -I/opt/local/include  -c -o nodeSetOp.o nodeSetOp.c
1095/usr/bin/gcc-4.2 -no-cpp-precomp -O2 -arch ppc -arch i386 -Wall -Wmissing-prototypes -Wpointer-arith -Winline -Wdeclaration-after-statement -Wendif-labels -fno-strict-aliasing -fwrapv -I../../../src/include -I/opt/local/include  -I/opt/local/include  -c -o nodeSort.o nodeSort.c
1096/usr/bin/gcc-4.2 -no-cpp-precomp -O2 -arch ppc -arch i386 -Wall -Wmissing-prototypes -Wpointer-arith -Winline -Wdeclaration-after-statement -Wendif-labels -fno-strict-aliasing -fwrapv -I../../../src/include -I/opt/local/include  -I/opt/local/include  -c -o nodeUnique.o nodeUnique.c
1097/usr/bin/gcc-4.2 -no-cpp-precomp -O2 -arch ppc -arch i386 -Wall -Wmissing-prototypes -Wpointer-arith -Winline -Wdeclaration-after-statement -Wendif-labels -fno-strict-aliasing -fwrapv -I../../../src/include -I/opt/local/include  -I/opt/local/include  -c -o nodeValuesscan.o nodeValuesscan.c
1098/usr/bin/gcc-4.2 -no-cpp-precomp -O2 -arch ppc -arch i386 -Wall -Wmissing-prototypes -Wpointer-arith -Winline -Wdeclaration-after-statement -Wendif-labels -fno-strict-aliasing -fwrapv -I../../../src/include -I/opt/local/include  -I/opt/local/include  -c -o nodeLimit.o nodeLimit.c
1099/usr/bin/gcc-4.2 -no-cpp-precomp -O2 -arch ppc -arch i386 -Wall -Wmissing-prototypes -Wpointer-arith -Winline -Wdeclaration-after-statement -Wendif-labels -fno-strict-aliasing -fwrapv -I../../../src/include -I/opt/local/include  -I/opt/local/include  -c -o nodeGroup.o nodeGroup.c
1100/usr/bin/gcc-4.2 -no-cpp-precomp -O2 -arch ppc -arch i386 -Wall -Wmissing-prototypes -Wpointer-arith -Winline -Wdeclaration-after-statement -Wendif-labels -fno-strict-aliasing -fwrapv -I../../../src/include -I/opt/local/include  -I/opt/local/include  -c -o nodeSubplan.o nodeSubplan.c
1101/usr/bin/gcc-4.2 -no-cpp-precomp -O2 -arch ppc -arch i386 -Wall -Wmissing-prototypes -Wpointer-arith -Winline -Wdeclaration-after-statement -Wendif-labels -fno-strict-aliasing -fwrapv -I../../../src/include -I/opt/local/include  -I/opt/local/include  -c -o nodeSubqueryscan.o nodeSubqueryscan.c
1102/usr/bin/gcc-4.2 -no-cpp-precomp -O2 -arch ppc -arch i386 -Wall -Wmissing-prototypes -Wpointer-arith -Winline -Wdeclaration-after-statement -Wendif-labels -fno-strict-aliasing -fwrapv -I../../../src/include -I/opt/local/include  -I/opt/local/include  -c -o nodeTidscan.o nodeTidscan.c
1103/usr/bin/gcc-4.2 -no-cpp-precomp -O2 -arch ppc -arch i386 -Wall -Wmissing-prototypes -Wpointer-arith -Winline -Wdeclaration-after-statement -Wendif-labels -fno-strict-aliasing -fwrapv -I../../../src/include -I/opt/local/include  -I/opt/local/include  -c -o tstoreReceiver.o tstoreReceiver.c
1104/usr/bin/gcc-4.2 -no-cpp-precomp -O2 -arch ppc -arch i386 -Wall -Wmissing-prototypes -Wpointer-arith -Winline -Wdeclaration-after-statement -Wendif-labels -fno-strict-aliasing -fwrapv -I../../../src/include -I/opt/local/include  -I/opt/local/include  -c -o spi.o spi.c
1105/usr/libexec/gcc/i686-apple-darwin10/4.2.1/ld -r -o SUBSYS.o execAmi.o execGrouping.o execJunk.o execMain.o execProcnode.o execQual.o execScan.o execTuples.o execUtils.o functions.o instrument.o nodeAppend.o nodeAgg.o nodeBitmapAnd.o nodeBitmapOr.o nodeBitmapHeapscan.o nodeBitmapIndexscan.o nodeHash.o nodeHashjoin.o nodeIndexscan.o nodeMaterial.o nodeMergejoin.o nodeNestloop.o nodeFunctionscan.o nodeResult.o nodeSeqscan.o nodeSetOp.o nodeSort.o nodeUnique.o nodeValuesscan.o nodeLimit.o nodeGroup.o nodeSubplan.o nodeSubqueryscan.o nodeTidscan.o tstoreReceiver.o spi.o
1106ld: warning: -arch not specified
1107ld: warning: in execAmi.o, missing required architecture x86_64 in file
1108ld: warning: in execGrouping.o, missing required architecture x86_64 in file
1109ld: warning: in execJunk.o, missing required architecture x86_64 in file
1110ld: warning: in execMain.o, missing required architecture x86_64 in file
1111ld: warning: in execProcnode.o, missing required architecture x86_64 in file
1112ld: warning: in execQual.o, missing required architecture x86_64 in file
1113ld: warning: in execScan.o, missing required architecture x86_64 in file
1114ld: warning: in execTuples.o, missing required architecture x86_64 in file
1115ld: warning: in execUtils.o, missing required architecture x86_64 in file
1116ld: warning: in functions.o, missing required architecture x86_64 in file
1117ld: warning: in instrument.o, missing required architecture x86_64 in file
1118ld: warning: in nodeAppend.o, missing required architecture x86_64 in file
1119ld: warning: in nodeAgg.o, missing required architecture x86_64 in file
1120ld: warning: in nodeBitmapAnd.o, missing required architecture x86_64 in file
1121ld: warning: in nodeBitmapOr.o, missing required architecture x86_64 in file
1122ld: warning: in nodeBitmapHeapscan.o, missing required architecture x86_64 in file
1123ld: warning: in nodeBitmapIndexscan.o, missing required architecture x86_64 in file
1124ld: warning: in nodeHash.o, missing required architecture x86_64 in file
1125ld: warning: in nodeHashjoin.o, missing required architecture x86_64 in file
1126ld: warning: in nodeIndexscan.o, missing required architecture x86_64 in file
1127ld: warning: in nodeMaterial.o, missing required architecture x86_64 in file
1128ld: warning: in nodeMergejoin.o, missing required architecture x86_64 in file
1129ld: warning: in nodeNestloop.o, missing required architecture x86_64 in file
1130ld: warning: in nodeFunctionscan.o, missing required architecture x86_64 in file
1131ld: warning: in nodeResult.o, missing required architecture x86_64 in file
1132ld: warning: in nodeSeqscan.o, missing required architecture x86_64 in file
1133ld: warning: in nodeSetOp.o, missing required architecture x86_64 in file
1134ld: warning: in nodeSort.o, missing required architecture x86_64 in file
1135ld: warning: in nodeUnique.o, missing required architecture x86_64 in file
1136ld: warning: in nodeValuesscan.o, missing required architecture x86_64 in file
1137ld: warning: in nodeLimit.o, missing required architecture x86_64 in file
1138ld: warning: in nodeGroup.o, missing required architecture x86_64 in file
1139ld: warning: in nodeSubplan.o, missing required architecture x86_64 in file
1140ld: warning: in nodeSubqueryscan.o, missing required architecture x86_64 in file
1141ld: warning: in nodeTidscan.o, missing required architecture x86_64 in file
1142ld: warning: in tstoreReceiver.o, missing required architecture x86_64 in file
1143ld: warning: in spi.o, missing required architecture x86_64 in file
1144/usr/bin/gnumake -C lib all
1145/usr/bin/gcc-4.2 -no-cpp-precomp -O2 -arch ppc -arch i386 -Wall -Wmissing-prototypes -Wpointer-arith -Winline -Wdeclaration-after-statement -Wendif-labels -fno-strict-aliasing -fwrapv -I../../../src/include -I/opt/local/include  -I/opt/local/include  -c -o dllist.o dllist.c
1146/usr/bin/gcc-4.2 -no-cpp-precomp -O2 -arch ppc -arch i386 -Wall -Wmissing-prototypes -Wpointer-arith -Winline -Wdeclaration-after-statement -Wendif-labels -fno-strict-aliasing -fwrapv -I../../../src/include -I/opt/local/include  -I/opt/local/include  -c -o stringinfo.o stringinfo.c
1147/usr/libexec/gcc/i686-apple-darwin10/4.2.1/ld -r -o SUBSYS.o dllist.o stringinfo.o
1148ld: warning: -arch not specified
1149ld: warning: in dllist.o, missing required architecture x86_64 in file
1150ld: warning: in stringinfo.o, missing required architecture x86_64 in file
1151/usr/bin/gnumake -C libpq all
1152/usr/bin/gcc-4.2 -no-cpp-precomp -O2 -arch ppc -arch i386 -Wall -Wmissing-prototypes -Wpointer-arith -Winline -Wdeclaration-after-statement -Wendif-labels -fno-strict-aliasing -fwrapv -I../../../src/include -I/opt/local/include  -I/opt/local/include  -c -o be-fsstubs.o be-fsstubs.c
1153/usr/bin/gcc-4.2 -no-cpp-precomp -O2 -arch ppc -arch i386 -Wall -Wmissing-prototypes -Wpointer-arith -Winline -Wdeclaration-after-statement -Wendif-labels -fno-strict-aliasing -fwrapv -I../../../src/include -I/opt/local/include  -I/opt/local/include  -c -o be-secure.o be-secure.c
1154/usr/bin/gcc-4.2 -no-cpp-precomp -O2 -arch ppc -arch i386 -Wall -Wmissing-prototypes -Wpointer-arith -Winline -Wdeclaration-after-statement -Wendif-labels -fno-strict-aliasing -fwrapv -I../../../src/include -I/opt/local/include  -I/opt/local/include  -c -o auth.o auth.c
1155/usr/bin/gcc-4.2 -no-cpp-precomp -O2 -arch ppc -arch i386 -Wall -Wmissing-prototypes -Wpointer-arith -Winline -Wdeclaration-after-statement -Wendif-labels -fno-strict-aliasing -fwrapv -I../../../src/include -I/opt/local/include  -I/opt/local/include  -c -o crypt.o crypt.c
1156/usr/bin/gcc-4.2 -no-cpp-precomp -O2 -arch ppc -arch i386 -Wall -Wmissing-prototypes -Wpointer-arith -Winline -Wdeclaration-after-statement -Wendif-labels -fno-strict-aliasing -fwrapv -I../../../src/include -I/opt/local/include  -I/opt/local/include  -c -o hba.o hba.c
1157/usr/bin/gcc-4.2 -no-cpp-precomp -O2 -arch ppc -arch i386 -Wall -Wmissing-prototypes -Wpointer-arith -Winline -Wdeclaration-after-statement -Wendif-labels -fno-strict-aliasing -fwrapv -I../../../src/include -I/opt/local/include  -I/opt/local/include  -c -o ip.o ip.c
1158/usr/bin/gcc-4.2 -no-cpp-precomp -O2 -arch ppc -arch i386 -Wall -Wmissing-prototypes -Wpointer-arith -Winline -Wdeclaration-after-statement -Wendif-labels -fno-strict-aliasing -fwrapv -I../../../src/include -I/opt/local/include  -I/opt/local/include  -c -o md5.o md5.c
1159/usr/bin/gcc-4.2 -no-cpp-precomp -O2 -arch ppc -arch i386 -Wall -Wmissing-prototypes -Wpointer-arith -Winline -Wdeclaration-after-statement -Wendif-labels -fno-strict-aliasing -fwrapv -I../../../src/include -I/opt/local/include  -I/opt/local/include  -c -o pqcomm.o pqcomm.c
1160/usr/bin/gcc-4.2 -no-cpp-precomp -O2 -arch ppc -arch i386 -Wall -Wmissing-prototypes -Wpointer-arith -Winline -Wdeclaration-after-statement -Wendif-labels -fno-strict-aliasing -fwrapv -I../../../src/include -I/opt/local/include  -I/opt/local/include  -c -o pqformat.o pqformat.c
1161/usr/bin/gcc-4.2 -no-cpp-precomp -O2 -arch ppc -arch i386 -Wall -Wmissing-prototypes -Wpointer-arith -Winline -Wdeclaration-after-statement -Wendif-labels -fno-strict-aliasing -fwrapv -I../../../src/include -I/opt/local/include  -I/opt/local/include  -c -o pqsignal.o pqsignal.c
1162/usr/libexec/gcc/i686-apple-darwin10/4.2.1/ld -r -o SUBSYS.o be-fsstubs.o be-secure.o auth.o crypt.o hba.o ip.o md5.o pqcomm.o pqformat.o pqsignal.o
1163ld: warning: -arch not specified
1164ld: warning: in be-fsstubs.o, missing required architecture x86_64 in file
1165ld: warning: in be-secure.o, missing required architecture x86_64 in file
1166ld: warning: in auth.o, missing required architecture x86_64 in file
1167ld: warning: in crypt.o, missing required architecture x86_64 in file
1168ld: warning: in hba.o, missing required architecture x86_64 in file
1169ld: warning: in ip.o, missing required architecture x86_64 in file
1170ld: warning: in md5.o, missing required architecture x86_64 in file
1171ld: warning: in pqcomm.o, missing required architecture x86_64 in file
1172ld: warning: in pqformat.o, missing required architecture x86_64 in file
1173ld: warning: in pqsignal.o, missing required architecture x86_64 in file
1174/usr/bin/gnumake -C main all
1175/usr/bin/gcc-4.2 -no-cpp-precomp -O2 -arch ppc -arch i386 -Wall -Wmissing-prototypes -Wpointer-arith -Winline -Wdeclaration-after-statement -Wendif-labels -fno-strict-aliasing -fwrapv -I../../../src/include -I/opt/local/include  -I/opt/local/include  -c -o main.o main.c
1176/usr/libexec/gcc/i686-apple-darwin10/4.2.1/ld -r -o SUBSYS.o main.o
1177ld: warning: -arch not specified
1178ld: warning: in main.o, missing required architecture x86_64 in file
1179/usr/bin/gnumake -C nodes all
1180/usr/bin/gcc-4.2 -no-cpp-precomp -O2 -arch ppc -arch i386 -Wall -Wmissing-prototypes -Wpointer-arith -Winline -Wdeclaration-after-statement -Wendif-labels -fno-strict-aliasing -fwrapv -I../../../src/include -I/opt/local/include  -I/opt/local/include  -c -o nodeFuncs.o nodeFuncs.c
1181/usr/bin/gcc-4.2 -no-cpp-precomp -O2 -arch ppc -arch i386 -Wall -Wmissing-prototypes -Wpointer-arith -Winline -Wdeclaration-after-statement -Wendif-labels -fno-strict-aliasing -fwrapv -I../../../src/include -I/opt/local/include  -I/opt/local/include  -c -o nodes.o nodes.c
1182/usr/bin/gcc-4.2 -no-cpp-precomp -O2 -arch ppc -arch i386 -Wall -Wmissing-prototypes -Wpointer-arith -Winline -Wdeclaration-after-statement -Wendif-labels -fno-strict-aliasing -fwrapv -I../../../src/include -I/opt/local/include  -I/opt/local/include  -c -o list.o list.c
1183/usr/bin/gcc-4.2 -no-cpp-precomp -O2 -arch ppc -arch i386 -Wall -Wmissing-prototypes -Wpointer-arith -Winline -Wdeclaration-after-statement -Wendif-labels -fno-strict-aliasing -fwrapv -I../../../src/include -I/opt/local/include  -I/opt/local/include  -c -o bitmapset.o bitmapset.c
1184/usr/bin/gcc-4.2 -no-cpp-precomp -O2 -arch ppc -arch i386 -Wall -Wmissing-prototypes -Wpointer-arith -Winline -Wdeclaration-after-statement -Wendif-labels -fno-strict-aliasing -fwrapv -I../../../src/include -I/opt/local/include  -I/opt/local/include  -c -o tidbitmap.o tidbitmap.c
1185/usr/bin/gcc-4.2 -no-cpp-precomp -O2 -arch ppc -arch i386 -Wall -Wmissing-prototypes -Wpointer-arith -Winline -Wdeclaration-after-statement -Wendif-labels -fno-strict-aliasing -fwrapv -I../../../src/include -I/opt/local/include  -I/opt/local/include  -c -o copyfuncs.o copyfuncs.c
1186/usr/bin/gcc-4.2 -no-cpp-precomp -O2 -arch ppc -arch i386 -Wall -Wmissing-prototypes -Wpointer-arith -Winline -Wdeclaration-after-statement -Wendif-labels -fno-strict-aliasing -fwrapv -I../../../src/include -I/opt/local/include  -I/opt/local/include  -c -o equalfuncs.o equalfuncs.c
1187/usr/bin/gcc-4.2 -no-cpp-precomp -O2 -arch ppc -arch i386 -Wall -Wmissing-prototypes -Wpointer-arith -Winline -Wdeclaration-after-statement -Wendif-labels -fno-strict-aliasing -fwrapv -I../../../src/include -I/opt/local/include  -I/opt/local/include  -c -o makefuncs.o makefuncs.c
1188/usr/bin/gcc-4.2 -no-cpp-precomp -O2 -arch ppc -arch i386 -Wall -Wmissing-prototypes -Wpointer-arith -Winline -Wdeclaration-after-statement -Wendif-labels -fno-strict-aliasing -fwrapv -I../../../src/include -I/opt/local/include  -I/opt/local/include  -c -o outfuncs.o outfuncs.c
1189/usr/bin/gcc-4.2 -no-cpp-precomp -O2 -arch ppc -arch i386 -Wall -Wmissing-prototypes -Wpointer-arith -Winline -Wdeclaration-after-statement -Wendif-labels -fno-strict-aliasing -fwrapv -I../../../src/include -I/opt/local/include  -I/opt/local/include  -c -o readfuncs.o readfuncs.c
1190/usr/bin/gcc-4.2 -no-cpp-precomp -O2 -arch ppc -arch i386 -Wall -Wmissing-prototypes -Wpointer-arith -Winline -Wdeclaration-after-statement -Wendif-labels -fno-strict-aliasing -fwrapv -I../../../src/include -I/opt/local/include  -I/opt/local/include  -c -o print.o print.c
1191/usr/bin/gcc-4.2 -no-cpp-precomp -O2 -arch ppc -arch i386 -Wall -Wmissing-prototypes -Wpointer-arith -Winline -Wdeclaration-after-statement -Wendif-labels -fno-strict-aliasing -fwrapv -I../../../src/include -I/opt/local/include  -I/opt/local/include  -c -o read.o read.c
1192/usr/bin/gcc-4.2 -no-cpp-precomp -O2 -arch ppc -arch i386 -Wall -Wmissing-prototypes -Wpointer-arith -Winline -Wdeclaration-after-statement -Wendif-labels -fno-strict-aliasing -fwrapv -I../../../src/include -I/opt/local/include  -I/opt/local/include  -c -o params.o params.c
1193/usr/bin/gcc-4.2 -no-cpp-precomp -O2 -arch ppc -arch i386 -Wall -Wmissing-prototypes -Wpointer-arith -Winline -Wdeclaration-after-statement -Wendif-labels -fno-strict-aliasing -fwrapv -I../../../src/include -I/opt/local/include  -I/opt/local/include  -c -o value.o value.c
1194/usr/libexec/gcc/i686-apple-darwin10/4.2.1/ld -r -o SUBSYS.o nodeFuncs.o nodes.o list.o bitmapset.o tidbitmap.o copyfuncs.o equalfuncs.o makefuncs.o outfuncs.o readfuncs.o print.o read.o params.o value.o
1195ld: warning: -arch not specified
1196ld: warning: in nodeFuncs.o, missing required architecture x86_64 in file
1197ld: warning: in nodes.o, missing required architecture x86_64 in file
1198ld: warning: in list.o, missing required architecture x86_64 in file
1199ld: warning: in bitmapset.o, missing required architecture x86_64 in file
1200ld: warning: in tidbitmap.o, missing required architecture x86_64 in file
1201ld: warning: in copyfuncs.o, missing required architecture x86_64 in file
1202ld: warning: in equalfuncs.o, missing required architecture x86_64 in file
1203ld: warning: in makefuncs.o, missing required architecture x86_64 in file
1204ld: warning: in outfuncs.o, missing required architecture x86_64 in file
1205ld: warning: in readfuncs.o, missing required architecture x86_64 in file
1206ld: warning: in print.o, missing required architecture x86_64 in file
1207ld: warning: in read.o, missing required architecture x86_64 in file
1208ld: warning: in params.o, missing required architecture x86_64 in file
1209ld: warning: in value.o, missing required architecture x86_64 in file
1210/usr/bin/gnumake -C optimizer all
1211/usr/bin/gnumake -C geqo SUBSYS.o
1212/usr/bin/gcc-4.2 -no-cpp-precomp -O2 -arch ppc -arch i386 -Wall -Wmissing-prototypes -Wpointer-arith -Winline -Wdeclaration-after-statement -Wendif-labels -fno-strict-aliasing -fwrapv -I../../../../src/include -I/opt/local/include  -I/opt/local/include  -c -o geqo_copy.o geqo_copy.c
1213/usr/bin/gcc-4.2 -no-cpp-precomp -O2 -arch ppc -arch i386 -Wall -Wmissing-prototypes -Wpointer-arith -Winline -Wdeclaration-after-statement -Wendif-labels -fno-strict-aliasing -fwrapv -I../../../../src/include -I/opt/local/include  -I/opt/local/include  -c -o geqo_eval.o geqo_eval.c
1214/usr/bin/gcc-4.2 -no-cpp-precomp -O2 -arch ppc -arch i386 -Wall -Wmissing-prototypes -Wpointer-arith -Winline -Wdeclaration-after-statement -Wendif-labels -fno-strict-aliasing -fwrapv -I../../../../src/include -I/opt/local/include  -I/opt/local/include  -c -o geqo_main.o geqo_main.c
1215/usr/bin/gcc-4.2 -no-cpp-precomp -O2 -arch ppc -arch i386 -Wall -Wmissing-prototypes -Wpointer-arith -Winline -Wdeclaration-after-statement -Wendif-labels -fno-strict-aliasing -fwrapv -I../../../../src/include -I/opt/local/include  -I/opt/local/include  -c -o geqo_misc.o geqo_misc.c
1216/usr/bin/gcc-4.2 -no-cpp-precomp -O2 -arch ppc -arch i386 -Wall -Wmissing-prototypes -Wpointer-arith -Winline -Wdeclaration-after-statement -Wendif-labels -fno-strict-aliasing -fwrapv -I../../../../src/include -I/opt/local/include  -I/opt/local/include  -c -o geqo_mutation.o geqo_mutation.c
1217/usr/bin/gcc-4.2 -no-cpp-precomp -O2 -arch ppc -arch i386 -Wall -Wmissing-prototypes -Wpointer-arith -Winline -Wdeclaration-after-statement -Wendif-labels -fno-strict-aliasing -fwrapv -I../../../../src/include -I/opt/local/include  -I/opt/local/include  -c -o geqo_pool.o geqo_pool.c
1218/usr/bin/gcc-4.2 -no-cpp-precomp -O2 -arch ppc -arch i386 -Wall -Wmissing-prototypes -Wpointer-arith -Winline -Wdeclaration-after-statement -Wendif-labels -fno-strict-aliasing -fwrapv -I../../../../src/include -I/opt/local/include  -I/opt/local/include  -c -o geqo_recombination.o geqo_recombination.c
1219/usr/bin/gcc-4.2 -no-cpp-precomp -O2 -arch ppc -arch i386 -Wall -Wmissing-prototypes -Wpointer-arith -Winline -Wdeclaration-after-statement -Wendif-labels -fno-strict-aliasing -fwrapv -I../../../../src/include -I/opt/local/include  -I/opt/local/include  -c -o geqo_selection.o geqo_selection.c
1220/usr/bin/gcc-4.2 -no-cpp-precomp -O2 -arch ppc -arch i386 -Wall -Wmissing-prototypes -Wpointer-arith -Winline -Wdeclaration-after-statement -Wendif-labels -fno-strict-aliasing -fwrapv -I../../../../src/include -I/opt/local/include  -I/opt/local/include  -c -o geqo_erx.o geqo_erx.c
1221/usr/bin/gcc-4.2 -no-cpp-precomp -O2 -arch ppc -arch i386 -Wall -Wmissing-prototypes -Wpointer-arith -Winline -Wdeclaration-after-statement -Wendif-labels -fno-strict-aliasing -fwrapv -I../../../../src/include -I/opt/local/include  -I/opt/local/include  -c -o geqo_pmx.o geqo_pmx.c
1222/usr/bin/gcc-4.2 -no-cpp-precomp -O2 -arch ppc -arch i386 -Wall -Wmissing-prototypes -Wpointer-arith -Winline -Wdeclaration-after-statement -Wendif-labels -fno-strict-aliasing -fwrapv -I../../../../src/include -I/opt/local/include  -I/opt/local/include  -c -o geqo_cx.o geqo_cx.c
1223/usr/bin/gcc-4.2 -no-cpp-precomp -O2 -arch ppc -arch i386 -Wall -Wmissing-prototypes -Wpointer-arith -Winline -Wdeclaration-after-statement -Wendif-labels -fno-strict-aliasing -fwrapv -I../../../../src/include -I/opt/local/include  -I/opt/local/include  -c -o geqo_px.o geqo_px.c
1224/usr/bin/gcc-4.2 -no-cpp-precomp -O2 -arch ppc -arch i386 -Wall -Wmissing-prototypes -Wpointer-arith -Winline -Wdeclaration-after-statement -Wendif-labels -fno-strict-aliasing -fwrapv -I../../../../src/include -I/opt/local/include  -I/opt/local/include  -c -o geqo_ox1.o geqo_ox1.c
1225/usr/bin/gcc-4.2 -no-cpp-precomp -O2 -arch ppc -arch i386 -Wall -Wmissing-prototypes -Wpointer-arith -Winline -Wdeclaration-after-statement -Wendif-labels -fno-strict-aliasing -fwrapv -I../../../../src/include -I/opt/local/include  -I/opt/local/include  -c -o geqo_ox2.o geqo_ox2.c
1226/usr/libexec/gcc/i686-apple-darwin10/4.2.1/ld -r -o SUBSYS.o geqo_copy.o geqo_eval.o geqo_main.o geqo_misc.o geqo_mutation.o geqo_pool.o geqo_recombination.o geqo_selection.o geqo_erx.o geqo_pmx.o geqo_cx.o geqo_px.o geqo_ox1.o geqo_ox2.o
1227ld: warning: -arch not specified
1228ld: warning: in geqo_copy.o, missing required architecture x86_64 in file
1229ld: warning: in geqo_eval.o, missing required architecture x86_64 in file
1230ld: warning: in geqo_main.o, missing required architecture x86_64 in file
1231ld: warning: in geqo_misc.o, missing required architecture x86_64 in file
1232ld: warning: in geqo_mutation.o, missing required architecture x86_64 in file
1233ld: warning: in geqo_pool.o, missing required architecture x86_64 in file
1234ld: warning: in geqo_recombination.o, missing required architecture x86_64 in file
1235ld: warning: in geqo_selection.o, missing required architecture x86_64 in file
1236ld: warning: in geqo_erx.o, missing required architecture x86_64 in file
1237ld: warning: in geqo_pmx.o, missing required architecture x86_64 in file
1238ld: warning: in geqo_cx.o, missing required architecture x86_64 in file
1239ld: warning: in geqo_px.o, missing required architecture x86_64 in file
1240ld: warning: in geqo_ox1.o, missing required architecture x86_64 in file
1241ld: warning: in geqo_ox2.o, missing required architecture x86_64 in file
1242/usr/bin/gnumake -C path SUBSYS.o
1243/usr/bin/gcc-4.2 -no-cpp-precomp -O2 -arch ppc -arch i386 -Wall -Wmissing-prototypes -Wpointer-arith -Winline -Wdeclaration-after-statement -Wendif-labels -fno-strict-aliasing -fwrapv -I../../../../src/include -I/opt/local/include  -I/opt/local/include  -c -o allpaths.o allpaths.c
1244/usr/bin/gcc-4.2 -no-cpp-precomp -O2 -arch ppc -arch i386 -Wall -Wmissing-prototypes -Wpointer-arith -Winline -Wdeclaration-after-statement -Wendif-labels -fno-strict-aliasing -fwrapv -I../../../../src/include -I/opt/local/include  -I/opt/local/include  -c -o clausesel.o clausesel.c
1245/usr/bin/gcc-4.2 -no-cpp-precomp -O2 -arch ppc -arch i386 -Wall -Wmissing-prototypes -Wpointer-arith -Winline -Wdeclaration-after-statement -Wendif-labels -fno-strict-aliasing -fwrapv -I../../../../src/include -I/opt/local/include  -I/opt/local/include  -c -o costsize.o costsize.c
1246/usr/bin/gcc-4.2 -no-cpp-precomp -O2 -arch ppc -arch i386 -Wall -Wmissing-prototypes -Wpointer-arith -Winline -Wdeclaration-after-statement -Wendif-labels -fno-strict-aliasing -fwrapv -I../../../../src/include -I/opt/local/include  -I/opt/local/include  -c -o indxpath.o indxpath.c
1247/usr/bin/gcc-4.2 -no-cpp-precomp -O2 -arch ppc -arch i386 -Wall -Wmissing-prototypes -Wpointer-arith -Winline -Wdeclaration-after-statement -Wendif-labels -fno-strict-aliasing -fwrapv -I../../../../src/include -I/opt/local/include  -I/opt/local/include  -c -o joinpath.o joinpath.c
1248/usr/bin/gcc-4.2 -no-cpp-precomp -O2 -arch ppc -arch i386 -Wall -Wmissing-prototypes -Wpointer-arith -Winline -Wdeclaration-after-statement -Wendif-labels -fno-strict-aliasing -fwrapv -I../../../../src/include -I/opt/local/include  -I/opt/local/include  -c -o joinrels.o joinrels.c
1249/usr/bin/gcc-4.2 -no-cpp-precomp -O2 -arch ppc -arch i386 -Wall -Wmissing-prototypes -Wpointer-arith -Winline -Wdeclaration-after-statement -Wendif-labels -fno-strict-aliasing -fwrapv -I../../../../src/include -I/opt/local/include  -I/opt/local/include  -c -o orindxpath.o orindxpath.c
1250/usr/bin/gcc-4.2 -no-cpp-precomp -O2 -arch ppc -arch i386 -Wall -Wmissing-prototypes -Wpointer-arith -Winline -Wdeclaration-after-statement -Wendif-labels -fno-strict-aliasing -fwrapv -I../../../../src/include -I/opt/local/include  -I/opt/local/include  -c -o pathkeys.o pathkeys.c
1251/usr/bin/gcc-4.2 -no-cpp-precomp -O2 -arch ppc -arch i386 -Wall -Wmissing-prototypes -Wpointer-arith -Winline -Wdeclaration-after-statement -Wendif-labels -fno-strict-aliasing -fwrapv -I../../../../src/include -I/opt/local/include  -I/opt/local/include  -c -o tidpath.o tidpath.c
1252/usr/libexec/gcc/i686-apple-darwin10/4.2.1/ld -r -o SUBSYS.o allpaths.o clausesel.o costsize.o indxpath.o joinpath.o joinrels.o orindxpath.o pathkeys.o tidpath.o
1253ld: warning: -arch not specified
1254ld: warning: in allpaths.o, missing required architecture x86_64 in file
1255ld: warning: in clausesel.o, missing required architecture x86_64 in file
1256ld: warning: in costsize.o, missing required architecture x86_64 in file
1257ld: warning: in indxpath.o, missing required architecture x86_64 in file
1258ld: warning: in joinpath.o, missing required architecture x86_64 in file
1259ld: warning: in joinrels.o, missing required architecture x86_64 in file
1260ld: warning: in orindxpath.o, missing required architecture x86_64 in file
1261ld: warning: in pathkeys.o, missing required architecture x86_64 in file
1262ld: warning: in tidpath.o, missing required architecture x86_64 in file
1263/usr/bin/gnumake -C plan SUBSYS.o
1264/usr/bin/gcc-4.2 -no-cpp-precomp -O2 -arch ppc -arch i386 -Wall -Wmissing-prototypes -Wpointer-arith -Winline -Wdeclaration-after-statement -Wendif-labels -fno-strict-aliasing -fwrapv -I../../../../src/include -I/opt/local/include  -I/opt/local/include  -c -o createplan.o createplan.c
1265/usr/bin/gcc-4.2 -no-cpp-precomp -O2 -arch ppc -arch i386 -Wall -Wmissing-prototypes -Wpointer-arith -Winline -Wdeclaration-after-statement -Wendif-labels -fno-strict-aliasing -fwrapv -I../../../../src/include -I/opt/local/include  -I/opt/local/include  -c -o initsplan.o initsplan.c
1266/usr/bin/gcc-4.2 -no-cpp-precomp -O2 -arch ppc -arch i386 -Wall -Wmissing-prototypes -Wpointer-arith -Winline -Wdeclaration-after-statement -Wendif-labels -fno-strict-aliasing -fwrapv -I../../../../src/include -I/opt/local/include  -I/opt/local/include  -c -o planagg.o planagg.c
1267/usr/bin/gcc-4.2 -no-cpp-precomp -O2 -arch ppc -arch i386 -Wall -Wmissing-prototypes -Wpointer-arith -Winline -Wdeclaration-after-statement -Wendif-labels -fno-strict-aliasing -fwrapv -I../../../../src/include -I/opt/local/include  -I/opt/local/include  -c -o planmain.o planmain.c
1268/usr/bin/gcc-4.2 -no-cpp-precomp -O2 -arch ppc -arch i386 -Wall -Wmissing-prototypes -Wpointer-arith -Winline -Wdeclaration-after-statement -Wendif-labels -fno-strict-aliasing -fwrapv -I../../../../src/include -I/opt/local/include  -I/opt/local/include  -c -o planner.o planner.c
1269/usr/bin/gcc-4.2 -no-cpp-precomp -O2 -arch ppc -arch i386 -Wall -Wmissing-prototypes -Wpointer-arith -Winline -Wdeclaration-after-statement -Wendif-labels -fno-strict-aliasing -fwrapv -I../../../../src/include -I/opt/local/include  -I/opt/local/include  -c -o setrefs.o setrefs.c
1270/usr/bin/gcc-4.2 -no-cpp-precomp -O2 -arch ppc -arch i386 -Wall -Wmissing-prototypes -Wpointer-arith -Winline -Wdeclaration-after-statement -Wendif-labels -fno-strict-aliasing -fwrapv -I../../../../src/include -I/opt/local/include  -I/opt/local/include  -c -o subselect.o subselect.c
1271/usr/libexec/gcc/i686-apple-darwin10/4.2.1/ld -r -o SUBSYS.o createplan.o initsplan.o planagg.o planmain.o planner.o setrefs.o subselect.o
1272ld: warning: -arch not specified
1273ld: warning: in createplan.o, missing required architecture x86_64 in file
1274ld: warning: in initsplan.o, missing required architecture x86_64 in file
1275ld: warning: in planagg.o, missing required architecture x86_64 in file
1276ld: warning: in planmain.o, missing required architecture x86_64 in file
1277ld: warning: in planner.o, missing required architecture x86_64 in file
1278ld: warning: in setrefs.o, missing required architecture x86_64 in file
1279ld: warning: in subselect.o, missing required architecture x86_64 in file
1280/usr/bin/gnumake -C prep SUBSYS.o
1281/usr/bin/gcc-4.2 -no-cpp-precomp -O2 -arch ppc -arch i386 -Wall -Wmissing-prototypes -Wpointer-arith -Winline -Wdeclaration-after-statement -Wendif-labels -fno-strict-aliasing -fwrapv -I../../../../src/include -I/opt/local/include  -I/opt/local/include  -c -o prepjointree.o prepjointree.c
1282/usr/bin/gcc-4.2 -no-cpp-precomp -O2 -arch ppc -arch i386 -Wall -Wmissing-prototypes -Wpointer-arith -Winline -Wdeclaration-after-statement -Wendif-labels -fno-strict-aliasing -fwrapv -I../../../../src/include -I/opt/local/include  -I/opt/local/include  -c -o prepqual.o prepqual.c
1283/usr/bin/gcc-4.2 -no-cpp-precomp -O2 -arch ppc -arch i386 -Wall -Wmissing-prototypes -Wpointer-arith -Winline -Wdeclaration-after-statement -Wendif-labels -fno-strict-aliasing -fwrapv -I../../../../src/include -I/opt/local/include  -I/opt/local/include  -c -o preptlist.o preptlist.c
1284/usr/bin/gcc-4.2 -no-cpp-precomp -O2 -arch ppc -arch i386 -Wall -Wmissing-prototypes -Wpointer-arith -Winline -Wdeclaration-after-statement -Wendif-labels -fno-strict-aliasing -fwrapv -I../../../../src/include -I/opt/local/include  -I/opt/local/include  -c -o prepunion.o prepunion.c
1285/usr/libexec/gcc/i686-apple-darwin10/4.2.1/ld -r -o SUBSYS.o prepjointree.o prepqual.o preptlist.o prepunion.o
1286ld: warning: -arch not specified
1287ld: warning: in prepjointree.o, missing required architecture x86_64 in file
1288ld: warning: in prepqual.o, missing required architecture x86_64 in file
1289ld: warning: in preptlist.o, missing required architecture x86_64 in file
1290ld: warning: in prepunion.o, missing required architecture x86_64 in file
1291/usr/bin/gnumake -C util SUBSYS.o
1292/usr/bin/gcc-4.2 -no-cpp-precomp -O2 -arch ppc -arch i386 -Wall -Wmissing-prototypes -Wpointer-arith -Winline -Wdeclaration-after-statement -Wendif-labels -fno-strict-aliasing -fwrapv -I../../../../src/include -I/opt/local/include  -I/opt/local/include  -c -o clauses.o clauses.c
1293/usr/bin/gcc-4.2 -no-cpp-precomp -O2 -arch ppc -arch i386 -Wall -Wmissing-prototypes -Wpointer-arith -Winline -Wdeclaration-after-statement -Wendif-labels -fno-strict-aliasing -fwrapv -I../../../../src/include -I/opt/local/include  -I/opt/local/include  -c -o joininfo.o joininfo.c
1294/usr/bin/gcc-4.2 -no-cpp-precomp -O2 -arch ppc -arch i386 -Wall -Wmissing-prototypes -Wpointer-arith -Winline -Wdeclaration-after-statement -Wendif-labels -fno-strict-aliasing -fwrapv -I../../../../src/include -I/opt/local/include  -I/opt/local/include  -c -o pathnode.o pathnode.c
1295/usr/bin/gcc-4.2 -no-cpp-precomp -O2 -arch ppc -arch i386 -Wall -Wmissing-prototypes -Wpointer-arith -Winline -Wdeclaration-after-statement -Wendif-labels -fno-strict-aliasing -fwrapv -I../../../../src/include -I/opt/local/include  -I/opt/local/include  -c -o plancat.o plancat.c
1296/usr/bin/gcc-4.2 -no-cpp-precomp -O2 -arch ppc -arch i386 -Wall -Wmissing-prototypes -Wpointer-arith -Winline -Wdeclaration-after-statement -Wendif-labels -fno-strict-aliasing -fwrapv -I../../../../src/include -I/opt/local/include  -I/opt/local/include  -c -o predtest.o predtest.c
1297/usr/bin/gcc-4.2 -no-cpp-precomp -O2 -arch ppc -arch i386 -Wall -Wmissing-prototypes -Wpointer-arith -Winline -Wdeclaration-after-statement -Wendif-labels -fno-strict-aliasing -fwrapv -I../../../../src/include -I/opt/local/include  -I/opt/local/include  -c -o relnode.o relnode.c
1298/usr/bin/gcc-4.2 -no-cpp-precomp -O2 -arch ppc -arch i386 -Wall -Wmissing-prototypes -Wpointer-arith -Winline -Wdeclaration-after-statement -Wendif-labels -fno-strict-aliasing -fwrapv -I../../../../src/include -I/opt/local/include  -I/opt/local/include  -c -o restrictinfo.o restrictinfo.c
1299/usr/bin/gcc-4.2 -no-cpp-precomp -O2 -arch ppc -arch i386 -Wall -Wmissing-prototypes -Wpointer-arith -Winline -Wdeclaration-after-statement -Wendif-labels -fno-strict-aliasing -fwrapv -I../../../../src/include -I/opt/local/include  -I/opt/local/include  -c -o tlist.o tlist.c
1300/usr/bin/gcc-4.2 -no-cpp-precomp -O2 -arch ppc -arch i386 -Wall -Wmissing-prototypes -Wpointer-arith -Winline -Wdeclaration-after-statement -Wendif-labels -fno-strict-aliasing -fwrapv -I../../../../src/include -I/opt/local/include  -I/opt/local/include  -c -o var.o var.c
1301/usr/libexec/gcc/i686-apple-darwin10/4.2.1/ld -r -o SUBSYS.o clauses.o joininfo.o pathnode.o plancat.o predtest.o relnode.o restrictinfo.o tlist.o var.o
1302ld: warning: -arch not specified
1303ld: warning: in clauses.o, missing required architecture x86_64 in file
1304ld: warning: in joininfo.o, missing required architecture x86_64 in file
1305ld: warning: in pathnode.o, missing required architecture x86_64 in file
1306ld: warning: in plancat.o, missing required architecture x86_64 in file
1307ld: warning: in predtest.o, missing required architecture x86_64 in file
1308ld: warning: in relnode.o, missing required architecture x86_64 in file
1309ld: warning: in restrictinfo.o, missing required architecture x86_64 in file
1310ld: warning: in tlist.o, missing required architecture x86_64 in file
1311ld: warning: in var.o, missing required architecture x86_64 in file
1312/usr/libexec/gcc/i686-apple-darwin10/4.2.1/ld -r -o SUBSYS.o geqo/SUBSYS.o path/SUBSYS.o plan/SUBSYS.o prep/SUBSYS.o util/SUBSYS.o
1313/usr/bin/gnumake -C port all
1314/usr/bin/gcc-4.2 -no-cpp-precomp -O2 -arch ppc -arch i386 -Wall -Wmissing-prototypes -Wpointer-arith -Winline -Wdeclaration-after-statement -Wendif-labels -fno-strict-aliasing -fwrapv -I../../../src/include -I/opt/local/include  -I/opt/local/include  -c -o dynloader.o dynloader.c
1315/usr/bin/gcc-4.2 -no-cpp-precomp -O2 -arch ppc -arch i386 -Wall -Wmissing-prototypes -Wpointer-arith -Winline -Wdeclaration-after-statement -Wendif-labels -fno-strict-aliasing -fwrapv -I../../../src/include -I/opt/local/include  -I/opt/local/include  -c -o pg_sema.o pg_sema.c
1316/usr/bin/gcc-4.2 -no-cpp-precomp -O2 -arch ppc -arch i386 -Wall -Wmissing-prototypes -Wpointer-arith -Winline -Wdeclaration-after-statement -Wendif-labels -fno-strict-aliasing -fwrapv -I../../../src/include -I/opt/local/include  -I/opt/local/include  -c -o pg_shmem.o pg_shmem.c
1317/usr/bin/gnumake -C darwin all
1318/usr/bin/gcc-4.2 -no-cpp-precomp -O2 -arch ppc -arch i386 -Wall -Wmissing-prototypes -Wpointer-arith -Winline -Wdeclaration-after-statement -Wendif-labels -fno-strict-aliasing -fwrapv -I../../../../src/include -I/opt/local/include  -I/opt/local/include  -c -o system.o system.c
1319/usr/libexec/gcc/i686-apple-darwin10/4.2.1/ld -r -o SUBSYS.o system.o
1320ld: warning: -arch not specified
1321ld: warning: in system.o, missing required architecture x86_64 in file
1322/usr/libexec/gcc/i686-apple-darwin10/4.2.1/ld -r -o SUBSYS.o dynloader.o pg_sema.o pg_shmem.o darwin/SUBSYS.o
1323ld: warning: in dynloader.o, missing required architecture x86_64 in file
1324ld: warning: in pg_sema.o, missing required architecture x86_64 in file
1325ld: warning: in pg_shmem.o, missing required architecture x86_64 in file
1326/usr/bin/gnumake -C postmaster all
1327/usr/bin/gcc-4.2 -no-cpp-precomp -O2 -arch ppc -arch i386 -Wall -Wmissing-prototypes -Wpointer-arith -Winline -Wdeclaration-after-statement -Wendif-labels -fno-strict-aliasing -fwrapv -I../../../src/include -I/opt/local/include  -I/opt/local/include  -c -o bgwriter.o bgwriter.c
1328/usr/bin/gcc-4.2 -no-cpp-precomp -O2 -arch ppc -arch i386 -Wall -Wmissing-prototypes -Wpointer-arith -Winline -Wdeclaration-after-statement -Wendif-labels -fno-strict-aliasing -fwrapv -I../../../src/include -I/opt/local/include  -I/opt/local/include  -c -o autovacuum.o autovacuum.c
1329/usr/bin/gcc-4.2 -no-cpp-precomp -O2 -arch ppc -arch i386 -Wall -Wmissing-prototypes -Wpointer-arith -Winline -Wdeclaration-after-statement -Wendif-labels -fno-strict-aliasing -fwrapv -I../../../src/include -I/opt/local/include  -I/opt/local/include  -c -o pgarch.o pgarch.c
1330/usr/bin/gcc-4.2 -no-cpp-precomp -O2 -arch ppc -arch i386 -Wall -Wmissing-prototypes -Wpointer-arith -Winline -Wdeclaration-after-statement -Wendif-labels -fno-strict-aliasing -fwrapv -I../../../src/include -I/opt/local/include  -I/opt/local/include  -c -o pgstat.o pgstat.c
1331/usr/bin/gcc-4.2 -no-cpp-precomp -O2 -arch ppc -arch i386 -Wall -Wmissing-prototypes -Wpointer-arith -Winline -Wdeclaration-after-statement -Wendif-labels -fno-strict-aliasing -fwrapv -I../../../src/include -I/opt/local/include  -I/opt/local/include  -c -o postmaster.o postmaster.c
1332postmaster.c: In function 'PostmasterMain':
1333postmaster.c:795: warning: 'DNSServiceRegistrationCreate' is deprecated (declared at /usr/include/DNSServiceDiscovery/DNSServiceDiscovery.h:139)
1334postmaster.c: In function 'PostmasterMain':
1335postmaster.c:795: warning: 'DNSServiceRegistrationCreate' is deprecated (declared at /usr/include/DNSServiceDiscovery/DNSServiceDiscovery.h:139)
1336/usr/bin/gcc-4.2 -no-cpp-precomp -O2 -arch ppc -arch i386 -Wall -Wmissing-prototypes -Wpointer-arith -Winline -Wdeclaration-after-statement -Wendif-labels -fno-strict-aliasing -fwrapv -I../../../src/include -I/opt/local/include  -I/opt/local/include  -c -o syslogger.o syslogger.c
1337/usr/bin/gcc-4.2 -no-cpp-precomp -O2 -arch ppc -arch i386 -Wall -Wmissing-prototypes -Wpointer-arith -Winline -Wdeclaration-after-statement -Wendif-labels -fno-strict-aliasing -fwrapv -I../../../src/include -I/opt/local/include  -I/opt/local/include  -c -o fork_process.o fork_process.c
1338/usr/libexec/gcc/i686-apple-darwin10/4.2.1/ld -r -o SUBSYS.o bgwriter.o autovacuum.o pgarch.o pgstat.o postmaster.o syslogger.o fork_process.o
1339ld: warning: -arch not specified
1340ld: warning: in bgwriter.o, missing required architecture x86_64 in file
1341ld: warning: in autovacuum.o, missing required architecture x86_64 in file
1342ld: warning: in pgarch.o, missing required architecture x86_64 in file
1343ld: warning: in pgstat.o, missing required architecture x86_64 in file
1344ld: warning: in postmaster.o, missing required architecture x86_64 in file
1345ld: warning: in syslogger.o, missing required architecture x86_64 in file
1346ld: warning: in fork_process.o, missing required architecture x86_64 in file
1347/usr/bin/gnumake -C regex all
1348/usr/bin/gcc-4.2 -no-cpp-precomp -O2 -arch ppc -arch i386 -Wall -Wmissing-prototypes -Wpointer-arith -Winline -Wdeclaration-after-statement -Wendif-labels -fno-strict-aliasing -fwrapv -I../../../src/include -I/opt/local/include  -I/opt/local/include  -c -o regcomp.o regcomp.c
1349/usr/bin/gcc-4.2 -no-cpp-precomp -O2 -arch ppc -arch i386 -Wall -Wmissing-prototypes -Wpointer-arith -Winline -Wdeclaration-after-statement -Wendif-labels -fno-strict-aliasing -fwrapv -I../../../src/include -I/opt/local/include  -I/opt/local/include  -c -o regerror.o regerror.c
1350/usr/bin/gcc-4.2 -no-cpp-precomp -O2 -arch ppc -arch i386 -Wall -Wmissing-prototypes -Wpointer-arith -Winline -Wdeclaration-after-statement -Wendif-labels -fno-strict-aliasing -fwrapv -I../../../src/include -I/opt/local/include  -I/opt/local/include  -c -o regexec.o regexec.c
1351/usr/bin/gcc-4.2 -no-cpp-precomp -O2 -arch ppc -arch i386 -Wall -Wmissing-prototypes -Wpointer-arith -Winline -Wdeclaration-after-statement -Wendif-labels -fno-strict-aliasing -fwrapv -I../../../src/include -I/opt/local/include  -I/opt/local/include  -c -o regfree.o regfree.c
1352/usr/libexec/gcc/i686-apple-darwin10/4.2.1/ld -r -o SUBSYS.o regcomp.o regerror.o regexec.o regfree.o
1353ld: warning: -arch not specified
1354ld: warning: in regcomp.o, missing required architecture x86_64 in file
1355ld: warning: in regerror.o, missing required architecture x86_64 in file
1356ld: warning: in regexec.o, missing required architecture x86_64 in file
1357ld: warning: in regfree.o, missing required architecture x86_64 in file
1358/usr/bin/gnumake -C rewrite all
1359/usr/bin/gcc-4.2 -no-cpp-precomp -O2 -arch ppc -arch i386 -Wall -Wmissing-prototypes -Wpointer-arith -Winline -Wdeclaration-after-statement -Wendif-labels -fno-strict-aliasing -fwrapv -I../../../src/include -I/opt/local/include  -I/opt/local/include  -c -o rewriteRemove.o rewriteRemove.c
1360/usr/bin/gcc-4.2 -no-cpp-precomp -O2 -arch ppc -arch i386 -Wall -Wmissing-prototypes -Wpointer-arith -Winline -Wdeclaration-after-statement -Wendif-labels -fno-strict-aliasing -fwrapv -I../../../src/include -I/opt/local/include  -I/opt/local/include  -c -o rewriteDefine.o rewriteDefine.c
1361/usr/bin/gcc-4.2 -no-cpp-precomp -O2 -arch ppc -arch i386 -Wall -Wmissing-prototypes -Wpointer-arith -Winline -Wdeclaration-after-statement -Wendif-labels -fno-strict-aliasing -fwrapv -I../../../src/include -I/opt/local/include  -I/opt/local/include  -c -o rewriteHandler.o rewriteHandler.c
1362/usr/bin/gcc-4.2 -no-cpp-precomp -O2 -arch ppc -arch i386 -Wall -Wmissing-prototypes -Wpointer-arith -Winline -Wdeclaration-after-statement -Wendif-labels -fno-strict-aliasing -fwrapv -I../../../src/include -I/opt/local/include  -I/opt/local/include  -c -o rewriteManip.o rewriteManip.c
1363/usr/bin/gcc-4.2 -no-cpp-precomp -O2 -arch ppc -arch i386 -Wall -Wmissing-prototypes -Wpointer-arith -Winline -Wdeclaration-after-statement -Wendif-labels -fno-strict-aliasing -fwrapv -I../../../src/include -I/opt/local/include  -I/opt/local/include  -c -o rewriteSupport.o rewriteSupport.c
1364/usr/libexec/gcc/i686-apple-darwin10/4.2.1/ld -r -o SUBSYS.o rewriteRemove.o rewriteDefine.o rewriteHandler.o rewriteManip.o rewriteSupport.o
1365ld: warning: -arch not specified
1366ld: warning: in rewriteRemove.o, missing required architecture x86_64 in file
1367ld: warning: in rewriteDefine.o, missing required architecture x86_64 in file
1368ld: warning: in rewriteHandler.o, missing required architecture x86_64 in file
1369ld: warning: in rewriteManip.o, missing required architecture x86_64 in file
1370ld: warning: in rewriteSupport.o, missing required architecture x86_64 in file
1371/usr/bin/gnumake -C storage all
1372/usr/bin/gnumake -C buffer SUBSYS.o
1373/usr/bin/gcc-4.2 -no-cpp-precomp -O2 -arch ppc -arch i386 -Wall -Wmissing-prototypes -Wpointer-arith -Winline -Wdeclaration-after-statement -Wendif-labels -fno-strict-aliasing -fwrapv -I../../../../src/include -I/opt/local/include  -I/opt/local/include  -c -o buf_table.o buf_table.c
1374/usr/bin/gcc-4.2 -no-cpp-precomp -O2 -arch ppc -arch i386 -Wall -Wmissing-prototypes -Wpointer-arith -Winline -Wdeclaration-after-statement -Wendif-labels -fno-strict-aliasing -fwrapv -I../../../../src/include -I/opt/local/include  -I/opt/local/include  -c -o buf_init.o buf_init.c
1375/usr/bin/gcc-4.2 -no-cpp-precomp -O2 -arch ppc -arch i386 -Wall -Wmissing-prototypes -Wpointer-arith -Winline -Wdeclaration-after-statement -Wendif-labels -fno-strict-aliasing -fwrapv -I../../../../src/include -I/opt/local/include  -I/opt/local/include  -c -o bufmgr.o bufmgr.c
1376/usr/bin/gcc-4.2 -no-cpp-precomp -O2 -arch ppc -arch i386 -Wall -Wmissing-prototypes -Wpointer-arith -Winline -Wdeclaration-after-statement -Wendif-labels -fno-strict-aliasing -fwrapv -I../../../../src/include -I/opt/local/include  -I/opt/local/include  -c -o freelist.o freelist.c
1377/usr/bin/gcc-4.2 -no-cpp-precomp -O2 -arch ppc -arch i386 -Wall -Wmissing-prototypes -Wpointer-arith -Winline -Wdeclaration-after-statement -Wendif-labels -fno-strict-aliasing -fwrapv -I../../../../src/include -I/opt/local/include  -I/opt/local/include  -c -o localbuf.o localbuf.c
1378/usr/libexec/gcc/i686-apple-darwin10/4.2.1/ld -r -o SUBSYS.o buf_table.o buf_init.o bufmgr.o freelist.o localbuf.o
1379ld: warning: -arch not specified
1380ld: warning: in buf_table.o, missing required architecture x86_64 in file
1381ld: warning: in buf_init.o, missing required architecture x86_64 in file
1382ld: warning: in bufmgr.o, missing required architecture x86_64 in file
1383ld: warning: in freelist.o, missing required architecture x86_64 in file
1384ld: warning: in localbuf.o, missing required architecture x86_64 in file
1385/usr/bin/gnumake -C file SUBSYS.o
1386/usr/bin/gcc-4.2 -no-cpp-precomp -O2 -arch ppc -arch i386 -Wall -Wmissing-prototypes -Wpointer-arith -Winline -Wdeclaration-after-statement -Wendif-labels -fno-strict-aliasing -fwrapv -I../../../../src/include -I/opt/local/include  -I/opt/local/include  -c -o fd.o fd.c
1387/usr/bin/gcc-4.2 -no-cpp-precomp -O2 -arch ppc -arch i386 -Wall -Wmissing-prototypes -Wpointer-arith -Winline -Wdeclaration-after-statement -Wendif-labels -fno-strict-aliasing -fwrapv -I../../../../src/include -I/opt/local/include  -I/opt/local/include  -c -o buffile.o buffile.c
1388/usr/libexec/gcc/i686-apple-darwin10/4.2.1/ld -r -o SUBSYS.o fd.o buffile.o
1389ld: warning: -arch not specified
1390ld: warning: in fd.o, missing required architecture x86_64 in file
1391ld: warning: in buffile.o, missing required architecture x86_64 in file
1392/usr/bin/gnumake -C freespace SUBSYS.o
1393/usr/bin/gcc-4.2 -no-cpp-precomp -O2 -arch ppc -arch i386 -Wall -Wmissing-prototypes -Wpointer-arith -Winline -Wdeclaration-after-statement -Wendif-labels -fno-strict-aliasing -fwrapv -I../../../../src/include -I/opt/local/include  -I/opt/local/include  -c -o freespace.o freespace.c
1394/usr/libexec/gcc/i686-apple-darwin10/4.2.1/ld -r -o SUBSYS.o freespace.o
1395ld: warning: -arch not specified
1396ld: warning: in freespace.o, missing required architecture x86_64 in file
1397/usr/bin/gnumake -C ipc SUBSYS.o
1398/usr/bin/gcc-4.2 -no-cpp-precomp -O2 -arch ppc -arch i386 -Wall -Wmissing-prototypes -Wpointer-arith -Winline -Wdeclaration-after-statement -Wendif-labels -fno-strict-aliasing -fwrapv -I../../../../src/include -I/opt/local/include  -I/opt/local/include  -c -o ipc.o ipc.c
1399/usr/bin/gcc-4.2 -no-cpp-precomp -O2 -arch ppc -arch i386 -Wall -Wmissing-prototypes -Wpointer-arith -Winline -Wdeclaration-after-statement -Wendif-labels -fno-strict-aliasing -fwrapv -I../../../../src/include -I/opt/local/include  -I/opt/local/include  -c -o ipci.o ipci.c
1400/usr/bin/gcc-4.2 -no-cpp-precomp -O2 -arch ppc -arch i386 -Wall -Wmissing-prototypes -Wpointer-arith -Winline -Wdeclaration-after-statement -Wendif-labels -fno-strict-aliasing -fwrapv -I../../../../src/include -I/opt/local/include  -I/opt/local/include  -c -o pmsignal.o pmsignal.c
1401/usr/bin/gcc-4.2 -no-cpp-precomp -O2 -arch ppc -arch i386 -Wall -Wmissing-prototypes -Wpointer-arith -Winline -Wdeclaration-after-statement -Wendif-labels -fno-strict-aliasing -fwrapv -I../../../../src/include -I/opt/local/include  -I/opt/local/include  -c -o procarray.o procarray.c
1402/usr/bin/gcc-4.2 -no-cpp-precomp -O2 -arch ppc -arch i386 -Wall -Wmissing-prototypes -Wpointer-arith -Winline -Wdeclaration-after-statement -Wendif-labels -fno-strict-aliasing -fwrapv -I../../../../src/include -I/opt/local/include  -I/opt/local/include  -c -o shmem.o shmem.c
1403/usr/bin/gcc-4.2 -no-cpp-precomp -O2 -arch ppc -arch i386 -Wall -Wmissing-prototypes -Wpointer-arith -Winline -Wdeclaration-after-statement -Wendif-labels -fno-strict-aliasing -fwrapv -I../../../../src/include -I/opt/local/include  -I/opt/local/include  -c -o shmqueue.o shmqueue.c
1404/usr/bin/gcc-4.2 -no-cpp-precomp -O2 -arch ppc -arch i386 -Wall -Wmissing-prototypes -Wpointer-arith -Winline -Wdeclaration-after-statement -Wendif-labels -fno-strict-aliasing -fwrapv -I../../../../src/include -I/opt/local/include  -I/opt/local/include  -c -o sinval.o sinval.c
1405/usr/bin/gcc-4.2 -no-cpp-precomp -O2 -arch ppc -arch i386 -Wall -Wmissing-prototypes -Wpointer-arith -Winline -Wdeclaration-after-statement -Wendif-labels -fno-strict-aliasing -fwrapv -I../../../../src/include -I/opt/local/include  -I/opt/local/include  -c -o sinvaladt.o sinvaladt.c
1406/usr/libexec/gcc/i686-apple-darwin10/4.2.1/ld -r -o SUBSYS.o ipc.o ipci.o pmsignal.o procarray.o shmem.o shmqueue.o sinval.o sinvaladt.o
1407ld: warning: -arch not specified
1408ld: warning: in ipc.o, missing required architecture x86_64 in file
1409ld: warning: in ipci.o, missing required architecture x86_64 in file
1410ld: warning: in pmsignal.o, missing required architecture x86_64 in file
1411ld: warning: in procarray.o, missing required architecture x86_64 in file
1412ld: warning: in shmem.o, missing required architecture x86_64 in file
1413ld: warning: in shmqueue.o, missing required architecture x86_64 in file
1414ld: warning: in sinval.o, missing required architecture x86_64 in file
1415ld: warning: in sinvaladt.o, missing required architecture x86_64 in file
1416/usr/bin/gnumake -C large_object SUBSYS.o
1417/usr/bin/gcc-4.2 -no-cpp-precomp -O2 -arch ppc -arch i386 -Wall -Wmissing-prototypes -Wpointer-arith -Winline -Wdeclaration-after-statement -Wendif-labels -fno-strict-aliasing -fwrapv -I../../../../src/include -I/opt/local/include  -I/opt/local/include  -c -o inv_api.o inv_api.c
1418/usr/libexec/gcc/i686-apple-darwin10/4.2.1/ld -r -o SUBSYS.o inv_api.o
1419ld: warning: -arch not specified
1420ld: warning: in inv_api.o, missing required architecture x86_64 in file
1421/usr/bin/gnumake -C lmgr SUBSYS.o
1422/usr/bin/gcc-4.2 -no-cpp-precomp -O2 -arch ppc -arch i386 -Wall -Wmissing-prototypes -Wpointer-arith -Winline -Wdeclaration-after-statement -Wendif-labels -fno-strict-aliasing -fwrapv -I../../../../src/include -I/opt/local/include  -I/opt/local/include  -c -o lmgr.o lmgr.c
1423/usr/bin/gcc-4.2 -no-cpp-precomp -O2 -arch ppc -arch i386 -Wall -Wmissing-prototypes -Wpointer-arith -Winline -Wdeclaration-after-statement -Wendif-labels -fno-strict-aliasing -fwrapv -I../../../../src/include -I/opt/local/include  -I/opt/local/include  -c -o lock.o lock.c
1424/usr/bin/gcc-4.2 -no-cpp-precomp -O2 -arch ppc -arch i386 -Wall -Wmissing-prototypes -Wpointer-arith -Winline -Wdeclaration-after-statement -Wendif-labels -fno-strict-aliasing -fwrapv -I../../../../src/include -I/opt/local/include  -I/opt/local/include  -c -o proc.o proc.c
1425/usr/bin/gcc-4.2 -no-cpp-precomp -O2 -arch ppc -arch i386 -Wall -Wmissing-prototypes -Wpointer-arith -Winline -Wdeclaration-after-statement -Wendif-labels -fno-strict-aliasing -fwrapv -I../../../../src/include -I/opt/local/include  -I/opt/local/include  -c -o deadlock.o deadlock.c
1426/usr/bin/gcc-4.2 -no-cpp-precomp -O2 -arch ppc -arch i386 -Wall -Wmissing-prototypes -Wpointer-arith -Winline -Wdeclaration-after-statement -Wendif-labels -fno-strict-aliasing -fwrapv -I../../../../src/include -I/opt/local/include  -I/opt/local/include  -c -o lwlock.o lwlock.c
1427/usr/bin/gcc-4.2 -no-cpp-precomp -O2 -arch ppc -arch i386 -Wall -Wmissing-prototypes -Wpointer-arith -Winline -Wdeclaration-after-statement -Wendif-labels -fno-strict-aliasing -fwrapv -I../../../../src/include -I/opt/local/include  -I/opt/local/include  -c -o spin.o spin.c
1428/usr/bin/gcc-4.2 -no-cpp-precomp -O2 -arch ppc -arch i386 -Wall -Wmissing-prototypes -Wpointer-arith -Winline -Wdeclaration-after-statement -Wendif-labels -fno-strict-aliasing -fwrapv -I../../../../src/include -I/opt/local/include  -I/opt/local/include  -c -o s_lock.o s_lock.c
1429/usr/libexec/gcc/i686-apple-darwin10/4.2.1/ld -r -o SUBSYS.o lmgr.o lock.o proc.o deadlock.o lwlock.o spin.o s_lock.o
1430ld: warning: -arch not specified
1431ld: warning: in lmgr.o, missing required architecture x86_64 in file
1432ld: warning: in lock.o, missing required architecture x86_64 in file
1433ld: warning: in proc.o, missing required architecture x86_64 in file
1434ld: warning: in deadlock.o, missing required architecture x86_64 in file
1435ld: warning: in lwlock.o, missing required architecture x86_64 in file
1436ld: warning: in spin.o, missing required architecture x86_64 in file
1437ld: warning: in s_lock.o, missing required architecture x86_64 in file
1438/usr/bin/gnumake -C page SUBSYS.o
1439/usr/bin/gcc-4.2 -no-cpp-precomp -O2 -arch ppc -arch i386 -Wall -Wmissing-prototypes -Wpointer-arith -Winline -Wdeclaration-after-statement -Wendif-labels -fno-strict-aliasing -fwrapv -I../../../../src/include -I/opt/local/include  -I/opt/local/include  -c -o bufpage.o bufpage.c
1440/usr/bin/gcc-4.2 -no-cpp-precomp -O2 -arch ppc -arch i386 -Wall -Wmissing-prototypes -Wpointer-arith -Winline -Wdeclaration-after-statement -Wendif-labels -fno-strict-aliasing -fwrapv -I../../../../src/include -I/opt/local/include  -I/opt/local/include  -c -o itemptr.o itemptr.c
1441/usr/libexec/gcc/i686-apple-darwin10/4.2.1/ld -r -o SUBSYS.o bufpage.o itemptr.o
1442ld: warning: -arch not specified
1443ld: warning: in bufpage.o, missing required architecture x86_64 in file
1444ld: warning: in itemptr.o, missing required architecture x86_64 in file
1445/usr/bin/gnumake -C smgr SUBSYS.o
1446/usr/bin/gcc-4.2 -no-cpp-precomp -O2 -arch ppc -arch i386 -Wall -Wmissing-prototypes -Wpointer-arith -Winline -Wdeclaration-after-statement -Wendif-labels -fno-strict-aliasing -fwrapv -I../../../../src/include -I/opt/local/include  -I/opt/local/include  -c -o md.o md.c
1447/usr/bin/gcc-4.2 -no-cpp-precomp -O2 -arch ppc -arch i386 -Wall -Wmissing-prototypes -Wpointer-arith -Winline -Wdeclaration-after-statement -Wendif-labels -fno-strict-aliasing -fwrapv -I../../../../src/include -I/opt/local/include  -I/opt/local/include  -c -o smgr.o smgr.c
1448/usr/bin/gcc-4.2 -no-cpp-precomp -O2 -arch ppc -arch i386 -Wall -Wmissing-prototypes -Wpointer-arith -Winline -Wdeclaration-after-statement -Wendif-labels -fno-strict-aliasing -fwrapv -I../../../../src/include -I/opt/local/include  -I/opt/local/include  -c -o smgrtype.o smgrtype.c
1449/usr/libexec/gcc/i686-apple-darwin10/4.2.1/ld -r -o SUBSYS.o md.o smgr.o smgrtype.o
1450ld: warning: -arch not specified
1451ld: warning: in md.o, missing required architecture x86_64 in file
1452ld: warning: in smgr.o, missing required architecture x86_64 in file
1453ld: warning: in smgrtype.o, missing required architecture x86_64 in file
1454/usr/libexec/gcc/i686-apple-darwin10/4.2.1/ld -r -o SUBSYS.o buffer/SUBSYS.o file/SUBSYS.o freespace/SUBSYS.o ipc/SUBSYS.o large_object/SUBSYS.o lmgr/SUBSYS.o page/SUBSYS.o smgr/SUBSYS.o
1455/usr/bin/gnumake -C tcop all
1456/usr/bin/gcc-4.2 -no-cpp-precomp -O2 -arch ppc -arch i386 -Wall -Wmissing-prototypes -Wpointer-arith -Winline -Wdeclaration-after-statement -Wendif-labels -fno-strict-aliasing -fwrapv -I../../../src/include -I/opt/local/include  -I/opt/local/include -DWIN32_STACK_RLIMIT=4194304  -c -o dest.o dest.c
1457/usr/bin/gcc-4.2 -no-cpp-precomp -O2 -arch ppc -arch i386 -Wall -Wmissing-prototypes -Wpointer-arith -Winline -Wdeclaration-after-statement -Wendif-labels -fno-strict-aliasing -fwrapv -I../../../src/include -I/opt/local/include  -I/opt/local/include -DWIN32_STACK_RLIMIT=4194304  -c -o fastpath.o fastpath.c
1458/usr/bin/gcc-4.2 -no-cpp-precomp -O2 -arch ppc -arch i386 -Wall -Wmissing-prototypes -Wpointer-arith -Winline -Wdeclaration-after-statement -Wendif-labels -fno-strict-aliasing -fwrapv -I../../../src/include -I/opt/local/include  -I/opt/local/include -DWIN32_STACK_RLIMIT=4194304  -c -o postgres.o postgres.c
1459/usr/bin/gcc-4.2 -no-cpp-precomp -O2 -arch ppc -arch i386 -Wall -Wmissing-prototypes -Wpointer-arith -Winline -Wdeclaration-after-statement -Wendif-labels -fno-strict-aliasing -fwrapv -I../../../src/include -I/opt/local/include  -I/opt/local/include -DWIN32_STACK_RLIMIT=4194304  -c -o pquery.o pquery.c
1460/usr/bin/gcc-4.2 -no-cpp-precomp -O2 -arch ppc -arch i386 -Wall -Wmissing-prototypes -Wpointer-arith -Winline -Wdeclaration-after-statement -Wendif-labels -fno-strict-aliasing -fwrapv -I../../../src/include -I/opt/local/include  -I/opt/local/include -DWIN32_STACK_RLIMIT=4194304  -c -o utility.o utility.c
1461utility.c: In function 'DropErrorMsgWrongType':
1462utility.c:127: warning: format not a string literal and no format arguments
1463utility.c: In function 'DropErrorMsgWrongType':
1464utility.c:127: warning: format not a string literal and no format arguments
1465/usr/libexec/gcc/i686-apple-darwin10/4.2.1/ld -r -o SUBSYS.o dest.o fastpath.o postgres.o pquery.o utility.o
1466ld: warning: -arch not specified
1467ld: warning: in dest.o, missing required architecture x86_64 in file
1468ld: warning: in fastpath.o, missing required architecture x86_64 in file
1469ld: warning: in postgres.o, missing required architecture x86_64 in file
1470ld: warning: in pquery.o, missing required architecture x86_64 in file
1471ld: warning: in utility.o, missing required architecture x86_64 in file
1472/usr/bin/gnumake -C utils all
1473/usr/bin/gcc-4.2 -no-cpp-precomp -O2 -arch ppc -arch i386 -Wall -Wmissing-prototypes -Wpointer-arith -Winline -Wdeclaration-after-statement -Wendif-labels -fno-strict-aliasing -fwrapv -I../../../src/include -I/opt/local/include  -I/opt/local/include  -c -o fmgrtab.o fmgrtab.c
1474/usr/bin/gnumake -C adt SUBSYS.o
1475/usr/bin/gcc-4.2 -no-cpp-precomp -O2 -arch ppc -arch i386 -Wall -Wmissing-prototypes -Wpointer-arith -Winline -Wdeclaration-after-statement -Wendif-labels -fno-strict-aliasing -fwrapv -I../../../../src/include -I/opt/local/include  -I/opt/local/include  -c -o acl.o acl.c
1476/usr/bin/gcc-4.2 -no-cpp-precomp -O2 -arch ppc -arch i386 -Wall -Wmissing-prototypes -Wpointer-arith -Winline -Wdeclaration-after-statement -Wendif-labels -fno-strict-aliasing -fwrapv -I../../../../src/include -I/opt/local/include  -I/opt/local/include  -c -o arrayfuncs.o arrayfuncs.c
1477/usr/bin/gcc-4.2 -no-cpp-precomp -O2 -arch ppc -arch i386 -Wall -Wmissing-prototypes -Wpointer-arith -Winline -Wdeclaration-after-statement -Wendif-labels -fno-strict-aliasing -fwrapv -I../../../../src/include -I/opt/local/include  -I/opt/local/include  -c -o array_userfuncs.o array_userfuncs.c
1478/usr/bin/gcc-4.2 -no-cpp-precomp -O2 -arch ppc -arch i386 -Wall -Wmissing-prototypes -Wpointer-arith -Winline -Wdeclaration-after-statement -Wendif-labels -fno-strict-aliasing -fwrapv -I../../../../src/include -I/opt/local/include  -I/opt/local/include  -c -o arrayutils.o arrayutils.c
1479/usr/bin/gcc-4.2 -no-cpp-precomp -O2 -arch ppc -arch i386 -Wall -Wmissing-prototypes -Wpointer-arith -Winline -Wdeclaration-after-statement -Wendif-labels -fno-strict-aliasing -fwrapv -I../../../../src/include -I/opt/local/include  -I/opt/local/include  -c -o bool.o bool.c
1480/usr/bin/gcc-4.2 -no-cpp-precomp -O2 -arch ppc -arch i386 -Wall -Wmissing-prototypes -Wpointer-arith -Winline -Wdeclaration-after-statement -Wendif-labels -fno-strict-aliasing -fwrapv -I../../../../src/include -I/opt/local/include  -I/opt/local/include  -c -o cash.o cash.c
1481/usr/bin/gcc-4.2 -no-cpp-precomp -O2 -arch ppc -arch i386 -Wall -Wmissing-prototypes -Wpointer-arith -Winline -Wdeclaration-after-statement -Wendif-labels -fno-strict-aliasing -fwrapv -I../../../../src/include -I/opt/local/include  -I/opt/local/include  -c -o char.o char.c
1482/usr/bin/gcc-4.2 -no-cpp-precomp -O2 -arch ppc -arch i386 -Wall -Wmissing-prototypes -Wpointer-arith -Winline -Wdeclaration-after-statement -Wendif-labels -fno-strict-aliasing -fwrapv -I../../../../src/include -I/opt/local/include  -I/opt/local/include  -c -o date.o date.c
1483/usr/bin/gcc-4.2 -no-cpp-precomp -O2 -arch ppc -arch i386 -Wall -Wmissing-prototypes -Wpointer-arith -Winline -Wdeclaration-after-statement -Wendif-labels -fno-strict-aliasing -fwrapv -I../../../../src/include -I/opt/local/include  -I/opt/local/include  -c -o datetime.o datetime.c
1484/usr/bin/gcc-4.2 -no-cpp-precomp -O2 -arch ppc -arch i386 -Wall -Wmissing-prototypes -Wpointer-arith -Winline -Wdeclaration-after-statement -Wendif-labels -fno-strict-aliasing -fwrapv -I../../../../src/include -I/opt/local/include  -I/opt/local/include  -c -o datum.o datum.c
1485/usr/bin/gcc-4.2 -no-cpp-precomp -O2 -arch ppc -arch i386 -Wall -Wmissing-prototypes -Wpointer-arith -Winline -Wdeclaration-after-statement -Wendif-labels -fno-strict-aliasing -fwrapv -I../../../../src/include -I/opt/local/include  -I/opt/local/include  -c -o domains.o domains.c
1486/usr/bin/gcc-4.2 -no-cpp-precomp -O2 -arch ppc -arch i386 -Wall -Wmissing-prototypes -Wpointer-arith -Winline -Wdeclaration-after-statement -Wendif-labels -fno-strict-aliasing -fwrapv -I../../../../src/include -I/opt/local/include  -I/opt/local/include  -c -o float.o float.c
1487/usr/bin/gcc-4.2 -no-cpp-precomp -O2 -arch ppc -arch i386 -Wall -Wmissing-prototypes -Wpointer-arith -Winline -Wdeclaration-after-statement -Wendif-labels -fno-strict-aliasing -fwrapv -I../../../../src/include -I/opt/local/include  -I/opt/local/include  -c -o format_type.o format_type.c
1488/usr/bin/gcc-4.2 -no-cpp-precomp -O2 -arch ppc -arch i386 -Wall -Wmissing-prototypes -Wpointer-arith -Winline -Wdeclaration-after-statement -Wendif-labels -fno-strict-aliasing -fwrapv -I../../../../src/include -I/opt/local/include  -I/opt/local/include  -c -o geo_ops.o geo_ops.c
1489/usr/bin/gcc-4.2 -no-cpp-precomp -O2 -arch ppc -arch i386 -Wall -Wmissing-prototypes -Wpointer-arith -Winline -Wdeclaration-after-statement -Wendif-labels -fno-strict-aliasing -fwrapv -I../../../../src/include -I/opt/local/include  -I/opt/local/include  -c -o geo_selfuncs.o geo_selfuncs.c
1490/usr/bin/gcc-4.2 -no-cpp-precomp -O2 -arch ppc -arch i386 -Wall -Wmissing-prototypes -Wpointer-arith -Winline -Wdeclaration-after-statement -Wendif-labels -fno-strict-aliasing -fwrapv -I../../../../src/include -I/opt/local/include  -I/opt/local/include  -c -o int.o int.c
1491/usr/bin/gcc-4.2 -no-cpp-precomp -O2 -arch ppc -arch i386 -Wall -Wmissing-prototypes -Wpointer-arith -Winline -Wdeclaration-after-statement -Wendif-labels -fno-strict-aliasing -fwrapv -I../../../../src/include -I/opt/local/include  -I/opt/local/include  -c -o int8.o int8.c
1492/usr/bin/gcc-4.2 -no-cpp-precomp -O2 -arch ppc -arch i386 -Wall -Wmissing-prototypes -Wpointer-arith -Winline -Wdeclaration-after-statement -Wendif-labels -fno-strict-aliasing -fwrapv -I../../../../src/include -I/opt/local/include  -I/opt/local/include  -c -o like.o like.c
1493/usr/bin/gcc-4.2 -no-cpp-precomp -O2 -arch ppc -arch i386 -Wall -Wmissing-prototypes -Wpointer-arith -Winline -Wdeclaration-after-statement -Wendif-labels -fno-strict-aliasing -fwrapv -I../../../../src/include -I/opt/local/include  -I/opt/local/include  -c -o lockfuncs.o lockfuncs.c
1494/usr/bin/gcc-4.2 -no-cpp-precomp -O2 -arch ppc -arch i386 -Wall -Wmissing-prototypes -Wpointer-arith -Winline -Wdeclaration-after-statement -Wendif-labels -fno-strict-aliasing -fwrapv -I../../../../src/include -I/opt/local/include  -I/opt/local/include  -c -o misc.o misc.c
1495/usr/bin/gcc-4.2 -no-cpp-precomp -O2 -arch ppc -arch i386 -Wall -Wmissing-prototypes -Wpointer-arith -Winline -Wdeclaration-after-statement -Wendif-labels -fno-strict-aliasing -fwrapv -I../../../../src/include -I/opt/local/include  -I/opt/local/include  -c -o nabstime.o nabstime.c
1496/usr/bin/gcc-4.2 -no-cpp-precomp -O2 -arch ppc -arch i386 -Wall -Wmissing-prototypes -Wpointer-arith -Winline -Wdeclaration-after-statement -Wendif-labels -fno-strict-aliasing -fwrapv -I../../../../src/include -I/opt/local/include  -I/opt/local/include  -c -o name.o name.c
1497/usr/bin/gcc-4.2 -no-cpp-precomp -O2 -arch ppc -arch i386 -Wall -Wmissing-prototypes -Wpointer-arith -Winline -Wdeclaration-after-statement -Wendif-labels -fno-strict-aliasing -fwrapv -I../../../../src/include -I/opt/local/include  -I/opt/local/include  -c -o not_in.o not_in.c
1498/usr/bin/gcc-4.2 -no-cpp-precomp -O2 -arch ppc -arch i386 -Wall -Wmissing-prototypes -Wpointer-arith -Winline -Wdeclaration-after-statement -Wendif-labels -fno-strict-aliasing -fwrapv -I../../../../src/include -I/opt/local/include  -I/opt/local/include  -c -o numeric.o numeric.c
1499/usr/bin/gcc-4.2 -no-cpp-precomp -O2 -arch ppc -arch i386 -Wall -Wmissing-prototypes -Wpointer-arith -Winline -Wdeclaration-after-statement -Wendif-labels -fno-strict-aliasing -fwrapv -I../../../../src/include -I/opt/local/include  -I/opt/local/include  -c -o numutils.o numutils.c
1500/usr/bin/gcc-4.2 -no-cpp-precomp -O2 -arch ppc -arch i386 -Wall -Wmissing-prototypes -Wpointer-arith -Winline -Wdeclaration-after-statement -Wendif-labels -fno-strict-aliasing -fwrapv -I../../../../src/include -I/opt/local/include  -I/opt/local/include  -c -o oid.o oid.c
1501/usr/bin/gcc-4.2 -no-cpp-precomp -O2 -arch ppc -arch i386 -Wall -Wmissing-prototypes -Wpointer-arith -Winline -Wdeclaration-after-statement -Wendif-labels -fno-strict-aliasing -fwrapv -I../../../../src/include -I/opt/local/include  -I/opt/local/include  -c -o oracle_compat.o oracle_compat.c
1502/usr/bin/gcc-4.2 -no-cpp-precomp -O2 -arch ppc -arch i386 -Wall -Wmissing-prototypes -Wpointer-arith -Winline -Wdeclaration-after-statement -Wendif-labels -fno-strict-aliasing -fwrapv -I../../../../src/include -I/opt/local/include  -I/opt/local/include  -c -o pseudotypes.o pseudotypes.c
1503/usr/bin/gcc-4.2 -no-cpp-precomp -O2 -arch ppc -arch i386 -Wall -Wmissing-prototypes -Wpointer-arith -Winline -Wdeclaration-after-statement -Wendif-labels -fno-strict-aliasing -fwrapv -I../../../../src/include -I/opt/local/include  -I/opt/local/include  -c -o rowtypes.o rowtypes.c
1504/usr/bin/gcc-4.2 -no-cpp-precomp -O2 -arch ppc -arch i386 -Wall -Wmissing-prototypes -Wpointer-arith -Winline -Wdeclaration-after-statement -Wendif-labels -fno-strict-aliasing -fwrapv -I../../../../src/include -I/opt/local/include  -I/opt/local/include  -c -o regexp.o regexp.c
1505/usr/bin/gcc-4.2 -no-cpp-precomp -O2 -arch ppc -arch i386 -Wall -Wmissing-prototypes -Wpointer-arith -Winline -Wdeclaration-after-statement -Wendif-labels -fno-strict-aliasing -fwrapv -I../../../../src/include -I/opt/local/include  -I/opt/local/include  -c -o regproc.o regproc.c
1506/usr/bin/gcc-4.2 -no-cpp-precomp -O2 -arch ppc -arch i386 -Wall -Wmissing-prototypes -Wpointer-arith -Winline -Wdeclaration-after-statement -Wendif-labels -fno-strict-aliasing -fwrapv -I../../../../src/include -I/opt/local/include  -I/opt/local/include  -c -o ruleutils.o ruleutils.c
1507/usr/bin/gcc-4.2 -no-cpp-precomp -O2 -arch ppc -arch i386 -Wall -Wmissing-prototypes -Wpointer-arith -Winline -Wdeclaration-after-statement -Wendif-labels -fno-strict-aliasing -fwrapv -I../../../../src/include -I/opt/local/include  -I/opt/local/include  -c -o selfuncs.o selfuncs.c
1508/usr/bin/gcc-4.2 -no-cpp-precomp -O2 -arch ppc -arch i386 -Wall -Wmissing-prototypes -Wpointer-arith -Winline -Wdeclaration-after-statement -Wendif-labels -fno-strict-aliasing -fwrapv -I../../../../src/include -I/opt/local/include  -I/opt/local/include  -c -o tid.o tid.c
1509/usr/bin/gcc-4.2 -no-cpp-precomp -O2 -arch ppc -arch i386 -Wall -Wmissing-prototypes -Wpointer-arith -Winline -Wdeclaration-after-statement -Wendif-labels -fno-strict-aliasing -fwrapv -I../../../../src/include -I/opt/local/include  -I/opt/local/include  -c -o timestamp.o timestamp.c
1510/usr/bin/gcc-4.2 -no-cpp-precomp -O2 -arch ppc -arch i386 -Wall -Wmissing-prototypes -Wpointer-arith -Winline -Wdeclaration-after-statement -Wendif-labels -fno-strict-aliasing -fwrapv -I../../../../src/include -I/opt/local/include  -I/opt/local/include  -c -o varbit.o varbit.c
1511/usr/bin/gcc-4.2 -no-cpp-precomp -O2 -arch ppc -arch i386 -Wall -Wmissing-prototypes -Wpointer-arith -Winline -Wdeclaration-after-statement -Wendif-labels -fno-strict-aliasing -fwrapv -I../../../../src/include -I/opt/local/include  -I/opt/local/include  -c -o varchar.o varchar.c
1512/usr/bin/gcc-4.2 -no-cpp-precomp -O2 -arch ppc -arch i386 -Wall -Wmissing-prototypes -Wpointer-arith -Winline -Wdeclaration-after-statement -Wendif-labels -fno-strict-aliasing -fwrapv -I../../../../src/include -I/opt/local/include  -I/opt/local/include  -c -o varlena.o varlena.c
1513/usr/bin/gcc-4.2 -no-cpp-precomp -O2 -arch ppc -arch i386 -Wall -Wmissing-prototypes -Wpointer-arith -Winline -Wdeclaration-after-statement -Wendif-labels -fno-strict-aliasing -fwrapv -I../../../../src/include -I/opt/local/include  -I/opt/local/include  -c -o version.o version.c
1514/usr/bin/gcc-4.2 -no-cpp-precomp -O2 -arch ppc -arch i386 -Wall -Wmissing-prototypes -Wpointer-arith -Winline -Wdeclaration-after-statement -Wendif-labels -fno-strict-aliasing -fwrapv -I../../../../src/include -I/opt/local/include  -I/opt/local/include  -c -o xid.o xid.c
1515/usr/bin/gcc-4.2 -no-cpp-precomp -O2 -arch ppc -arch i386 -Wall -Wmissing-prototypes -Wpointer-arith -Winline -Wdeclaration-after-statement -Wendif-labels -fno-strict-aliasing -fwrapv -I../../../../src/include -I/opt/local/include  -I/opt/local/include  -c -o network.o network.c
1516/usr/bin/gcc-4.2 -no-cpp-precomp -O2 -arch ppc -arch i386 -Wall -Wmissing-prototypes -Wpointer-arith -Winline -Wdeclaration-after-statement -Wendif-labels -fno-strict-aliasing -fwrapv -I../../../../src/include -I/opt/local/include  -I/opt/local/include  -c -o mac.o mac.c
1517/usr/bin/gcc-4.2 -no-cpp-precomp -O2 -arch ppc -arch i386 -Wall -Wmissing-prototypes -Wpointer-arith -Winline -Wdeclaration-after-statement -Wendif-labels -fno-strict-aliasing -fwrapv -I../../../../src/include -I/opt/local/include  -I/opt/local/include  -c -o inet_net_ntop.o inet_net_ntop.c
1518/usr/bin/gcc-4.2 -no-cpp-precomp -O2 -arch ppc -arch i386 -Wall -Wmissing-prototypes -Wpointer-arith -Winline -Wdeclaration-after-statement -Wendif-labels -fno-strict-aliasing -fwrapv -I../../../../src/include -I/opt/local/include  -I/opt/local/include  -c -o inet_net_pton.o inet_net_pton.c
1519/usr/bin/gcc-4.2 -no-cpp-precomp -O2 -arch ppc -arch i386 -Wall -Wmissing-prototypes -Wpointer-arith -Winline -Wdeclaration-after-statement -Wendif-labels -fno-strict-aliasing -fwrapv -I../../../../src/include -I/opt/local/include  -I/opt/local/include  -c -o ri_triggers.o ri_triggers.c
1520/usr/bin/gcc-4.2 -no-cpp-precomp -O2 -arch ppc -arch i386 -Wall -Wmissing-prototypes -Wpointer-arith -Winline -Wdeclaration-after-statement -Wendif-labels -fno-strict-aliasing -fwrapv -I../../../../src/include -I/opt/local/include  -I/opt/local/include  -c -o pg_lzcompress.o pg_lzcompress.c
1521/usr/bin/gcc-4.2 -no-cpp-precomp -O2 -arch ppc -arch i386 -Wall -Wmissing-prototypes -Wpointer-arith -Winline -Wdeclaration-after-statement -Wendif-labels -fno-strict-aliasing -fwrapv -I../../../../src/include -I/opt/local/include  -I/opt/local/include  -c -o pg_locale.o pg_locale.c
1522/usr/bin/gcc-4.2 -no-cpp-precomp -O2 -arch ppc -arch i386 -Wall -Wmissing-prototypes -Wpointer-arith -Winline -Wdeclaration-after-statement -Wendif-labels -fno-strict-aliasing -fwrapv -I../../../../src/include -I/opt/local/include  -I/opt/local/include  -c -o formatting.o formatting.c
1523/usr/bin/gcc-4.2 -no-cpp-precomp -O2 -arch ppc -arch i386 -Wall -Wmissing-prototypes -Wpointer-arith -Winline -Wdeclaration-after-statement -Wendif-labels -fno-strict-aliasing -fwrapv -I../../../../src/include -I/opt/local/include  -I/opt/local/include  -c -o ascii.o ascii.c
1524/usr/bin/gcc-4.2 -no-cpp-precomp -O2 -arch ppc -arch i386 -Wall -Wmissing-prototypes -Wpointer-arith -Winline -Wdeclaration-after-statement -Wendif-labels -fno-strict-aliasing -fwrapv -I../../../../src/include -I/opt/local/include  -I/opt/local/include  -c -o quote.o quote.c
1525/usr/bin/gcc-4.2 -no-cpp-precomp -O2 -arch ppc -arch i386 -Wall -Wmissing-prototypes -Wpointer-arith -Winline -Wdeclaration-after-statement -Wendif-labels -fno-strict-aliasing -fwrapv -I../../../../src/include -I/opt/local/include  -I/opt/local/include  -c -o pgstatfuncs.o pgstatfuncs.c
1526/usr/bin/gcc-4.2 -no-cpp-precomp -O2 -arch ppc -arch i386 -Wall -Wmissing-prototypes -Wpointer-arith -Winline -Wdeclaration-after-statement -Wendif-labels -fno-strict-aliasing -fwrapv -I../../../../src/include -I/opt/local/include  -I/opt/local/include  -c -o encode.o encode.c
1527/usr/bin/gcc-4.2 -no-cpp-precomp -O2 -arch ppc -arch i386 -Wall -Wmissing-prototypes -Wpointer-arith -Winline -Wdeclaration-after-statement -Wendif-labels -fno-strict-aliasing -fwrapv -I../../../../src/include -I/opt/local/include  -I/opt/local/include  -c -o dbsize.o dbsize.c
1528/usr/bin/gcc-4.2 -no-cpp-precomp -O2 -arch ppc -arch i386 -Wall -Wmissing-prototypes -Wpointer-arith -Winline -Wdeclaration-after-statement -Wendif-labels -fno-strict-aliasing -fwrapv -I../../../../src/include -I/opt/local/include  -I/opt/local/include  -c -o genfile.o genfile.c
1529/usr/libexec/gcc/i686-apple-darwin10/4.2.1/ld -r -o SUBSYS.o acl.o arrayfuncs.o array_userfuncs.o arrayutils.o bool.o cash.o char.o date.o datetime.o datum.o domains.o float.o format_type.o geo_ops.o geo_selfuncs.o int.o int8.o like.o lockfuncs.o misc.o nabstime.o name.o not_in.o numeric.o numutils.o oid.o oracle_compat.o pseudotypes.o rowtypes.o regexp.o regproc.o ruleutils.o selfuncs.o tid.o timestamp.o varbit.o varchar.o varlena.o version.o xid.o network.o mac.o inet_net_ntop.o inet_net_pton.o ri_triggers.o pg_lzcompress.o pg_locale.o formatting.o ascii.o quote.o pgstatfuncs.o encode.o dbsize.o genfile.o
1530ld: warning: -arch not specified
1531ld: warning: in acl.o, missing required architecture x86_64 in file
1532ld: warning: in arrayfuncs.o, missing required architecture x86_64 in file
1533ld: warning: in array_userfuncs.o, missing required architecture x86_64 in file
1534ld: warning: in arrayutils.o, missing required architecture x86_64 in file
1535ld: warning: in bool.o, missing required architecture x86_64 in file
1536ld: warning: in cash.o, missing required architecture x86_64 in file
1537ld: warning: in char.o, missing required architecture x86_64 in file
1538ld: warning: in date.o, missing required architecture x86_64 in file
1539ld: warning: in datetime.o, missing required architecture x86_64 in file
1540ld: warning: in datum.o, missing required architecture x86_64 in file
1541ld: warning: in domains.o, missing required architecture x86_64 in file
1542ld: warning: in float.o, missing required architecture x86_64 in file
1543ld: warning: in format_type.o, missing required architecture x86_64 in file
1544ld: warning: in geo_ops.o, missing required architecture x86_64 in file
1545ld: warning: in geo_selfuncs.o, missing required architecture x86_64 in file
1546ld: warning: in int.o, missing required architecture x86_64 in file
1547ld: warning: in int8.o, missing required architecture x86_64 in file
1548ld: warning: in like.o, missing required architecture x86_64 in file
1549ld: warning: in lockfuncs.o, missing required architecture x86_64 in file
1550ld: warning: in misc.o, missing required architecture x86_64 in file
1551ld: warning: in nabstime.o, missing required architecture x86_64 in file
1552ld: warning: in name.o, missing required architecture x86_64 in file
1553ld: warning: in not_in.o, missing required architecture x86_64 in file
1554ld: warning: in numeric.o, missing required architecture x86_64 in file
1555ld: warning: in numutils.o, missing required architecture x86_64 in file
1556ld: warning: in oid.o, missing required architecture x86_64 in file
1557ld: warning: in oracle_compat.o, missing required architecture x86_64 in file
1558ld: warning: in pseudotypes.o, missing required architecture x86_64 in file
1559ld: warning: in rowtypes.o, missing required architecture x86_64 in file
1560ld: warning: in regexp.o, missing required architecture x86_64 in file
1561ld: warning: in regproc.o, missing required architecture x86_64 in file
1562ld: warning: in ruleutils.o, missing required architecture x86_64 in file
1563ld: warning: in selfuncs.o, missing required architecture x86_64 in file
1564ld: warning: in tid.o, missing required architecture x86_64 in file
1565ld: warning: in timestamp.o, missing required architecture x86_64 in file
1566ld: warning: in varbit.o, missing required architecture x86_64 in file
1567ld: warning: in varchar.o, missing required architecture x86_64 in file
1568ld: warning: in varlena.o, missing required architecture x86_64 in file
1569ld: warning: in version.o, missing required architecture x86_64 in file
1570ld: warning: in xid.o, missing required architecture x86_64 in file
1571ld: warning: in network.o, missing required architecture x86_64 in file
1572ld: warning: in mac.o, missing required architecture x86_64 in file
1573ld: warning: in inet_net_ntop.o, missing required architecture x86_64 in file
1574ld: warning: in inet_net_pton.o, missing required architecture x86_64 in file
1575ld: warning: in ri_triggers.o, missing required architecture x86_64 in file
1576ld: warning: in pg_lzcompress.o, missing required architecture x86_64 in file
1577ld: warning: in pg_locale.o, missing required architecture x86_64 in file
1578ld: warning: in formatting.o, missing required architecture x86_64 in file
1579ld: warning: in ascii.o, missing required architecture x86_64 in file
1580ld: warning: in quote.o, missing required architecture x86_64 in file
1581ld: warning: in pgstatfuncs.o, missing required architecture x86_64 in file
1582ld: warning: in encode.o, missing required architecture x86_64 in file
1583ld: warning: in dbsize.o, missing required architecture x86_64 in file
1584ld: warning: in genfile.o, missing required architecture x86_64 in file
1585/usr/bin/gnumake -C cache SUBSYS.o
1586/usr/bin/gcc-4.2 -no-cpp-precomp -O2 -arch ppc -arch i386 -Wall -Wmissing-prototypes -Wpointer-arith -Winline -Wdeclaration-after-statement -Wendif-labels -fno-strict-aliasing -fwrapv -I../../../../src/include -I/opt/local/include  -I/opt/local/include  -c -o catcache.o catcache.c
1587/usr/bin/gcc-4.2 -no-cpp-precomp -O2 -arch ppc -arch i386 -Wall -Wmissing-prototypes -Wpointer-arith -Winline -Wdeclaration-after-statement -Wendif-labels -fno-strict-aliasing -fwrapv -I../../../../src/include -I/opt/local/include  -I/opt/local/include  -c -o inval.o inval.c
1588/usr/bin/gcc-4.2 -no-cpp-precomp -O2 -arch ppc -arch i386 -Wall -Wmissing-prototypes -Wpointer-arith -Winline -Wdeclaration-after-statement -Wendif-labels -fno-strict-aliasing -fwrapv -I../../../../src/include -I/opt/local/include  -I/opt/local/include  -c -o relcache.o relcache.c
1589/usr/bin/gcc-4.2 -no-cpp-precomp -O2 -arch ppc -arch i386 -Wall -Wmissing-prototypes -Wpointer-arith -Winline -Wdeclaration-after-statement -Wendif-labels -fno-strict-aliasing -fwrapv -I../../../../src/include -I/opt/local/include  -I/opt/local/include  -c -o syscache.o syscache.c
1590/usr/bin/gcc-4.2 -no-cpp-precomp -O2 -arch ppc -arch i386 -Wall -Wmissing-prototypes -Wpointer-arith -Winline -Wdeclaration-after-statement -Wendif-labels -fno-strict-aliasing -fwrapv -I../../../../src/include -I/opt/local/include  -I/opt/local/include  -c -o lsyscache.o lsyscache.c
1591/usr/bin/gcc-4.2 -no-cpp-precomp -O2 -arch ppc -arch i386 -Wall -Wmissing-prototypes -Wpointer-arith -Winline -Wdeclaration-after-statement -Wendif-labels -fno-strict-aliasing -fwrapv -I../../../../src/include -I/opt/local/include  -I/opt/local/include  -c -o typcache.o typcache.c
1592/usr/libexec/gcc/i686-apple-darwin10/4.2.1/ld -r -o SUBSYS.o catcache.o inval.o relcache.o syscache.o lsyscache.o typcache.o
1593ld: warning: -arch not specified
1594ld: warning: in catcache.o, missing required architecture x86_64 in file
1595ld: warning: in inval.o, missing required architecture x86_64 in file
1596ld: warning: in relcache.o, missing required architecture x86_64 in file
1597ld: warning: in syscache.o, missing required architecture x86_64 in file
1598ld: warning: in lsyscache.o, missing required architecture x86_64 in file
1599ld: warning: in typcache.o, missing required architecture x86_64 in file
1600/usr/bin/gnumake -C error SUBSYS.o
1601/usr/bin/gcc-4.2 -no-cpp-precomp -O2 -arch ppc -arch i386 -Wall -Wmissing-prototypes -Wpointer-arith -Winline -Wdeclaration-after-statement -Wendif-labels -fno-strict-aliasing -fwrapv -I../../../../src/include -I/opt/local/include  -I/opt/local/include  -c -o assert.o assert.c
1602/usr/bin/gcc-4.2 -no-cpp-precomp -O2 -arch ppc -arch i386 -Wall -Wmissing-prototypes -Wpointer-arith -Winline -Wdeclaration-after-statement -Wendif-labels -fno-strict-aliasing -fwrapv -I../../../../src/include -I/opt/local/include  -I/opt/local/include  -c -o elog.o elog.c
1603/usr/libexec/gcc/i686-apple-darwin10/4.2.1/ld -r -o SUBSYS.o assert.o elog.o
1604ld: warning: -arch not specified
1605ld: warning: in assert.o, missing required architecture x86_64 in file
1606ld: warning: in elog.o, missing required architecture x86_64 in file
1607/usr/bin/gnumake -C fmgr SUBSYS.o
1608/usr/bin/gcc-4.2 -no-cpp-precomp -O2 -arch ppc -arch i386 -Wall -Wmissing-prototypes -Wpointer-arith -Winline -Wdeclaration-after-statement -Wendif-labels -fno-strict-aliasing -fwrapv -I../../../../src/include -I/opt/local/include  -I/opt/local/include -DDLSUFFIX=\".so\"  -c -o dfmgr.o dfmgr.c
1609/usr/bin/gcc-4.2 -no-cpp-precomp -O2 -arch ppc -arch i386 -Wall -Wmissing-prototypes -Wpointer-arith -Winline -Wdeclaration-after-statement -Wendif-labels -fno-strict-aliasing -fwrapv -I../../../../src/include -I/opt/local/include  -I/opt/local/include -DDLSUFFIX=\".so\"  -c -o fmgr.o fmgr.c
1610/usr/bin/gcc-4.2 -no-cpp-precomp -O2 -arch ppc -arch i386 -Wall -Wmissing-prototypes -Wpointer-arith -Winline -Wdeclaration-after-statement -Wendif-labels -fno-strict-aliasing -fwrapv -I../../../../src/include -I/opt/local/include  -I/opt/local/include -DDLSUFFIX=\".so\"  -c -o funcapi.o funcapi.c
1611/usr/libexec/gcc/i686-apple-darwin10/4.2.1/ld -r -o SUBSYS.o dfmgr.o fmgr.o funcapi.o
1612ld: warning: -arch not specified
1613ld: warning: in dfmgr.o, missing required architecture x86_64 in file
1614ld: warning: in fmgr.o, missing required architecture x86_64 in file
1615ld: warning: in funcapi.o, missing required architecture x86_64 in file
1616/usr/bin/gnumake -C hash SUBSYS.o
1617/usr/bin/gcc-4.2 -no-cpp-precomp -O2 -arch ppc -arch i386 -Wall -Wmissing-prototypes -Wpointer-arith -Winline -Wdeclaration-after-statement -Wendif-labels -fno-strict-aliasing -fwrapv -I../../../../src/include -I/opt/local/include  -I/opt/local/include  -c -o dynahash.o dynahash.c
1618/usr/bin/gcc-4.2 -no-cpp-precomp -O2 -arch ppc -arch i386 -Wall -Wmissing-prototypes -Wpointer-arith -Winline -Wdeclaration-after-statement -Wendif-labels -fno-strict-aliasing -fwrapv -I../../../../src/include -I/opt/local/include  -I/opt/local/include  -c -o hashfn.o hashfn.c
1619/usr/bin/gcc-4.2 -no-cpp-precomp -O2 -arch ppc -arch i386 -Wall -Wmissing-prototypes -Wpointer-arith -Winline -Wdeclaration-after-statement -Wendif-labels -fno-strict-aliasing -fwrapv -I../../../../src/include -I/opt/local/include  -I/opt/local/include  -c -o pg_crc.o pg_crc.c
1620/usr/libexec/gcc/i686-apple-darwin10/4.2.1/ld -r -o SUBSYS.o dynahash.o hashfn.o pg_crc.o
1621ld: warning: -arch not specified
1622ld: warning: in dynahash.o, missing required architecture x86_64 in file
1623ld: warning: in hashfn.o, missing required architecture x86_64 in file
1624ld: warning: in pg_crc.o, missing required architecture x86_64 in file
1625/usr/bin/gnumake -C init SUBSYS.o
1626/usr/bin/gcc-4.2 -no-cpp-precomp -O2 -arch ppc -arch i386 -Wall -Wmissing-prototypes -Wpointer-arith -Winline -Wdeclaration-after-statement -Wendif-labels -fno-strict-aliasing -fwrapv -I../../../../src/include -I/opt/local/include  -I/opt/local/include  -c -o flatfiles.o flatfiles.c
1627/usr/bin/gcc-4.2 -no-cpp-precomp -O2 -arch ppc -arch i386 -Wall -Wmissing-prototypes -Wpointer-arith -Winline -Wdeclaration-after-statement -Wendif-labels -fno-strict-aliasing -fwrapv -I../../../../src/include -I/opt/local/include  -I/opt/local/include  -c -o globals.o globals.c
1628/usr/bin/gcc-4.2 -no-cpp-precomp -O2 -arch ppc -arch i386 -Wall -Wmissing-prototypes -Wpointer-arith -Winline -Wdeclaration-after-statement -Wendif-labels -fno-strict-aliasing -fwrapv -I../../../../src/include -I/opt/local/include  -I/opt/local/include  -c -o miscinit.o miscinit.c
1629/usr/bin/gcc-4.2 -no-cpp-precomp -O2 -arch ppc -arch i386 -Wall -Wmissing-prototypes -Wpointer-arith -Winline -Wdeclaration-after-statement -Wendif-labels -fno-strict-aliasing -fwrapv -I../../../../src/include -I/opt/local/include  -I/opt/local/include  -c -o postinit.o postinit.c
1630/usr/libexec/gcc/i686-apple-darwin10/4.2.1/ld -r -o SUBSYS.o flatfiles.o globals.o miscinit.o postinit.o
1631ld: warning: -arch not specified
1632ld: warning: in flatfiles.o, missing required architecture x86_64 in file
1633ld: warning: in globals.o, missing required architecture x86_64 in file
1634ld: warning: in miscinit.o, missing required architecture x86_64 in file
1635ld: warning: in postinit.o, missing required architecture x86_64 in file
1636/usr/bin/gnumake -C mb SUBSYS.o
1637/usr/bin/gcc-4.2 -no-cpp-precomp -O2 -arch ppc -arch i386 -Wall -Wmissing-prototypes -Wpointer-arith -Winline -Wdeclaration-after-statement -Wendif-labels -fno-strict-aliasing -fwrapv -I../../../../src/include -I/opt/local/include  -I/opt/local/include  -c -o encnames.o encnames.c
1638/usr/bin/gcc-4.2 -no-cpp-precomp -O2 -arch ppc -arch i386 -Wall -Wmissing-prototypes -Wpointer-arith -Winline -Wdeclaration-after-statement -Wendif-labels -fno-strict-aliasing -fwrapv -I../../../../src/include -I/opt/local/include  -I/opt/local/include  -c -o conv.o conv.c
1639/usr/bin/gcc-4.2 -no-cpp-precomp -O2 -arch ppc -arch i386 -Wall -Wmissing-prototypes -Wpointer-arith -Winline -Wdeclaration-after-statement -Wendif-labels -fno-strict-aliasing -fwrapv -I../../../../src/include -I/opt/local/include  -I/opt/local/include  -c -o mbutils.o mbutils.c
1640/usr/bin/gcc-4.2 -no-cpp-precomp -O2 -arch ppc -arch i386 -Wall -Wmissing-prototypes -Wpointer-arith -Winline -Wdeclaration-after-statement -Wendif-labels -fno-strict-aliasing -fwrapv -I../../../../src/include -I/opt/local/include  -I/opt/local/include  -c -o wchar.o wchar.c
1641/usr/bin/gcc-4.2 -no-cpp-precomp -O2 -arch ppc -arch i386 -Wall -Wmissing-prototypes -Wpointer-arith -Winline -Wdeclaration-after-statement -Wendif-labels -fno-strict-aliasing -fwrapv -I../../../../src/include -I/opt/local/include  -I/opt/local/include  -c -o wstrcmp.o wstrcmp.c
1642/usr/bin/gcc-4.2 -no-cpp-precomp -O2 -arch ppc -arch i386 -Wall -Wmissing-prototypes -Wpointer-arith -Winline -Wdeclaration-after-statement -Wendif-labels -fno-strict-aliasing -fwrapv -I../../../../src/include -I/opt/local/include  -I/opt/local/include  -c -o wstrncmp.o wstrncmp.c
1643/usr/libexec/gcc/i686-apple-darwin10/4.2.1/ld -r -o SUBSYS.o encnames.o conv.o mbutils.o wchar.o wstrcmp.o wstrncmp.o
1644ld: warning: -arch not specified
1645ld: warning: in encnames.o, missing required architecture x86_64 in file
1646ld: warning: in conv.o, missing required architecture x86_64 in file
1647ld: warning: in mbutils.o, missing required architecture x86_64 in file
1648ld: warning: in wchar.o, missing required architecture x86_64 in file
1649ld: warning: in wstrcmp.o, missing required architecture x86_64 in file
1650ld: warning: in wstrncmp.o, missing required architecture x86_64 in file
1651/usr/bin/gnumake -C misc SUBSYS.o
1652/usr/bin/gcc-4.2 -no-cpp-precomp -O2 -arch ppc -arch i386 -Wall -Wmissing-prototypes -Wpointer-arith -Winline -Wdeclaration-after-statement -Wendif-labels -fno-strict-aliasing -fwrapv -I. -I../../../../src/include -I/opt/local/include  -I/opt/local/include  -c -o guc.o guc.c
1653guc.c: In function 'set_config_option':
1654guc.c:4242: warning: format not a string literal and no format arguments
1655guc.c: In function 'set_config_option':
1656guc.c:4242: warning: format not a string literal and no format arguments
1657/usr/bin/gcc-4.2 -no-cpp-precomp -O2 -arch ppc -arch i386 -Wall -Wmissing-prototypes -Wpointer-arith -Winline -Wdeclaration-after-statement -Wendif-labels -fno-strict-aliasing -fwrapv -I. -I../../../../src/include -I/opt/local/include  -I/opt/local/include  -c -o help_config.o help_config.c
1658/usr/bin/gcc-4.2 -no-cpp-precomp -O2 -arch ppc -arch i386 -Wall -Wmissing-prototypes -Wpointer-arith -Winline -Wdeclaration-after-statement -Wendif-labels -fno-strict-aliasing -fwrapv -I. -I../../../../src/include -I/opt/local/include  -I/opt/local/include  -c -o pg_rusage.o pg_rusage.c
1659/usr/bin/gcc-4.2 -no-cpp-precomp -O2 -arch ppc -arch i386 -Wall -Wmissing-prototypes -Wpointer-arith -Winline -Wdeclaration-after-statement -Wendif-labels -fno-strict-aliasing -fwrapv -I. -I../../../../src/include -I/opt/local/include  -I/opt/local/include  -c -o ps_status.o ps_status.c
1660/usr/bin/gcc-4.2 -no-cpp-precomp -O2 -arch ppc -arch i386 -Wall -Wmissing-prototypes -Wpointer-arith -Winline -Wdeclaration-after-statement -Wendif-labels -fno-strict-aliasing -fwrapv -I. -I../../../../src/include -I/opt/local/include  -I/opt/local/include  -c -o superuser.o superuser.c
1661/usr/bin/gcc-4.2 -no-cpp-precomp -O2 -arch ppc -arch i386 -Wall -Wmissing-prototypes -Wpointer-arith -Winline -Wdeclaration-after-statement -Wendif-labels -fno-strict-aliasing -fwrapv -I. -I../../../../src/include -I/opt/local/include  -I/opt/local/include  -c -o tzparser.o tzparser.c
1662/usr/libexec/gcc/i686-apple-darwin10/4.2.1/ld -r -o SUBSYS.o guc.o help_config.o pg_rusage.o ps_status.o superuser.o tzparser.o
1663ld: warning: -arch not specified
1664ld: warning: in guc.o, missing required architecture x86_64 in file
1665ld: warning: in help_config.o, missing required architecture x86_64 in file
1666ld: warning: in pg_rusage.o, missing required architecture x86_64 in file
1667ld: warning: in ps_status.o, missing required architecture x86_64 in file
1668ld: warning: in superuser.o, missing required architecture x86_64 in file
1669ld: warning: in tzparser.o, missing required architecture x86_64 in file
1670/usr/bin/gnumake -C mmgr SUBSYS.o
1671/usr/bin/gcc-4.2 -no-cpp-precomp -O2 -arch ppc -arch i386 -Wall -Wmissing-prototypes -Wpointer-arith -Winline -Wdeclaration-after-statement -Wendif-labels -fno-strict-aliasing -fwrapv -I../../../../src/include -I/opt/local/include  -I/opt/local/include  -c -o aset.o aset.c
1672/usr/bin/gcc-4.2 -no-cpp-precomp -O2 -arch ppc -arch i386 -Wall -Wmissing-prototypes -Wpointer-arith -Winline -Wdeclaration-after-statement -Wendif-labels -fno-strict-aliasing -fwrapv -I../../../../src/include -I/opt/local/include  -I/opt/local/include  -c -o mcxt.o mcxt.c
1673/usr/bin/gcc-4.2 -no-cpp-precomp -O2 -arch ppc -arch i386 -Wall -Wmissing-prototypes -Wpointer-arith -Winline -Wdeclaration-after-statement -Wendif-labels -fno-strict-aliasing -fwrapv -I../../../../src/include -I/opt/local/include  -I/opt/local/include  -c -o portalmem.o portalmem.c
1674/usr/libexec/gcc/i686-apple-darwin10/4.2.1/ld -r -o SUBSYS.o aset.o mcxt.o portalmem.o
1675ld: warning: -arch not specified
1676ld: warning: in aset.o, missing required architecture x86_64 in file
1677ld: warning: in mcxt.o, missing required architecture x86_64 in file
1678ld: warning: in portalmem.o, missing required architecture x86_64 in file
1679/usr/bin/gnumake -C resowner SUBSYS.o
1680/usr/bin/gcc-4.2 -no-cpp-precomp -O2 -arch ppc -arch i386 -Wall -Wmissing-prototypes -Wpointer-arith -Winline -Wdeclaration-after-statement -Wendif-labels -fno-strict-aliasing -fwrapv -I../../../../src/include -I/opt/local/include  -I/opt/local/include  -c -o resowner.o resowner.c
1681/usr/libexec/gcc/i686-apple-darwin10/4.2.1/ld -r -o SUBSYS.o resowner.o
1682ld: warning: -arch not specified
1683ld: warning: in resowner.o, missing required architecture x86_64 in file
1684/usr/bin/gnumake -C sort SUBSYS.o
1685/usr/bin/gcc-4.2 -no-cpp-precomp -O2 -arch ppc -arch i386 -Wall -Wmissing-prototypes -Wpointer-arith -Winline -Wdeclaration-after-statement -Wendif-labels -fno-strict-aliasing -fwrapv -I../../../../src/include -I/opt/local/include  -I/opt/local/include  -c -o logtape.o logtape.c
1686/usr/bin/gcc-4.2 -no-cpp-precomp -O2 -arch ppc -arch i386 -Wall -Wmissing-prototypes -Wpointer-arith -Winline -Wdeclaration-after-statement -Wendif-labels -fno-strict-aliasing -fwrapv -I../../../../src/include -I/opt/local/include  -I/opt/local/include  -c -o tuplesort.o tuplesort.c
1687/usr/bin/gcc-4.2 -no-cpp-precomp -O2 -arch ppc -arch i386 -Wall -Wmissing-prototypes -Wpointer-arith -Winline -Wdeclaration-after-statement -Wendif-labels -fno-strict-aliasing -fwrapv -I../../../../src/include -I/opt/local/include  -I/opt/local/include  -c -o tuplestore.o tuplestore.c
1688/usr/libexec/gcc/i686-apple-darwin10/4.2.1/ld -r -o SUBSYS.o logtape.o tuplesort.o tuplestore.o
1689ld: warning: -arch not specified
1690ld: warning: in logtape.o, missing required architecture x86_64 in file
1691ld: warning: in tuplesort.o, missing required architecture x86_64 in file
1692ld: warning: in tuplestore.o, missing required architecture x86_64 in file
1693/usr/bin/gnumake -C time SUBSYS.o
1694/usr/bin/gcc-4.2 -no-cpp-precomp -O2 -arch ppc -arch i386 -Wall -Wmissing-prototypes -Wpointer-arith -Winline -Wdeclaration-after-statement -Wendif-labels -fno-strict-aliasing -fwrapv -I../../../../src/include -I/opt/local/include  -I/opt/local/include  -c -o tqual.o tqual.c
1695/usr/libexec/gcc/i686-apple-darwin10/4.2.1/ld -r -o SUBSYS.o tqual.o
1696ld: warning: -arch not specified
1697ld: warning: in tqual.o, missing required architecture x86_64 in file
1698/usr/libexec/gcc/i686-apple-darwin10/4.2.1/ld -r -o SUBSYS.o fmgrtab.o adt/SUBSYS.o cache/SUBSYS.o error/SUBSYS.o fmgr/SUBSYS.o hash/SUBSYS.o init/SUBSYS.o mb/SUBSYS.o misc/SUBSYS.o mmgr/SUBSYS.o resowner/SUBSYS.o sort/SUBSYS.o time/SUBSYS.o
1699ld: warning: in fmgrtab.o, missing required architecture x86_64 in file
1700/usr/bin/gnumake -C ../../src/timezone all
1701/usr/bin/gnumake -C ../../src/port all
1702gnumake[4]: Nothing to be done for `all'.
1703/usr/bin/gcc-4.2 -no-cpp-precomp -O2 -arch ppc -arch i386 -Wall -Wmissing-prototypes -Wpointer-arith -Winline -Wdeclaration-after-statement -Wendif-labels -fno-strict-aliasing -fwrapv -L../../src/port -L/opt/local/lib -arch ppc -arch i386  -L/opt/local/lib   access/SUBSYS.o bootstrap/SUBSYS.o catalog/SUBSYS.o parser/SUBSYS.o commands/SUBSYS.o executor/SUBSYS.o lib/SUBSYS.o libpq/SUBSYS.o main/SUBSYS.o nodes/SUBSYS.o optimizer/SUBSYS.o port/SUBSYS.o postmaster/SUBSYS.o regex/SUBSYS.o rewrite/SUBSYS.o storage/SUBSYS.o tcop/SUBSYS.o utils/SUBSYS.o ../../src/timezone/SUBSYS.o ../../src/port/libpgport_srv.a -lssl -lcrypto -lm -o postgres
1704ld: warning: in access/SUBSYS.o, file was built for unsupported file format which is not the architecture being linked (ppc)
1705ld: warning: in bootstrap/SUBSYS.o, file was built for unsupported file format which is not the architecture being linked (ppc)
1706ld: warning: in catalog/SUBSYS.o, file was built for unsupported file format which is not the architecture being linked (ppc)
1707ld: warning: in parser/SUBSYS.o, file was built for unsupported file format which is not the architecture being linked (ppc)
1708ld: warning: in commands/SUBSYS.o, file was built for unsupported file format which is not the architecture being linked (ppc)
1709ld: warning: in executor/SUBSYS.o, file was built for unsupported file format which is not the architecture being linked (ppc)
1710ld: warning: in lib/SUBSYS.o, file was built for unsupported file format which is not the architecture being linked (ppc)
1711ld: warning: in libpq/SUBSYS.o, file was built for unsupported file format which is not the architecture being linked (ppc)
1712ld: warning: in main/SUBSYS.o, file was built for unsupported file format which is not the architecture being linked (ppc)
1713ld: warning: in nodes/SUBSYS.o, file was built for unsupported file format which is not the architecture being linked (ppc)
1714ld: warning: in optimizer/SUBSYS.o, file was built for unsupported file format which is not the architecture being linked (ppc)
1715ld: warning: in port/SUBSYS.o, file was built for unsupported file format which is not the architecture being linked (ppc)
1716ld: warning: in postmaster/SUBSYS.o, file was built for unsupported file format which is not the architecture being linked (ppc)
1717ld: warning: in regex/SUBSYS.o, file was built for unsupported file format which is not the architecture being linked (ppc)
1718ld: warning: in rewrite/SUBSYS.o, file was built for unsupported file format which is not the architecture being linked (ppc)
1719ld: warning: in storage/SUBSYS.o, file was built for unsupported file format which is not the architecture being linked (ppc)
1720ld: warning: in tcop/SUBSYS.o, file was built for unsupported file format which is not the architecture being linked (ppc)
1721ld: warning: in utils/SUBSYS.o, file was built for unsupported file format which is not the architecture being linked (ppc)
1722ld: warning: in ../../src/timezone/SUBSYS.o, file was built for unsupported file format which is not the architecture being linked (ppc)
1723Undefined symbols for architecture ppc:
1724  "_main", referenced from:
1725      start in crt1.10.5.o
1726ld: symbol(s) not found for architecture ppc
1727collect2: ld returned 1 exit status
1728ld: warning: in access/SUBSYS.o, file was built for unsupported file format which is not the architecture being linked (i386)
1729ld: warning: in bootstrap/SUBSYS.o, file was built for unsupported file format which is not the architecture being linked (i386)
1730ld: warning: in catalog/SUBSYS.o, file was built for unsupported file format which is not the architecture being linked (i386)
1731ld: warning: in parser/SUBSYS.o, file was built for unsupported file format which is not the architecture being linked (i386)
1732ld: warning: in commands/SUBSYS.o, file was built for unsupported file format which is not the architecture being linked (i386)
1733ld: warning: in executor/SUBSYS.o, file was built for unsupported file format which is not the architecture being linked (i386)
1734ld: warning: in lib/SUBSYS.o, file was built for unsupported file format which is not the architecture being linked (i386)
1735ld: warning: in libpq/SUBSYS.o, file was built for unsupported file format which is not the architecture being linked (i386)
1736ld: warning: in main/SUBSYS.o, file was built for unsupported file format which is not the architecture being linked (i386)
1737ld: warning: in nodes/SUBSYS.o, file was built for unsupported file format which is not the architecture being linked (i386)
1738ld: warning: in optimizer/SUBSYS.o, file was built for unsupported file format which is not the architecture being linked (i386)
1739ld: warning: in port/SUBSYS.o, file was built for unsupported file format which is not the architecture being linked (i386)
1740ld: warning: in postmaster/SUBSYS.o, file was built for unsupported file format which is not the architecture being linked (i386)
1741ld: warning: in regex/SUBSYS.o, file was built for unsupported file format which is not the architecture being linked (i386)
1742ld: warning: in rewrite/SUBSYS.o, file was built for unsupported file format which is not the architecture being linked (i386)
1743ld: warning: in storage/SUBSYS.o, file was built for unsupported file format which is not the architecture being linked (i386)
1744ld: warning: in tcop/SUBSYS.o, file was built for unsupported file format which is not the architecture being linked (i386)
1745ld: warning: in utils/SUBSYS.o, file was built for unsupported file format which is not the architecture being linked (i386)
1746ld: warning: in ../../src/timezone/SUBSYS.o, file was built for unsupported file format which is not the architecture being linked (i386)
1747Undefined symbols for architecture i386:
1748  "_main", referenced from:
1749      start in crt1.10.6.o
1750ld: symbol(s) not found for architecture i386
1751collect2: ld returned 1 exit status
1752lipo: can't open input file: /var/tmp//ccSJDtWk.out (No such file or directory)
1753gnumake[2]: *** [postgres] Error 1
1754gnumake[1]: *** [all] Error 2
1755gnumake: *** [all] Error 2
1756Error: Target org.macports.build returned: shell command " cd "/opt/local/var/macports/build/_opt_local_var_macports_sources_rsync.macports.org_release_ports_databases_postgresql82/work/postgresql-8.2.16" && /usr/bin/gnumake -j1 " returned error 2
1757DEBUG: Backtrace: shell command " cd "/opt/local/var/macports/build/_opt_local_var_macports_sources_rsync.macports.org_release_ports_databases_postgresql82/work/postgresql-8.2.16" && /usr/bin/gnumake -j1 " returned error 2
1758    while executing
1759"command_exec build"
1760    (procedure "portbuild::build_main" line 9)
1761    invoked from within
1762"$procedure $targetname"
1763Warning: the following items did not execute (for postgresql82): org.macports.activate org.macports.build org.macports.destroot org.macports.install
1764Error: Status 1 encountered during processing.
1765To report a bug, see <http://guide.macports.org/#project.tickets>
1766$