Ticket #24942: numpy-build-error.txt

File numpy-build-error.txt, 187.0 KB (added by anddam (Andrea D'Amore), 9 years ago)
Line 
1$ sudo port -d install py26-numpy
2DEBUG: Changing to port directory: /opt/local/var/macports/sources/svn.macports.org/trunk/dports/python/py26-numpy
3DEBUG: OS darwin/10.3.0 (Mac OS X 10.6) arch i386
4DEBUG: org.macports.load registered provides 'load', a pre-existing procedure. Target override will not be provided
5DEBUG: org.macports.unload registered provides 'unload', a pre-existing procedure. Target override will not be provided
6DEBUG: org.macports.distfiles registered provides 'distfiles', a pre-existing procedure. Target override will not be provided
7DEBUG: Using group file /opt/local/var/macports/sources/svn.macports.org/trunk/dports/_resources/port1.0/group/python26-1.0.tcl
8DEBUG: Reading variant descriptions from /opt/local/var/macports/sources/svn.macports.org/trunk/dports/_resources/port1.0/variant_descriptions.conf
9DEBUG: universal variant already exists, so not adding the default one
10DEBUG: Requested variant bash_completion is not provided by port py26-numpy.
11DEBUG: Attempting ln -sf /opt/local/var/macports/build/_opt_local_var_macports_sources_svn.macports.org_trunk_dports_python_py26-numpy/work /opt/local/var/macports/sources/svn.macports.org/trunk/dports/python/py26-numpy/work
12DEBUG: Starting logging for py26-numpy
13DEBUG: epoch: in tree: 0 installed: 0
14DEBUG: python26 2.6.5_1 exists in the ports tree
15DEBUG: python26 2.6.5_1  is the latest installed
16DEBUG: python26 2.6.5_1  is active
17DEBUG: Merging existing variants '' into variants
18DEBUG: new fully merged portvariants: bash_completion +
19DEBUG: Changing to port directory: /opt/local/var/macports/sources/svn.macports.org/trunk/dports/lang/python26
20DEBUG: OS darwin/10.3.0 (Mac OS X 10.6) arch i386
21DEBUG: org.macports.load registered provides 'load', a pre-existing procedure. Target override will not be provided
22DEBUG: org.macports.unload registered provides 'unload', a pre-existing procedure. Target override will not be provided
23DEBUG: org.macports.distfiles registered provides 'distfiles', a pre-existing procedure. Target override will not be provided
24DEBUG: Using group file /opt/local/var/macports/sources/svn.macports.org/trunk/dports/_resources/port1.0/group/select-1.0.tcl
25DEBUG: Reading variant descriptions from /opt/local/var/macports/sources/svn.macports.org/trunk/dports/_resources/port1.0/variant_descriptions.conf
26DEBUG: universal variant already exists, so not adding the default one
27DEBUG: Requested variant bash_completion is not provided by port python26.
28DEBUG: No need to upgrade! python26 2.6.5_1 >= python26 2.6.5_1
29DEBUG: epoch: in tree: 0 installed: 0
30DEBUG: gettext 0.18_0 exists in the ports tree
31DEBUG: gettext 0.18_0 +universal is the latest installed
32DEBUG: gettext 0.18_0 +universal is active
33DEBUG: Merging existing variants '+universal' into variants
34DEBUG: new fully merged portvariants: universal + bash_completion +
35DEBUG: Changing to port directory: /opt/local/var/macports/sources/svn.macports.org/trunk/dports/devel/gettext
36DEBUG: OS darwin/10.3.0 (Mac OS X 10.6) arch i386
37DEBUG: org.macports.load registered provides 'load', a pre-existing procedure. Target override will not be provided
38DEBUG: org.macports.unload registered provides 'unload', a pre-existing procedure. Target override will not be provided
39DEBUG: org.macports.distfiles registered provides 'distfiles', a pre-existing procedure. Target override will not be provided
40DEBUG: Using group file /opt/local/var/macports/sources/svn.macports.org/trunk/dports/_resources/port1.0/group/muniversal-1.0.tcl
41DEBUG: Reading variant descriptions from /opt/local/var/macports/sources/svn.macports.org/trunk/dports/_resources/port1.0/variant_descriptions.conf
42DEBUG: Using group file /opt/local/var/macports/sources/svn.macports.org/trunk/dports/_resources/port1.0/group/archcheck-1.0.tcl
43DEBUG: universal variant already exists, so not adding the default one
44DEBUG: Requested variant bash_completion is not provided by port gettext.
45DEBUG: Executing variant universal provides universal
46DEBUG: No need to upgrade! gettext 0.18_0 >= gettext 0.18_0
47DEBUG: epoch: in tree: 0 installed: 0
48DEBUG: libiconv 1.13.1_0 exists in the ports tree
49DEBUG: libiconv 1.13.1_0 +universal is the latest installed
50DEBUG: libiconv 1.13.1_0 +universal is active
51DEBUG: Merging existing variants '+universal' into variants
52DEBUG: new fully merged portvariants: universal + bash_completion +
53DEBUG: Changing to port directory: /opt/local/var/macports/sources/svn.macports.org/trunk/dports/textproc/libiconv
54DEBUG: OS darwin/10.3.0 (Mac OS X 10.6) arch i386
55DEBUG: org.macports.load registered provides 'load', a pre-existing procedure. Target override will not be provided
56DEBUG: org.macports.unload registered provides 'unload', a pre-existing procedure. Target override will not be provided
57DEBUG: org.macports.distfiles registered provides 'distfiles', a pre-existing procedure. Target override will not be provided
58DEBUG: Using group file /opt/local/var/macports/sources/svn.macports.org/trunk/dports/_resources/port1.0/group/muniversal-1.0.tcl
59DEBUG: Reading variant descriptions from /opt/local/var/macports/sources/svn.macports.org/trunk/dports/_resources/port1.0/variant_descriptions.conf
60DEBUG: universal variant already exists, so not adding the default one
61DEBUG: Requested variant bash_completion is not provided by port libiconv.
62DEBUG: Executing variant universal provides universal
63DEBUG: No need to upgrade! libiconv 1.13.1_0 >= libiconv 1.13.1_0
64DEBUG: epoch: in tree: 0 installed: 0
65DEBUG: ncurses 5.7_0 exists in the ports tree
66DEBUG: ncurses 5.7_0 +universal is the latest installed
67DEBUG: ncurses 5.7_0 +universal is active
68DEBUG: Merging existing variants '+universal' into variants
69DEBUG: new fully merged portvariants: universal + bash_completion +
70DEBUG: Changing to port directory: /opt/local/var/macports/sources/svn.macports.org/trunk/dports/devel/ncurses
71DEBUG: OS darwin/10.3.0 (Mac OS X 10.6) arch i386
72DEBUG: org.macports.load registered provides 'load', a pre-existing procedure. Target override will not be provided
73DEBUG: org.macports.unload registered provides 'unload', a pre-existing procedure. Target override will not be provided
74DEBUG: org.macports.distfiles registered provides 'distfiles', a pre-existing procedure. Target override will not be provided
75DEBUG: Using group file /opt/local/var/macports/sources/svn.macports.org/trunk/dports/_resources/port1.0/group/muniversal-1.0.tcl
76DEBUG: Reading variant descriptions from /opt/local/var/macports/sources/svn.macports.org/trunk/dports/_resources/port1.0/variant_descriptions.conf
77DEBUG: universal variant already exists, so not adding the default one
78DEBUG: Requested variant bash_completion is not provided by port ncurses.
79DEBUG: Executing variant universal provides universal
80DEBUG: No need to upgrade! ncurses 5.7_0 >= ncurses 5.7_0
81DEBUG: epoch: in tree: 0 installed: 0
82DEBUG: ncursesw 5.7_0 exists in the ports tree
83DEBUG: ncursesw 5.7_0 +universal is the latest installed
84DEBUG: ncursesw 5.7_0 +universal is active
85DEBUG: Merging existing variants '+universal' into variants
86DEBUG: new fully merged portvariants: universal + bash_completion +
87DEBUG: Changing to port directory: /opt/local/var/macports/sources/svn.macports.org/trunk/dports/devel/ncursesw
88DEBUG: OS darwin/10.3.0 (Mac OS X 10.6) arch i386
89DEBUG: org.macports.load registered provides 'load', a pre-existing procedure. Target override will not be provided
90DEBUG: org.macports.unload registered provides 'unload', a pre-existing procedure. Target override will not be provided
91DEBUG: org.macports.distfiles registered provides 'distfiles', a pre-existing procedure. Target override will not be provided
92DEBUG: Using group file /opt/local/var/macports/sources/svn.macports.org/trunk/dports/_resources/port1.0/group/muniversal-1.0.tcl
93DEBUG: Reading variant descriptions from /opt/local/var/macports/sources/svn.macports.org/trunk/dports/_resources/port1.0/variant_descriptions.conf
94DEBUG: universal variant already exists, so not adding the default one
95DEBUG: Requested variant bash_completion is not provided by port ncursesw.
96DEBUG: Executing variant universal provides universal
97DEBUG: No need to upgrade! ncursesw 5.7_0 >= ncursesw 5.7_0
98DEBUG: epoch: in tree: 0 installed: 0
99DEBUG: expat 2.0.1_0 exists in the ports tree
100DEBUG: expat 2.0.1_0 +universal is the latest installed
101DEBUG: expat 2.0.1_0 +universal is active
102DEBUG: Merging existing variants '+universal' into variants
103DEBUG: new fully merged portvariants: universal + bash_completion +
104DEBUG: Changing to port directory: /opt/local/var/macports/sources/svn.macports.org/trunk/dports/textproc/expat
105DEBUG: OS darwin/10.3.0 (Mac OS X 10.6) arch i386
106DEBUG: org.macports.load registered provides 'load', a pre-existing procedure. Target override will not be provided
107DEBUG: org.macports.unload registered provides 'unload', a pre-existing procedure. Target override will not be provided
108DEBUG: org.macports.distfiles registered provides 'distfiles', a pre-existing procedure. Target override will not be provided
109DEBUG: adding the default universal variant
110DEBUG: Reading variant descriptions from /opt/local/var/macports/sources/svn.macports.org/trunk/dports/_resources/port1.0/variant_descriptions.conf
111DEBUG: Requested variant bash_completion is not provided by port expat.
112DEBUG: Executing variant universal provides universal
113DEBUG: No need to upgrade! expat 2.0.1_0 >= expat 2.0.1_0
114DEBUG: epoch: in tree: 0 installed: 0
115DEBUG: zlib 1.2.5_0 exists in the ports tree
116DEBUG: zlib 1.2.5_0 +universal is the latest installed
117DEBUG: zlib 1.2.5_0 +universal is active
118DEBUG: Merging existing variants '+universal' into variants
119DEBUG: new fully merged portvariants: universal + bash_completion +
120DEBUG: Changing to port directory: /opt/local/var/macports/sources/svn.macports.org/trunk/dports/archivers/zlib
121DEBUG: OS darwin/10.3.0 (Mac OS X 10.6) arch i386
122DEBUG: org.macports.load registered provides 'load', a pre-existing procedure. Target override will not be provided
123DEBUG: org.macports.unload registered provides 'unload', a pre-existing procedure. Target override will not be provided
124DEBUG: org.macports.distfiles registered provides 'distfiles', a pre-existing procedure. Target override will not be provided
125DEBUG: adding the default universal variant
126DEBUG: Reading variant descriptions from /opt/local/var/macports/sources/svn.macports.org/trunk/dports/_resources/port1.0/variant_descriptions.conf
127DEBUG: Requested variant bash_completion is not provided by port zlib.
128DEBUG: Executing variant universal provides universal
129DEBUG: No need to upgrade! zlib 1.2.5_0 >= zlib 1.2.5_0
130DEBUG: epoch: in tree: 1 installed: 1
131DEBUG: openssl 0.9.8n_0 exists in the ports tree
132DEBUG: openssl 0.9.8n_0 +universal is the latest installed
133DEBUG: openssl 0.9.8n_0 +universal is active
134DEBUG: Merging existing variants '+universal' into variants
135DEBUG: new fully merged portvariants: universal + bash_completion +
136DEBUG: Changing to port directory: /opt/local/var/macports/sources/svn.macports.org/trunk/dports/devel/openssl
137DEBUG: OS darwin/10.3.0 (Mac OS X 10.6) arch i386
138DEBUG: org.macports.load registered provides 'load', a pre-existing procedure. Target override will not be provided
139DEBUG: org.macports.unload registered provides 'unload', a pre-existing procedure. Target override will not be provided
140DEBUG: org.macports.distfiles registered provides 'distfiles', a pre-existing procedure. Target override will not be provided
141DEBUG: Using group file /opt/local/var/macports/sources/svn.macports.org/trunk/dports/_resources/port1.0/group/muniversal-1.0.tcl
142DEBUG: Reading variant descriptions from /opt/local/var/macports/sources/svn.macports.org/trunk/dports/_resources/port1.0/variant_descriptions.conf
143DEBUG: universal variant already exists, so not adding the default one
144DEBUG: Requested variant bash_completion is not provided by port openssl.
145DEBUG: Executing variant universal provides universal
146DEBUG: No need to upgrade! openssl 0.9.8n_0 >= openssl 0.9.8n_0
147DEBUG: epoch: in tree: 0 installed: 0
148DEBUG: tk 8.5.8_0 exists in the ports tree
149DEBUG: tk 8.5.8_0  is the latest installed
150DEBUG: tk 8.5.8_0  is active
151DEBUG: Merging existing variants '' into variants
152DEBUG: new fully merged portvariants: bash_completion +
153DEBUG: Changing to port directory: /opt/local/var/macports/sources/svn.macports.org/trunk/dports/x11/tk
154DEBUG: OS darwin/10.3.0 (Mac OS X 10.6) arch i386
155DEBUG: org.macports.load registered provides 'load', a pre-existing procedure. Target override will not be provided
156DEBUG: org.macports.unload registered provides 'unload', a pre-existing procedure. Target override will not be provided
157DEBUG: org.macports.distfiles registered provides 'distfiles', a pre-existing procedure. Target override will not be provided
158DEBUG: Reading variant descriptions from /opt/local/var/macports/sources/svn.macports.org/trunk/dports/_resources/port1.0/variant_descriptions.conf
159DEBUG: adding the default universal variant
160DEBUG: Requested variant bash_completion is not provided by port tk.
161DEBUG: No need to upgrade! tk 8.5.8_0 >= tk 8.5.8_0
162DEBUG: epoch: in tree: 0 installed: 0
163DEBUG: tcl 8.5.8_0 exists in the ports tree
164DEBUG: tcl 8.5.8_0  is the latest installed
165DEBUG: tcl 8.5.8_0  is active
166DEBUG: Merging existing variants '' into variants
167DEBUG: new fully merged portvariants: bash_completion +
168DEBUG: Changing to port directory: /opt/local/var/macports/sources/svn.macports.org/trunk/dports/lang/tcl
169DEBUG: OS darwin/10.3.0 (Mac OS X 10.6) arch i386
170DEBUG: org.macports.load registered provides 'load', a pre-existing procedure. Target override will not be provided
171DEBUG: org.macports.unload registered provides 'unload', a pre-existing procedure. Target override will not be provided
172DEBUG: org.macports.distfiles registered provides 'distfiles', a pre-existing procedure. Target override will not be provided
173DEBUG: adding the default universal variant
174DEBUG: Reading variant descriptions from /opt/local/var/macports/sources/svn.macports.org/trunk/dports/_resources/port1.0/variant_descriptions.conf
175DEBUG: Requested variant bash_completion is not provided by port tcl.
176DEBUG: No need to upgrade! tcl 8.5.8_0 >= tcl 8.5.8_0
177DEBUG: epoch: in tree: 0 installed: 0
178DEBUG: Xft2 2.1.14_0 exists in the ports tree
179DEBUG: Xft2 2.1.14_0  is the latest installed
180DEBUG: Xft2 2.1.14_0 +universal is active
181DEBUG: Merging existing variants '+universal' into variants
182DEBUG: new fully merged portvariants: universal + bash_completion +
183DEBUG: Changing to port directory: /opt/local/var/macports/sources/svn.macports.org/trunk/dports/x11/Xft2
184DEBUG: OS darwin/10.3.0 (Mac OS X 10.6) arch i386
185DEBUG: org.macports.load registered provides 'load', a pre-existing procedure. Target override will not be provided
186DEBUG: org.macports.unload registered provides 'unload', a pre-existing procedure. Target override will not be provided
187DEBUG: org.macports.distfiles registered provides 'distfiles', a pre-existing procedure. Target override will not be provided
188DEBUG: adding the default universal variant
189DEBUG: Reading variant descriptions from /opt/local/var/macports/sources/svn.macports.org/trunk/dports/_resources/port1.0/variant_descriptions.conf
190DEBUG: Requested variant bash_completion is not provided by port Xft2.
191DEBUG: Executing variant universal provides universal
192DEBUG: No need to upgrade! Xft2 2.1.14_0 >= Xft2 2.1.14_0
193DEBUG: epoch: in tree: 0 installed: 0
194DEBUG: xrender 0.9.5_0 exists in the ports tree
195DEBUG: xrender 0.9.5_0 +universal is the latest installed
196DEBUG: xrender 0.9.5_0 +universal is active
197DEBUG: Merging existing variants '+universal' into variants
198DEBUG: new fully merged portvariants: universal + bash_completion +
199DEBUG: Changing to port directory: /opt/local/var/macports/sources/svn.macports.org/trunk/dports/x11/xrender
200DEBUG: OS darwin/10.3.0 (Mac OS X 10.6) arch i386
201DEBUG: org.macports.load registered provides 'load', a pre-existing procedure. Target override will not be provided
202DEBUG: org.macports.unload registered provides 'unload', a pre-existing procedure. Target override will not be provided
203DEBUG: org.macports.distfiles registered provides 'distfiles', a pre-existing procedure. Target override will not be provided
204DEBUG: adding the default universal variant
205DEBUG: Reading variant descriptions from /opt/local/var/macports/sources/svn.macports.org/trunk/dports/_resources/port1.0/variant_descriptions.conf
206DEBUG: Requested variant bash_completion is not provided by port xrender.
207DEBUG: Executing variant universal provides universal
208DEBUG: No need to upgrade! xrender 0.9.5_0 >= xrender 0.9.5_0
209DEBUG: epoch: in tree: 0 installed: 0
210DEBUG: xorg-libX11 1.3.3_0 exists in the ports tree
211DEBUG: xorg-libX11 1.3.3_0 +universal is the latest installed
212DEBUG: xorg-libX11 1.3.3_0 +universal is active
213DEBUG: Merging existing variants '+universal' into variants
214DEBUG: new fully merged portvariants: universal + bash_completion +
215DEBUG: Changing to port directory: /opt/local/var/macports/sources/svn.macports.org/trunk/dports/x11/xorg-libX11
216DEBUG: OS darwin/10.3.0 (Mac OS X 10.6) arch i386
217DEBUG: org.macports.load registered provides 'load', a pre-existing procedure. Target override will not be provided
218DEBUG: org.macports.unload registered provides 'unload', a pre-existing procedure. Target override will not be provided
219DEBUG: org.macports.distfiles registered provides 'distfiles', a pre-existing procedure. Target override will not be provided
220DEBUG: Using group file /opt/local/var/macports/sources/svn.macports.org/trunk/dports/_resources/port1.0/group/archcheck-1.0.tcl
221DEBUG: adding the default universal variant
222DEBUG: Reading variant descriptions from /opt/local/var/macports/sources/svn.macports.org/trunk/dports/_resources/port1.0/variant_descriptions.conf
223DEBUG: Requested variant bash_completion is not provided by port xorg-libX11.
224DEBUG: Executing variant universal provides universal
225DEBUG: No need to upgrade! xorg-libX11 1.3.3_0 >= xorg-libX11 1.3.3_0
226DEBUG: epoch: in tree: 0 installed: 0
227DEBUG: xorg-libXdmcp 1.0.3_0 exists in the ports tree
228DEBUG: xorg-libXdmcp 1.0.3_0 +universal is the latest installed
229DEBUG: xorg-libXdmcp 1.0.3_0 +universal is active
230DEBUG: Merging existing variants '+universal' into variants
231DEBUG: new fully merged portvariants: universal + bash_completion +
232DEBUG: Changing to port directory: /opt/local/var/macports/sources/svn.macports.org/trunk/dports/x11/xorg-libXdmcp
233DEBUG: OS darwin/10.3.0 (Mac OS X 10.6) arch i386
234DEBUG: org.macports.load registered provides 'load', a pre-existing procedure. Target override will not be provided
235DEBUG: org.macports.unload registered provides 'unload', a pre-existing procedure. Target override will not be provided
236DEBUG: org.macports.distfiles registered provides 'distfiles', a pre-existing procedure. Target override will not be provided
237DEBUG: adding the default universal variant
238DEBUG: Reading variant descriptions from /opt/local/var/macports/sources/svn.macports.org/trunk/dports/_resources/port1.0/variant_descriptions.conf
239DEBUG: Requested variant bash_completion is not provided by port xorg-libXdmcp.
240DEBUG: Executing variant universal provides universal
241DEBUG: No need to upgrade! xorg-libXdmcp 1.0.3_0 >= xorg-libXdmcp 1.0.3_0
242DEBUG: epoch: in tree: 0 installed: 0
243DEBUG: xorg-libXau 1.0.5_0 exists in the ports tree
244DEBUG: xorg-libXau 1.0.5_0 +universal is the latest installed
245DEBUG: xorg-libXau 1.0.5_0 +universal is active
246DEBUG: Merging existing variants '+universal' into variants
247DEBUG: new fully merged portvariants: universal + bash_completion +
248DEBUG: Changing to port directory: /opt/local/var/macports/sources/svn.macports.org/trunk/dports/x11/xorg-libXau
249DEBUG: OS darwin/10.3.0 (Mac OS X 10.6) arch i386
250DEBUG: org.macports.load registered provides 'load', a pre-existing procedure. Target override will not be provided
251DEBUG: org.macports.unload registered provides 'unload', a pre-existing procedure. Target override will not be provided
252DEBUG: org.macports.distfiles registered provides 'distfiles', a pre-existing procedure. Target override will not be provided
253DEBUG: adding the default universal variant
254DEBUG: Reading variant descriptions from /opt/local/var/macports/sources/svn.macports.org/trunk/dports/_resources/port1.0/variant_descriptions.conf
255DEBUG: Requested variant bash_completion is not provided by port xorg-libXau.
256DEBUG: Executing variant universal provides universal
257DEBUG: No need to upgrade! xorg-libXau 1.0.5_0 >= xorg-libXau 1.0.5_0
258DEBUG: epoch: in tree: 0 installed: 0
259DEBUG: xorg-xproto 7.0.16_0 exists in the ports tree
260DEBUG: xorg-xproto 7.0.16_0  is the latest installed
261DEBUG: xorg-xproto 7.0.16_0  is active
262DEBUG: Merging existing variants '' into variants
263DEBUG: new fully merged portvariants: bash_completion +
264DEBUG: Changing to port directory: /opt/local/var/macports/sources/svn.macports.org/trunk/dports/x11/xorg-xproto
265DEBUG: OS darwin/10.3.0 (Mac OS X 10.6) arch i386
266DEBUG: org.macports.load registered provides 'load', a pre-existing procedure. Target override will not be provided
267DEBUG: org.macports.unload registered provides 'unload', a pre-existing procedure. Target override will not be provided
268DEBUG: org.macports.distfiles registered provides 'distfiles', a pre-existing procedure. Target override will not be provided
269DEBUG: only one arch supported, so not adding the default universal variant
270DEBUG: Requested variant bash_completion is not provided by port xorg-xproto.
271DEBUG: No need to upgrade! xorg-xproto 7.0.16_0 >= xorg-xproto 7.0.16_0
272DEBUG: epoch: in tree: 0 installed: 0
273DEBUG: xorg-kbproto 1.0.4_0 exists in the ports tree
274DEBUG: xorg-kbproto 1.0.4_0  is the latest installed
275DEBUG: xorg-kbproto 1.0.4_0  is active
276DEBUG: Merging existing variants '' into variants
277DEBUG: new fully merged portvariants: bash_completion +
278DEBUG: Changing to port directory: /opt/local/var/macports/sources/svn.macports.org/trunk/dports/x11/xorg-kbproto
279DEBUG: OS darwin/10.3.0 (Mac OS X 10.6) arch i386
280DEBUG: org.macports.load registered provides 'load', a pre-existing procedure. Target override will not be provided
281DEBUG: org.macports.unload registered provides 'unload', a pre-existing procedure. Target override will not be provided
282DEBUG: org.macports.distfiles registered provides 'distfiles', a pre-existing procedure. Target override will not be provided
283DEBUG: only one arch supported, so not adding the default universal variant
284DEBUG: Requested variant bash_completion is not provided by port xorg-kbproto.
285DEBUG: No need to upgrade! xorg-kbproto 1.0.4_0 >= xorg-kbproto 1.0.4_0
286DEBUG: epoch: in tree: 0 installed: 0
287DEBUG: xorg-renderproto 0.11_0 exists in the ports tree
288DEBUG: xorg-renderproto 0.11_0  is the latest installed
289DEBUG: xorg-renderproto 0.11_0  is active
290DEBUG: Merging existing variants '' into variants
291DEBUG: new fully merged portvariants: bash_completion +
292DEBUG: Changing to port directory: /opt/local/var/macports/sources/svn.macports.org/trunk/dports/x11/xorg-renderproto
293DEBUG: OS darwin/10.3.0 (Mac OS X 10.6) arch i386
294DEBUG: org.macports.load registered provides 'load', a pre-existing procedure. Target override will not be provided
295DEBUG: org.macports.unload registered provides 'unload', a pre-existing procedure. Target override will not be provided
296DEBUG: org.macports.distfiles registered provides 'distfiles', a pre-existing procedure. Target override will not be provided
297DEBUG: only one arch supported, so not adding the default universal variant
298DEBUG: Requested variant bash_completion is not provided by port xorg-renderproto.
299DEBUG: No need to upgrade! xorg-renderproto 0.11_0 >= xorg-renderproto 0.11_0
300DEBUG: epoch: in tree: 0 installed: 0
301DEBUG: freetype 2.3.12_0 exists in the ports tree
302DEBUG: freetype 2.3.12_0 +universal is the latest installed
303DEBUG: freetype 2.3.12_0 +universal is active
304DEBUG: Merging existing variants '+universal' into variants
305DEBUG: new fully merged portvariants: universal + bash_completion +
306DEBUG: Changing to port directory: /opt/local/var/macports/sources/svn.macports.org/trunk/dports/print/freetype
307DEBUG: OS darwin/10.3.0 (Mac OS X 10.6) arch i386
308DEBUG: org.macports.load registered provides 'load', a pre-existing procedure. Target override will not be provided
309DEBUG: org.macports.unload registered provides 'unload', a pre-existing procedure. Target override will not be provided
310DEBUG: org.macports.distfiles registered provides 'distfiles', a pre-existing procedure. Target override will not be provided
311DEBUG: Using group file /opt/local/var/macports/sources/svn.macports.org/trunk/dports/_resources/port1.0/group/muniversal-1.0.tcl
312DEBUG: Reading variant descriptions from /opt/local/var/macports/sources/svn.macports.org/trunk/dports/_resources/port1.0/variant_descriptions.conf
313DEBUG: Using group file /opt/local/var/macports/sources/svn.macports.org/trunk/dports/_resources/port1.0/group/archcheck-1.0.tcl
314DEBUG: universal variant already exists, so not adding the default one
315DEBUG: Requested variant bash_completion is not provided by port freetype.
316DEBUG: Executing variant universal provides universal
317DEBUG: No need to upgrade! freetype 2.3.12_0 >= freetype 2.3.12_0
318DEBUG: epoch: in tree: 0 installed: 0
319DEBUG: fontconfig 2.8.0_0 exists in the ports tree
320DEBUG: fontconfig 2.8.0_0 +universal is the latest installed
321DEBUG: fontconfig 2.8.0_0 +universal is active
322DEBUG: Merging existing variants '+universal' into variants
323DEBUG: new fully merged portvariants: universal + bash_completion +
324DEBUG: Changing to port directory: /opt/local/var/macports/sources/svn.macports.org/trunk/dports/graphics/fontconfig
325DEBUG: OS darwin/10.3.0 (Mac OS X 10.6) arch i386
326DEBUG: org.macports.load registered provides 'load', a pre-existing procedure. Target override will not be provided
327DEBUG: org.macports.unload registered provides 'unload', a pre-existing procedure. Target override will not be provided
328DEBUG: org.macports.distfiles registered provides 'distfiles', a pre-existing procedure. Target override will not be provided
329DEBUG: Using group file /opt/local/var/macports/sources/svn.macports.org/trunk/dports/_resources/port1.0/group/muniversal-1.0.tcl
330DEBUG: Reading variant descriptions from /opt/local/var/macports/sources/svn.macports.org/trunk/dports/_resources/port1.0/variant_descriptions.conf
331DEBUG: Using group file /opt/local/var/macports/sources/svn.macports.org/trunk/dports/_resources/port1.0/group/archcheck-1.0.tcl
332DEBUG: universal variant already exists, so not adding the default one
333DEBUG: Requested variant bash_completion is not provided by port fontconfig.
334DEBUG: Executing variant universal provides universal
335DEBUG: No need to upgrade! fontconfig 2.8.0_0 >= fontconfig 2.8.0_0
336DEBUG: epoch: in tree: 0 installed: 0
337DEBUG: xorg-libXScrnSaver 1.2.0_0 exists in the ports tree
338DEBUG: xorg-libXScrnSaver 1.2.0_0  is the latest installed
339DEBUG: xorg-libXScrnSaver 1.2.0_0  is active
340DEBUG: Merging existing variants '' into variants
341DEBUG: new fully merged portvariants: bash_completion +
342DEBUG: Changing to port directory: /opt/local/var/macports/sources/svn.macports.org/trunk/dports/x11/xorg-libXScrnSaver
343DEBUG: OS darwin/10.3.0 (Mac OS X 10.6) arch i386
344DEBUG: org.macports.load registered provides 'load', a pre-existing procedure. Target override will not be provided
345DEBUG: org.macports.unload registered provides 'unload', a pre-existing procedure. Target override will not be provided
346DEBUG: org.macports.distfiles registered provides 'distfiles', a pre-existing procedure. Target override will not be provided
347DEBUG: adding the default universal variant
348DEBUG: Reading variant descriptions from /opt/local/var/macports/sources/svn.macports.org/trunk/dports/_resources/port1.0/variant_descriptions.conf
349DEBUG: Requested variant bash_completion is not provided by port xorg-libXScrnSaver.
350DEBUG: No need to upgrade! xorg-libXScrnSaver 1.2.0_0 >= xorg-libXScrnSaver 1.2.0_0
351DEBUG: epoch: in tree: 0 installed: 0
352DEBUG: xorg-libXext 1.1.1_0 exists in the ports tree
353DEBUG: xorg-libXext 1.1.1_0 +universal is the latest installed
354DEBUG: xorg-libXext 1.1.1_0 +universal is active
355DEBUG: Merging existing variants '+universal' into variants
356DEBUG: new fully merged portvariants: universal + bash_completion +
357DEBUG: Changing to port directory: /opt/local/var/macports/sources/svn.macports.org/trunk/dports/x11/xorg-libXext
358DEBUG: OS darwin/10.3.0 (Mac OS X 10.6) arch i386
359DEBUG: org.macports.load registered provides 'load', a pre-existing procedure. Target override will not be provided
360DEBUG: org.macports.unload registered provides 'unload', a pre-existing procedure. Target override will not be provided
361DEBUG: org.macports.distfiles registered provides 'distfiles', a pre-existing procedure. Target override will not be provided
362DEBUG: adding the default universal variant
363DEBUG: Reading variant descriptions from /opt/local/var/macports/sources/svn.macports.org/trunk/dports/_resources/port1.0/variant_descriptions.conf
364DEBUG: Requested variant bash_completion is not provided by port xorg-libXext.
365DEBUG: Executing variant universal provides universal
366DEBUG: No need to upgrade! xorg-libXext 1.1.1_0 >= xorg-libXext 1.1.1_0
367DEBUG: epoch: in tree: 0 installed: 0
368DEBUG: xorg-xextproto 7.1.1_0 exists in the ports tree
369DEBUG: xorg-xextproto 7.1.1_0  is the latest installed
370DEBUG: xorg-xextproto 7.1.1_0  is active
371DEBUG: Merging existing variants '' into variants
372DEBUG: new fully merged portvariants: bash_completion +
373DEBUG: Changing to port directory: /opt/local/var/macports/sources/svn.macports.org/trunk/dports/x11/xorg-xextproto
374DEBUG: OS darwin/10.3.0 (Mac OS X 10.6) arch i386
375DEBUG: org.macports.load registered provides 'load', a pre-existing procedure. Target override will not be provided
376DEBUG: org.macports.unload registered provides 'unload', a pre-existing procedure. Target override will not be provided
377DEBUG: org.macports.distfiles registered provides 'distfiles', a pre-existing procedure. Target override will not be provided
378DEBUG: only one arch supported, so not adding the default universal variant
379DEBUG: Requested variant bash_completion is not provided by port xorg-xextproto.
380DEBUG: No need to upgrade! xorg-xextproto 7.1.1_0 >= xorg-xextproto 7.1.1_0
381DEBUG: epoch: in tree: 0 installed: 0
382DEBUG: xorg-scrnsaverproto 1.2.0_0 exists in the ports tree
383DEBUG: xorg-scrnsaverproto 1.2.0_0  is the latest installed
384DEBUG: xorg-scrnsaverproto 1.2.0_0  is active
385DEBUG: Merging existing variants '' into variants
386DEBUG: new fully merged portvariants: bash_completion +
387DEBUG: Changing to port directory: /opt/local/var/macports/sources/svn.macports.org/trunk/dports/x11/xorg-scrnsaverproto
388DEBUG: OS darwin/10.3.0 (Mac OS X 10.6) arch i386
389DEBUG: org.macports.load registered provides 'load', a pre-existing procedure. Target override will not be provided
390DEBUG: org.macports.unload registered provides 'unload', a pre-existing procedure. Target override will not be provided
391DEBUG: org.macports.distfiles registered provides 'distfiles', a pre-existing procedure. Target override will not be provided
392DEBUG: only one arch supported, so not adding the default universal variant
393DEBUG: Requested variant bash_completion is not provided by port xorg-scrnsaverproto.
394DEBUG: No need to upgrade! xorg-scrnsaverproto 1.2.0_0 >= xorg-scrnsaverproto 1.2.0_0
395DEBUG: epoch: in tree: 0 installed: 0
396DEBUG: sqlite3 3.6.23.1_0 exists in the ports tree
397DEBUG: sqlite3 3.6.23.1_0 +universal is the latest installed
398DEBUG: sqlite3 3.6.23.1_0 +universal is active
399DEBUG: Merging existing variants '+universal' into variants
400DEBUG: new fully merged portvariants: universal + bash_completion +
401DEBUG: Changing to port directory: /opt/local/var/macports/sources/svn.macports.org/trunk/dports/databases/sqlite3
402DEBUG: OS darwin/10.3.0 (Mac OS X 10.6) arch i386
403DEBUG: org.macports.load registered provides 'load', a pre-existing procedure. Target override will not be provided
404DEBUG: org.macports.unload registered provides 'unload', a pre-existing procedure. Target override will not be provided
405DEBUG: org.macports.distfiles registered provides 'distfiles', a pre-existing procedure. Target override will not be provided
406DEBUG: adding the default universal variant
407DEBUG: Reading variant descriptions from /opt/local/var/macports/sources/svn.macports.org/trunk/dports/_resources/port1.0/variant_descriptions.conf
408DEBUG: Requested variant bash_completion is not provided by port sqlite3.
409DEBUG: Executing variant universal provides universal
410DEBUG: No need to upgrade! sqlite3 3.6.23.1_0 >= sqlite3 3.6.23.1_0
411DEBUG: epoch: in tree: 0 installed: 0
412DEBUG: readline 6.1.000_1 exists in the ports tree
413DEBUG: readline 6.1.000_1 +universal is the latest installed
414DEBUG: readline 6.1.000_1 +universal is active
415DEBUG: Merging existing variants '+universal' into variants
416DEBUG: new fully merged portvariants: universal + bash_completion +
417DEBUG: Changing to port directory: /opt/local/var/macports/sources/svn.macports.org/trunk/dports/devel/readline
418DEBUG: OS darwin/10.3.0 (Mac OS X 10.6) arch i386
419DEBUG: org.macports.load registered provides 'load', a pre-existing procedure. Target override will not be provided
420DEBUG: org.macports.unload registered provides 'unload', a pre-existing procedure. Target override will not be provided
421DEBUG: org.macports.distfiles registered provides 'distfiles', a pre-existing procedure. Target override will not be provided
422DEBUG: Using group file /opt/local/var/macports/sources/svn.macports.org/trunk/dports/_resources/port1.0/group/muniversal-1.0.tcl
423DEBUG: Reading variant descriptions from /opt/local/var/macports/sources/svn.macports.org/trunk/dports/_resources/port1.0/variant_descriptions.conf
424DEBUG: universal variant already exists, so not adding the default one
425DEBUG: Requested variant bash_completion is not provided by port readline.
426DEBUG: Executing variant universal provides universal
427DEBUG: No need to upgrade! readline 6.1.000_1 >= readline 6.1.000_1
428DEBUG: epoch: in tree: 0 installed: 0
429DEBUG: db46 4.6.21_6 exists in the ports tree
430DEBUG: db46 4.6.21_6  is the latest installed
431DEBUG: db46 4.6.21_6  is active
432DEBUG: Merging existing variants '' into variants
433DEBUG: new fully merged portvariants: bash_completion +
434DEBUG: Changing to port directory: /opt/local/var/macports/sources/svn.macports.org/trunk/dports/databases/db46
435DEBUG: OS darwin/10.3.0 (Mac OS X 10.6) arch i386
436DEBUG: org.macports.load registered provides 'load', a pre-existing procedure. Target override will not be provided
437DEBUG: org.macports.unload registered provides 'unload', a pre-existing procedure. Target override will not be provided
438DEBUG: org.macports.distfiles registered provides 'distfiles', a pre-existing procedure. Target override will not be provided
439DEBUG: Using group file /opt/local/var/macports/sources/svn.macports.org/trunk/dports/_resources/port1.0/group/muniversal-1.0.tcl
440DEBUG: Reading variant descriptions from /opt/local/var/macports/sources/svn.macports.org/trunk/dports/_resources/port1.0/variant_descriptions.conf
441DEBUG: universal variant already exists, so not adding the default one
442DEBUG: Requested variant bash_completion is not provided by port db46.
443DEBUG: No need to upgrade! db46 4.6.21_6 >= db46 4.6.21_6
444DEBUG: epoch: in tree: 0 installed: 0
445DEBUG: gdbm 1.8.3_2 exists in the ports tree
446DEBUG: gdbm 1.8.3_2  is the latest installed
447DEBUG: gdbm 1.8.3_2  is active
448DEBUG: Merging existing variants '' into variants
449DEBUG: new fully merged portvariants: bash_completion +
450DEBUG: Changing to port directory: /opt/local/var/macports/sources/svn.macports.org/trunk/dports/databases/gdbm
451DEBUG: OS darwin/10.3.0 (Mac OS X 10.6) arch i386
452DEBUG: org.macports.load registered provides 'load', a pre-existing procedure. Target override will not be provided
453DEBUG: org.macports.unload registered provides 'unload', a pre-existing procedure. Target override will not be provided
454DEBUG: org.macports.distfiles registered provides 'distfiles', a pre-existing procedure. Target override will not be provided
455DEBUG: Using group file /opt/local/var/macports/sources/svn.macports.org/trunk/dports/_resources/port1.0/group/muniversal-1.0.tcl
456DEBUG: Reading variant descriptions from /opt/local/var/macports/sources/svn.macports.org/trunk/dports/_resources/port1.0/variant_descriptions.conf
457DEBUG: universal variant already exists, so not adding the default one
458DEBUG: Requested variant bash_completion is not provided by port gdbm.
459DEBUG: No need to upgrade! gdbm 1.8.3_2 >= gdbm 1.8.3_2
460DEBUG: epoch: in tree: 0 installed: 0
461DEBUG: bzip2 1.0.5_3 exists in the ports tree
462DEBUG: bzip2 1.0.5_3  is the latest installed
463DEBUG: bzip2 1.0.5_3  is active
464DEBUG: Merging existing variants '' into variants
465DEBUG: new fully merged portvariants: bash_completion +
466DEBUG: Changing to port directory: /opt/local/var/macports/sources/svn.macports.org/trunk/dports/archivers/bzip2
467DEBUG: OS darwin/10.3.0 (Mac OS X 10.6) arch i386
468DEBUG: org.macports.load registered provides 'load', a pre-existing procedure. Target override will not be provided
469DEBUG: org.macports.unload registered provides 'unload', a pre-existing procedure. Target override will not be provided
470DEBUG: org.macports.distfiles registered provides 'distfiles', a pre-existing procedure. Target override will not be provided
471DEBUG: Reading variant descriptions from /opt/local/var/macports/sources/svn.macports.org/trunk/dports/_resources/port1.0/variant_descriptions.conf
472DEBUG: universal variant already exists, so not adding the default one
473DEBUG: Requested variant bash_completion is not provided by port bzip2.
474DEBUG: No need to upgrade! bzip2 1.0.5_3 >= bzip2 1.0.5_3
475DEBUG: epoch: in tree: 0 installed: 0
476DEBUG: fftw-3 3.2.2_0 exists in the ports tree
477DEBUG: fftw-3 3.2.2_0  is the latest installed
478DEBUG: fftw-3 3.2.2_0  is active
479DEBUG: Merging existing variants '' into variants
480DEBUG: new fully merged portvariants: bash_completion +
481DEBUG: Changing to port directory: /opt/local/var/macports/sources/svn.macports.org/trunk/dports/math/fftw-3
482DEBUG: OS darwin/10.3.0 (Mac OS X 10.6) arch i386
483DEBUG: org.macports.load registered provides 'load', a pre-existing procedure. Target override will not be provided
484DEBUG: org.macports.unload registered provides 'unload', a pre-existing procedure. Target override will not be provided
485DEBUG: org.macports.distfiles registered provides 'distfiles', a pre-existing procedure. Target override will not be provided
486DEBUG: Using group file /opt/local/var/macports/sources/svn.macports.org/trunk/dports/_resources/port1.0/group/muniversal-1.0.tcl
487DEBUG: Reading variant descriptions from /opt/local/var/macports/sources/svn.macports.org/trunk/dports/_resources/port1.0/variant_descriptions.conf
488DEBUG: universal variant already exists, so not adding the default one
489DEBUG: Requested variant bash_completion is not provided by port fftw-3.
490DEBUG: No need to upgrade! fftw-3 3.2.2_0 >= fftw-3 3.2.2_0
491DEBUG: epoch: in tree: 0 installed: 0
492DEBUG: py26-nose 0.11.1_0 exists in the ports tree
493DEBUG: py26-nose 0.11.1_0  is the latest installed
494DEBUG: py26-nose 0.11.1_0  is active
495DEBUG: Merging existing variants '' into variants
496DEBUG: new fully merged portvariants: bash_completion +
497DEBUG: Changing to port directory: /opt/local/var/macports/sources/svn.macports.org/trunk/dports/python/py26-nose
498DEBUG: OS darwin/10.3.0 (Mac OS X 10.6) arch i386
499DEBUG: org.macports.load registered provides 'load', a pre-existing procedure. Target override will not be provided
500DEBUG: org.macports.unload registered provides 'unload', a pre-existing procedure. Target override will not be provided
501DEBUG: org.macports.distfiles registered provides 'distfiles', a pre-existing procedure. Target override will not be provided
502DEBUG: Using group file /opt/local/var/macports/sources/svn.macports.org/trunk/dports/_resources/port1.0/group/python26-1.0.tcl
503DEBUG: only one arch supported, so not adding the default universal variant
504DEBUG: Requested variant bash_completion is not provided by port py26-nose.
505DEBUG: No need to upgrade! py26-nose 0.11.1_0 >= py26-nose 0.11.1_0
506DEBUG: epoch: in tree: 0 installed: 0
507DEBUG: py26-distribute 0.6.12_0 exists in the ports tree
508DEBUG: py26-distribute 0.6.12_0  is the latest installed
509DEBUG: py26-distribute 0.6.12_0  is active
510DEBUG: Merging existing variants '' into variants
511DEBUG: new fully merged portvariants: bash_completion +
512DEBUG: Changing to port directory: /opt/local/var/macports/sources/svn.macports.org/trunk/dports/python/py26-distribute
513DEBUG: OS darwin/10.3.0 (Mac OS X 10.6) arch i386
514DEBUG: org.macports.load registered provides 'load', a pre-existing procedure. Target override will not be provided
515DEBUG: org.macports.unload registered provides 'unload', a pre-existing procedure. Target override will not be provided
516DEBUG: org.macports.distfiles registered provides 'distfiles', a pre-existing procedure. Target override will not be provided
517DEBUG: Using group file /opt/local/var/macports/sources/svn.macports.org/trunk/dports/_resources/port1.0/group/python26-1.0.tcl
518DEBUG: adding the default universal variant
519DEBUG: Reading variant descriptions from /opt/local/var/macports/sources/svn.macports.org/trunk/dports/_resources/port1.0/variant_descriptions.conf
520DEBUG: Requested variant bash_completion is not provided by port py26-distribute.
521DEBUG: No need to upgrade! py26-distribute 0.6.12_0 >= py26-distribute 0.6.12_0
522DEBUG: epoch: in tree: 0 installed: 0
523DEBUG: atlas 3.8.3_1 exists in the ports tree
524DEBUG: atlas 3.8.3_1  is the latest installed
525DEBUG: atlas 3.8.3_1  is active
526DEBUG: Merging existing variants '' into variants
527DEBUG: new fully merged portvariants: bash_completion +
528DEBUG: Changing to port directory: /opt/local/var/macports/sources/svn.macports.org/trunk/dports/math/atlas
529DEBUG: OS darwin/10.3.0 (Mac OS X 10.6) arch i386
530DEBUG: org.macports.load registered provides 'load', a pre-existing procedure. Target override will not be provided
531DEBUG: org.macports.unload registered provides 'unload', a pre-existing procedure. Target override will not be provided
532DEBUG: org.macports.distfiles registered provides 'distfiles', a pre-existing procedure. Target override will not be provided
533DEBUG: 'universal_variant no' specified, so not adding the default universal variant
534DEBUG: Requested variant bash_completion is not provided by port atlas.
535DEBUG: No need to upgrade! atlas 3.8.3_1 >= atlas 3.8.3_1
536DEBUG: epoch: in tree: 0 installed: 0
537DEBUG: gcc43 4.3.4_0 exists in the ports tree
538DEBUG: gcc43 4.3.4_0  is the latest installed
539DEBUG: gcc43 4.3.4_0  is active
540DEBUG: Merging existing variants '' into variants
541DEBUG: new fully merged portvariants: bash_completion +
542DEBUG: Changing to port directory: /opt/local/var/macports/sources/svn.macports.org/trunk/dports/lang/gcc43
543DEBUG: OS darwin/10.3.0 (Mac OS X 10.6) arch i386
544DEBUG: org.macports.load registered provides 'load', a pre-existing procedure. Target override will not be provided
545DEBUG: org.macports.unload registered provides 'unload', a pre-existing procedure. Target override will not be provided
546DEBUG: org.macports.distfiles registered provides 'distfiles', a pre-existing procedure. Target override will not be provided
547DEBUG: 'universal_variant no' specified, so not adding the default universal variant
548DEBUG: Requested variant bash_completion is not provided by port gcc43.
549DEBUG: No need to upgrade! gcc43 4.3.4_0 >= gcc43 4.3.4_0
550DEBUG: epoch: in tree: 0 installed: 0
551DEBUG: gmp 5.0.1_0 exists in the ports tree
552DEBUG: gmp 5.0.1_0  is the latest installed
553DEBUG: gmp 5.0.1_0  is active
554DEBUG: Merging existing variants '' into variants
555DEBUG: new fully merged portvariants: bash_completion +
556DEBUG: Changing to port directory: /opt/local/var/macports/sources/svn.macports.org/trunk/dports/devel/gmp
557DEBUG: OS darwin/10.3.0 (Mac OS X 10.6) arch i386
558DEBUG: org.macports.load registered provides 'load', a pre-existing procedure. Target override will not be provided
559DEBUG: org.macports.unload registered provides 'unload', a pre-existing procedure. Target override will not be provided
560DEBUG: org.macports.distfiles registered provides 'distfiles', a pre-existing procedure. Target override will not be provided
561DEBUG: Using group file /opt/local/var/macports/sources/svn.macports.org/trunk/dports/_resources/port1.0/group/muniversal-1.0.tcl
562DEBUG: Reading variant descriptions from /opt/local/var/macports/sources/svn.macports.org/trunk/dports/_resources/port1.0/variant_descriptions.conf
563DEBUG: universal variant already exists, so not adding the default one
564DEBUG: Requested variant bash_completion is not provided by port gmp.
565DEBUG: No need to upgrade! gmp 5.0.1_0 >= gmp 5.0.1_0
566DEBUG: epoch: in tree: 0 installed: 0
567DEBUG: mpfr 2.4.2-p1_0 exists in the ports tree
568DEBUG: mpfr 2.4.2-p1_0  is the latest installed
569DEBUG: mpfr 2.4.2-p1_0  is active
570DEBUG: Merging existing variants '' into variants
571DEBUG: new fully merged portvariants: bash_completion +
572DEBUG: Changing to port directory: /opt/local/var/macports/sources/svn.macports.org/trunk/dports/devel/mpfr
573DEBUG: OS darwin/10.3.0 (Mac OS X 10.6) arch i386
574DEBUG: org.macports.load registered provides 'load', a pre-existing procedure. Target override will not be provided
575DEBUG: org.macports.unload registered provides 'unload', a pre-existing procedure. Target override will not be provided
576DEBUG: org.macports.distfiles registered provides 'distfiles', a pre-existing procedure. Target override will not be provided
577DEBUG: Using group file /opt/local/var/macports/sources/svn.macports.org/trunk/dports/_resources/port1.0/group/muniversal-1.0.tcl
578DEBUG: Reading variant descriptions from /opt/local/var/macports/sources/svn.macports.org/trunk/dports/_resources/port1.0/variant_descriptions.conf
579DEBUG: universal variant already exists, so not adding the default one
580DEBUG: Requested variant bash_completion is not provided by port mpfr.
581DEBUG: No need to upgrade! mpfr 2.4.2-p1_0 >= mpfr 2.4.2-p1_0
582DEBUG: epoch: in tree: 0 installed: 0
583DEBUG: gzip 1.4_0 exists in the ports tree
584DEBUG: gzip 1.4_0  is the latest installed
585DEBUG: gzip 1.4_0  is active
586DEBUG: Merging existing variants '' into variants
587DEBUG: new fully merged portvariants: bash_completion +
588DEBUG: Changing to port directory: /opt/local/var/macports/sources/svn.macports.org/trunk/dports/archivers/gzip
589DEBUG: OS darwin/10.3.0 (Mac OS X 10.6) arch i386
590DEBUG: org.macports.load registered provides 'load', a pre-existing procedure. Target override will not be provided
591DEBUG: org.macports.unload registered provides 'unload', a pre-existing procedure. Target override will not be provided
592DEBUG: org.macports.distfiles registered provides 'distfiles', a pre-existing procedure. Target override will not be provided
593DEBUG: adding the default universal variant
594DEBUG: Reading variant descriptions from /opt/local/var/macports/sources/svn.macports.org/trunk/dports/_resources/port1.0/variant_descriptions.conf
595DEBUG: Requested variant bash_completion is not provided by port gzip.
596DEBUG: No need to upgrade! gzip 1.4_0 >= gzip 1.4_0
597--->  Computing dependencies for py26-numpy
598DEBUG: Searching for dependency: python26
599DEBUG: Found Dependency: receipt exists for python26
600DEBUG: Searching for dependency: fftw-3
601DEBUG: Found Dependency: receipt exists for fftw-3
602DEBUG: Searching for dependency: py26-nose
603DEBUG: Found Dependency: receipt exists for py26-nose
604DEBUG: Searching for dependency: atlas
605DEBUG: Found Dependency: receipt exists for atlas
606DEBUG: Searching for dependency: gcc43
607DEBUG: Found Dependency: receipt exists for gcc43
608DEBUG: Executing org.macports.main (py26-numpy)
609--->  Fetching py26-numpy
610DEBUG: fetch phase started at Tue May 18 08:46:40 CEST 2010
611DEBUG: Executing org.macports.fetch (py26-numpy)
612--->  Verifying checksum(s) for py26-numpy
613DEBUG: checksum phase started at Tue May 18 08:46:40 CEST 2010
614DEBUG: Executing org.macports.checksum (py26-numpy)
615--->  Checksumming numpy-1.4.1.tar.gz
616DEBUG: Correct (md5) checksum for numpy-1.4.1.tar.gz
617DEBUG: Correct (sha1) checksum for numpy-1.4.1.tar.gz
618DEBUG: Correct (rmd160) checksum for numpy-1.4.1.tar.gz
619--->  Extracting py26-numpy
620DEBUG: extract phase started at Tue May 18 08:46:40 CEST 2010
621DEBUG: Executing org.macports.extract (py26-numpy)
622--->  Extracting numpy-1.4.1.tar.gz
623DEBUG: setting option extract.args to /opt/local/var/macports/distfiles/python/numpy-1.4.1.tar.gz
624DEBUG: Environment: CPATH='/opt/local/include' CC_PRINT_OPTIONS_FILE='/opt/local/var/macports/build/_opt_local_var_macports_sources_svn.macports.org_trunk_dports_python_py26-numpy/work/.CC_PRINT_OPTIONS' LIBRARY_PATH='/opt/local/lib' CC_PRINT_OPTIONS='YES' MACOSX_DEPLOYMENT_TARGET='10.6'
625DEBUG: Assembled command: 'cd "/opt/local/var/macports/build/_opt_local_var_macports_sources_svn.macports.org_trunk_dports_python_py26-numpy/work" && /usr/bin/gzip -dc /opt/local/var/macports/distfiles/python/numpy-1.4.1.tar.gz | /usr/bin/gnutar --no-same-owner -xf -'
626DEBUG: patch phase started at Tue May 18 08:46:41 CEST 2010
627DEBUG: Executing org.macports.patch (py26-numpy)
628--->  Applying patches to py26-numpy
629--->  Applying /opt/local/var/macports/sources/svn.macports.org/trunk/dports/python/py26-numpy/files/patch-f2py_setup.py.diff
630DEBUG: Environment: CPATH='/opt/local/include' CC_PRINT_OPTIONS_FILE='/opt/local/var/macports/build/_opt_local_var_macports_sources_svn.macports.org_trunk_dports_python_py26-numpy/work/.CC_PRINT_OPTIONS' LIBRARY_PATH='/opt/local/lib' CC_PRINT_OPTIONS='YES' MACOSX_DEPLOYMENT_TARGET='10.6'
631DEBUG: Assembled command: 'cd "/opt/local/var/macports/build/_opt_local_var_macports_sources_svn.macports.org_trunk_dports_python_py26-numpy/work/numpy-1.4.1" && /usr/bin/patch -p0'
632patching file numpy/f2py/setup.py
633Hunk #1 succeeded at 50 (offset -2 lines).
634Hunk #2 succeeded at 74 (offset -4 lines).
635--->  Applying /opt/local/var/macports/sources/svn.macports.org/trunk/dports/python/py26-numpy/files/patch-system_info.py.diff
636DEBUG: Environment: CPATH='/opt/local/include' CC_PRINT_OPTIONS_FILE='/opt/local/var/macports/build/_opt_local_var_macports_sources_svn.macports.org_trunk_dports_python_py26-numpy/work/.CC_PRINT_OPTIONS' LIBRARY_PATH='/opt/local/lib' CC_PRINT_OPTIONS='YES' MACOSX_DEPLOYMENT_TARGET='10.6'
637DEBUG: Assembled command: 'cd "/opt/local/var/macports/build/_opt_local_var_macports_sources_svn.macports.org_trunk_dports_python_py26-numpy/work/numpy-1.4.1" && /usr/bin/patch -p0'
638patching file numpy/distutils/system_info.py
639--->  Applying /opt/local/var/macports/sources/svn.macports.org/trunk/dports/python/py26-numpy/files/patch-fcompiler_g95.diff
640DEBUG: Environment: CPATH='/opt/local/include' CC_PRINT_OPTIONS_FILE='/opt/local/var/macports/build/_opt_local_var_macports_sources_svn.macports.org_trunk_dports_python_py26-numpy/work/.CC_PRINT_OPTIONS' LIBRARY_PATH='/opt/local/lib' CC_PRINT_OPTIONS='YES' MACOSX_DEPLOYMENT_TARGET='10.6'
641DEBUG: Assembled command: 'cd "/opt/local/var/macports/build/_opt_local_var_macports_sources_svn.macports.org_trunk_dports_python_py26-numpy/work/numpy-1.4.1" && /usr/bin/patch -p0'
642patching file numpy/distutils/fcompiler/__init__.py
643DEBUG: Executing proc-post-org.macports.patch-patch-0
644--->  Configuring py26-numpy
645DEBUG: Using compiler 'MacPorts gcc 4.3'
646DEBUG: configure phase started at Tue May 18 08:46:41 CEST 2010
647DEBUG: Executing org.macports.configure (py26-numpy)
648--->  Building py26-numpy
649DEBUG: build phase started at Tue May 18 08:46:41 CEST 2010
650DEBUG: Executing proc-pre-org.macports.build-build-0
651DEBUG: Executing org.macports.build (py26-numpy)
652DEBUG: Environment: CPATH='/opt/local/include' CFLAGS='-m64' CXXFLAGS='-m64' LIBRARY_PATH='/opt/local/lib' MACOSX_DEPLOYMENT_TARGET='10.6' CXX='/opt/local/bin/g++-mp-4.3' CC_PRINT_OPTIONS_FILE='/opt/local/var/macports/build/_opt_local_var_macports_sources_svn.macports.org_trunk_dports_python_py26-numpy/work/.CC_PRINT_OPTIONS' LAPACK='/opt/local/lib' F90FLAGS='-m64' LDFLAGS='' FCFLAGS='-m64' BLAS='/opt/local/lib' OBJCFLAGS='-m64' FFLAGS='-m64' CC_PRINT_OPTIONS='YES' ATLAS='/opt/local/lib' CC='/opt/local/bin/gcc-mp-4.3'
653DEBUG: Assembled command: 'cd "/opt/local/var/macports/build/_opt_local_var_macports_sources_svn.macports.org_trunk_dports_python_py26-numpy/work/numpy-1.4.1" && /opt/local/Library/Frameworks/Python.framework/Versions/2.6/bin/python2.6 setup.py --no-user-cfg build'
654Running from numpy source directory.
655non-existing path in 'numpy/distutils': 'site.cfg'
656F2PY Version 2
657blas_opt_info:
658blas_mkl_info:
659  libraries mkl,vml,guide not found in /opt/local/Library/Frameworks/Python.framework/Versions/2.6/lib
660  libraries mkl,vml,guide not found in /usr/local/lib
661  libraries mkl,vml,guide not found in /usr/lib
662  libraries mkl,vml,guide not found in /opt/local/lib
663  NOT AVAILABLE
664
665atlas_blas_threads_info:
666Setting PTATLAS=ATLAS
667Setting PTATLAS=ATLAS
668Setting PTATLAS=ATLAS
669  FOUND:
670    libraries = ['ptf77blas', 'ptcblas', 'atlas']
671    library_dirs = ['/opt/local/lib']
672    language = c
673    include_dirs = ['/opt/local/include']
674
675/opt/local/var/macports/build/_opt_local_var_macports_sources_svn.macports.org_trunk_dports_python_py26-numpy/work/numpy-1.4.1/numpy/distutils/command/config.py:394: DeprecationWarning:
676+++++++++++++++++++++++++++++++++++++++++++++++++
677Usage of get_output is deprecated: please do not
678use it anymore, and avoid configuration checks
679involving running executable on the target machine.
680+++++++++++++++++++++++++++++++++++++++++++++++++
681
682  DeprecationWarning)
683customize NAGFCompiler
684Could not locate executable f95
685customize AbsoftFCompiler
686Could not locate executable f90
687Could not locate executable f77
688customize IBMFCompiler
689Could not locate executable xlf90
690Could not locate executable xlf
691customize IntelFCompiler
692Could not locate executable ifort
693Could not locate executable ifc
694customize GnuFCompiler
695Could not locate executable g77
696customize Gnu95FCompiler
697Found executable /opt/local/bin/gfortran
698customize Gnu95FCompiler
699customize Gnu95FCompiler using config
700compiling '_configtest.c':
701
702/* This file is generated from numpy/distutils/system_info.py */
703void ATL_buildinfo(void);
704int main(void) {
705  ATL_buildinfo();
706  return 0;
707}
708C compiler: /opt/local/bin/gcc-mp-4.3 -DNDEBUG -g -fwrapv -O3 -Wall -Wstrict-prototypes -m64
709
710compile options: '-c'
711gcc-mp-4.3: _configtest.c
712/opt/local/bin/gcc-mp-4.3 _configtest.o -L/opt/local/lib -lptf77blas -lptcblas -latlas -o _configtest
713ATLAS version 3.8.3 built by root on Wed Apr 21 11:43:31 CEST 2010:
714   UNAME    : Darwin bimac.wlan 10.3.0 Darwin Kernel Version 10.3.0: Fri Feb 26 11:58:09 PST 2010; root:xnu-1504.3.12~1/RELEASE_I386 i386
715   INSTFLG  : -1 0 -a 1
716   ARCHDEFS : -DATL_OS_OSX -DATL_ARCH_Core2 -DATL_CPUMHZ=2660 -DATL_SSE3 -DATL_SSE2 -DATL_SSE1 -DATL_USE64BITS -DATL_GAS_x8664 -DATL_SSE3 -DATL_AVgcc
717   F2CDEFS  : -DAdd_ -DF77_INTEGER=int -DStringSunStyle
718   CACHEEDGE: 4194304
719   F77      : /opt/local/bin/gfortran-mp-4.3, version GNU Fortran (GCC) 4.3.4
720   F77FLAGS : -O -fPIC -m64
721   SMC      : /opt/local/bin/gcc-mp-4.3, version gcc-mp-4.3 (GCC) 4.3.4
722   SMCFLAGS : -fomit-frame-pointer -mfpmath=sse -msse3 -O2 -fPIC -m64
723   SKC      : /opt/local/bin/gcc-mp-4.3, version gcc-mp-4.3 (GCC) 4.3.4
724   SKCFLAGS : -fomit-frame-pointer -mfpmath=sse -msse3 -O2 -fPIC -m64
725success!
726removing: _configtest.c _configtest.o _configtest
727  FOUND:
728    libraries = ['ptf77blas', 'ptcblas', 'atlas']
729    library_dirs = ['/opt/local/lib']
730    language = c
731    define_macros = [('ATLAS_INFO', '"\\"3.8.3\\""')]
732    include_dirs = ['/opt/local/include']
733
734lapack_opt_info:
735lapack_mkl_info:
736mkl_info:
737  libraries mkl,vml,guide not found in /opt/local/Library/Frameworks/Python.framework/Versions/2.6/lib
738  libraries mkl,vml,guide not found in /usr/local/lib
739  libraries mkl,vml,guide not found in /usr/lib
740  libraries mkl,vml,guide not found in /opt/local/lib
741  NOT AVAILABLE
742
743  NOT AVAILABLE
744
745atlas_threads_info:
746Setting PTATLAS=ATLAS
747  libraries lapack_atlas not found in /opt/local/lib
748numpy.distutils.system_info.atlas_threads_info
749Setting PTATLAS=ATLAS
750Setting PTATLAS=ATLAS
751  FOUND:
752    libraries = ['lapack', 'ptf77blas', 'ptcblas', 'atlas']
753    library_dirs = ['/opt/local/lib']
754    language = f77
755    include_dirs = ['/opt/local/include']
756
757customize NAGFCompiler
758customize AbsoftFCompiler
759customize IBMFCompiler
760customize IntelFCompiler
761customize GnuFCompiler
762customize Gnu95FCompiler
763customize Gnu95FCompiler
764customize Gnu95FCompiler using config
765compiling '_configtest.c':
766
767/* This file is generated from numpy/distutils/system_info.py */
768void ATL_buildinfo(void);
769int main(void) {
770  ATL_buildinfo();
771  return 0;
772}
773C compiler: /opt/local/bin/gcc-mp-4.3 -DNDEBUG -g -fwrapv -O3 -Wall -Wstrict-prototypes -m64
774
775compile options: '-c'
776gcc-mp-4.3: _configtest.c
777/opt/local/bin/gcc-mp-4.3 _configtest.o -L/opt/local/lib -llapack -lptf77blas -lptcblas -latlas -o _configtest
778ATLAS version 3.8.3 built by root on Wed Apr 21 11:43:31 CEST 2010:
779   UNAME    : Darwin bimac.wlan 10.3.0 Darwin Kernel Version 10.3.0: Fri Feb 26 11:58:09 PST 2010; root:xnu-1504.3.12~1/RELEASE_I386 i386
780   INSTFLG  : -1 0 -a 1
781   ARCHDEFS : -DATL_OS_OSX -DATL_ARCH_Core2 -DATL_CPUMHZ=2660 -DATL_SSE3 -DATL_SSE2 -DATL_SSE1 -DATL_USE64BITS -DATL_GAS_x8664 -DATL_SSE3 -DATL_AVgcc
782   F2CDEFS  : -DAdd_ -DF77_INTEGER=int -DStringSunStyle
783   CACHEEDGE: 4194304
784   F77      : /opt/local/bin/gfortran-mp-4.3, version GNU Fortran (GCC) 4.3.4
785   F77FLAGS : -O -fPIC -m64
786   SMC      : /opt/local/bin/gcc-mp-4.3, version gcc-mp-4.3 (GCC) 4.3.4
787   SMCFLAGS : -fomit-frame-pointer -mfpmath=sse -msse3 -O2 -fPIC -m64
788   SKC      : /opt/local/bin/gcc-mp-4.3, version gcc-mp-4.3 (GCC) 4.3.4
789   SKCFLAGS : -fomit-frame-pointer -mfpmath=sse -msse3 -O2 -fPIC -m64
790success!
791removing: _configtest.c _configtest.o _configtest
792  FOUND:
793    libraries = ['lapack', 'ptf77blas', 'ptcblas', 'atlas']
794    library_dirs = ['/opt/local/lib']
795    language = f77
796    define_macros = [('ATLAS_INFO', '"\\"3.8.3\\""')]
797    include_dirs = ['/opt/local/include']
798
799running build
800running config_cc
801unifing config_cc, config, build_clib, build_ext, build commands --compiler options
802running config_fc
803unifing config_fc, config, build_clib, build_ext, build commands --fcompiler options
804running build_src
805build_src
806building py_modules sources
807creating build
808creating build/src.macosx-10.6-x86_64-2.6
809creating build/src.macosx-10.6-x86_64-2.6/numpy
810creating build/src.macosx-10.6-x86_64-2.6/numpy/distutils
811building library "npymath" sources
812customize NAGFCompiler
813customize AbsoftFCompiler
814customize IBMFCompiler
815customize IntelFCompiler
816customize GnuFCompiler
817customize Gnu95FCompiler
818customize Gnu95FCompiler
819customize Gnu95FCompiler using config
820C compiler: /opt/local/bin/gcc-mp-4.3 -DNDEBUG -g -fwrapv -O3 -Wall -Wstrict-prototypes -m64
821
822compile options: '-Inumpy/core/src/private -Inumpy/core/src -Inumpy/core -Inumpy/core/src/npymath -Inumpy/core/src/multiarray -Inumpy/core/src/umath -Inumpy/core/include -I/opt/local/Library/Frameworks/Python.framework/Versions/2.6/include/python2.6 -c'
823gcc-mp-4.3: _configtest.c
824/opt/local/bin/gcc-mp-4.3 _configtest.o -o _configtest
825success!
826removing: _configtest.c _configtest.o _configtest
827C compiler: /opt/local/bin/gcc-mp-4.3 -DNDEBUG -g -fwrapv -O3 -Wall -Wstrict-prototypes -m64
828
829compile options: '-Inumpy/core/src/private -Inumpy/core/src -Inumpy/core -Inumpy/core/src/npymath -Inumpy/core/src/multiarray -Inumpy/core/src/umath -Inumpy/core/include -I/opt/local/Library/Frameworks/Python.framework/Versions/2.6/include/python2.6 -c'
830gcc-mp-4.3: _configtest.c
831_configtest.c:1: warning: conflicting types for built-in function 'exp'
832/opt/local/bin/gcc-mp-4.3 _configtest.o -o _configtest
833success!
834removing: _configtest.c _configtest.o _configtest
835creating build/src.macosx-10.6-x86_64-2.6/numpy/core
836creating build/src.macosx-10.6-x86_64-2.6/numpy/core/src
837creating build/src.macosx-10.6-x86_64-2.6/numpy/core/src/npymath
838conv_template:> build/src.macosx-10.6-x86_64-2.6/numpy/core/src/npymath/npy_math.c
839conv_template:> build/src.macosx-10.6-x86_64-2.6/numpy/core/src/npymath/ieee754.c
840conv_template:> build/src.macosx-10.6-x86_64-2.6/numpy/core/src/npymath/npy_math_complex.c
841building extension "numpy.core._sort" sources
842Generating build/src.macosx-10.6-x86_64-2.6/numpy/core/include/numpy/config.h
843C compiler: /opt/local/bin/gcc-mp-4.3 -DNDEBUG -g -fwrapv -O3 -Wall -Wstrict-prototypes -m64
844
845compile options: '-Inumpy/core/src/private -Inumpy/core/src -Inumpy/core -Inumpy/core/src/npymath -Inumpy/core/src/multiarray -Inumpy/core/src/umath -Inumpy/core/include -I/opt/local/Library/Frameworks/Python.framework/Versions/2.6/include/python2.6 -c'
846gcc-mp-4.3: _configtest.c
847success!
848removing: _configtest.c _configtest.o
849C compiler: /opt/local/bin/gcc-mp-4.3 -DNDEBUG -g -fwrapv -O3 -Wall -Wstrict-prototypes -m64
850
851compile options: '-Inumpy/core/src/private -Inumpy/core/src -Inumpy/core -Inumpy/core/src/npymath -Inumpy/core/src/multiarray -Inumpy/core/src/umath -Inumpy/core/include -I/opt/local/Library/Frameworks/Python.framework/Versions/2.6/include/python2.6 -c'
852gcc-mp-4.3: _configtest.c
853_configtest.c:5: warning: function declaration isn't a prototype
854success!
855removing: _configtest.c _configtest.o
856C compiler: /opt/local/bin/gcc-mp-4.3 -DNDEBUG -g -fwrapv -O3 -Wall -Wstrict-prototypes -m64
857
858compile options: '-Inumpy/core/src/private -Inumpy/core/src -Inumpy/core -Inumpy/core/src/npymath -Inumpy/core/src/multiarray -Inumpy/core/src/umath -Inumpy/core/include -I/opt/local/Library/Frameworks/Python.framework/Versions/2.6/include/python2.6 -c'
859gcc-mp-4.3: _configtest.c
860_configtest.c:5: warning: function declaration isn't a prototype
861success!
862removing: _configtest.c _configtest.o
863C compiler: /opt/local/bin/gcc-mp-4.3 -DNDEBUG -g -fwrapv -O3 -Wall -Wstrict-prototypes -m64
864
865compile options: '-Inumpy/core/src/private -Inumpy/core/src -Inumpy/core -Inumpy/core/src/npymath -Inumpy/core/src/multiarray -Inumpy/core/src/umath -Inumpy/core/include -I/opt/local/Library/Frameworks/Python.framework/Versions/2.6/include/python2.6 -c'
866gcc-mp-4.3: _configtest.c
867_configtest.c:5: warning: function declaration isn't a prototype
868success!
869removing: _configtest.c _configtest.o
870C compiler: /opt/local/bin/gcc-mp-4.3 -DNDEBUG -g -fwrapv -O3 -Wall -Wstrict-prototypes -m64
871
872compile options: '-Inumpy/core/src/private -Inumpy/core/src -Inumpy/core -Inumpy/core/src/npymath -Inumpy/core/src/multiarray -Inumpy/core/src/umath -Inumpy/core/include -I/opt/local/Library/Frameworks/Python.framework/Versions/2.6/include/python2.6 -c'
873gcc-mp-4.3: _configtest.c
874_configtest.c:5: warning: function declaration isn't a prototype
875success!
876removing: _configtest.c _configtest.o
877C compiler: /opt/local/bin/gcc-mp-4.3 -DNDEBUG -g -fwrapv -O3 -Wall -Wstrict-prototypes -m64
878
879compile options: '-Inumpy/core/src/private -Inumpy/core/src -Inumpy/core -Inumpy/core/src/npymath -Inumpy/core/src/multiarray -Inumpy/core/src/umath -Inumpy/core/include -I/opt/local/Library/Frameworks/Python.framework/Versions/2.6/include/python2.6 -c'
880gcc-mp-4.3: _configtest.c
881_configtest.c:4: warning: function declaration isn't a prototype
882removing: _configtest.c _configtest.o
883C compiler: /opt/local/bin/gcc-mp-4.3 -DNDEBUG -g -fwrapv -O3 -Wall -Wstrict-prototypes -m64
884
885compile options: '-Inumpy/core/src/private -Inumpy/core/src -Inumpy/core -Inumpy/core/src/npymath -Inumpy/core/src/multiarray -Inumpy/core/src/umath -Inumpy/core/include -I/opt/local/Library/Frameworks/Python.framework/Versions/2.6/include/python2.6 -c'
886gcc-mp-4.3: _configtest.c
887_configtest.c:4: warning: function declaration isn't a prototype
888removing: _configtest.c _configtest.o
889C compiler: /opt/local/bin/gcc-mp-4.3 -DNDEBUG -g -fwrapv -O3 -Wall -Wstrict-prototypes -m64
890
891compile options: '-Inumpy/core/src/private -Inumpy/core/src -Inumpy/core -Inumpy/core/src/npymath -Inumpy/core/src/multiarray -Inumpy/core/src/umath -Inumpy/core/include -I/opt/local/Library/Frameworks/Python.framework/Versions/2.6/include/python2.6 -c'
892gcc-mp-4.3: _configtest.c
893_configtest.c:4: warning: function declaration isn't a prototype
894removing: _configtest.c _configtest.o
895C compiler: /opt/local/bin/gcc-mp-4.3 -DNDEBUG -g -fwrapv -O3 -Wall -Wstrict-prototypes -m64
896
897compile options: '-Inumpy/core/src/private -Inumpy/core/src -Inumpy/core -Inumpy/core/src/npymath -Inumpy/core/src/multiarray -Inumpy/core/src/umath -Inumpy/core/include -I/opt/local/Library/Frameworks/Python.framework/Versions/2.6/include/python2.6 -c'
898gcc-mp-4.3: _configtest.c
899_configtest.c:4: warning: function declaration isn't a prototype
900_configtest.c: In function 'main':
901_configtest.c:5: error: size of array 'test_array' is negative
902_configtest.c:4: warning: function declaration isn't a prototype
903_configtest.c: In function 'main':
904_configtest.c:5: error: size of array 'test_array' is negative
905C compiler: /opt/local/bin/gcc-mp-4.3 -DNDEBUG -g -fwrapv -O3 -Wall -Wstrict-prototypes -m64
906
907compile options: '-Inumpy/core/src/private -Inumpy/core/src -Inumpy/core -Inumpy/core/src/npymath -Inumpy/core/src/multiarray -Inumpy/core/src/umath -Inumpy/core/include -I/opt/local/Library/Frameworks/Python.framework/Versions/2.6/include/python2.6 -c'
908gcc-mp-4.3: _configtest.c
909_configtest.c:4: warning: function declaration isn't a prototype
910_configtest.c: In function 'main':
911_configtest.c:5: error: size of array 'test_array' is negative
912_configtest.c:4: warning: function declaration isn't a prototype
913_configtest.c: In function 'main':
914_configtest.c:5: error: size of array 'test_array' is negative
915C compiler: /opt/local/bin/gcc-mp-4.3 -DNDEBUG -g -fwrapv -O3 -Wall -Wstrict-prototypes -m64
916
917compile options: '-Inumpy/core/src/private -Inumpy/core/src -Inumpy/core -Inumpy/core/src/npymath -Inumpy/core/src/multiarray -Inumpy/core/src/umath -Inumpy/core/include -I/opt/local/Library/Frameworks/Python.framework/Versions/2.6/include/python2.6 -c'
918gcc-mp-4.3: _configtest.c
919_configtest.c:4: warning: function declaration isn't a prototype
920_configtest.c: In function 'main':
921_configtest.c:5: error: size of array 'test_array' is negative
922_configtest.c:4: warning: function declaration isn't a prototype
923_configtest.c: In function 'main':
924_configtest.c:5: error: size of array 'test_array' is negative
925C compiler: /opt/local/bin/gcc-mp-4.3 -DNDEBUG -g -fwrapv -O3 -Wall -Wstrict-prototypes -m64
926
927compile options: '-Inumpy/core/src/private -Inumpy/core/src -Inumpy/core -Inumpy/core/src/npymath -Inumpy/core/src/multiarray -Inumpy/core/src/umath -Inumpy/core/include -I/opt/local/Library/Frameworks/Python.framework/Versions/2.6/include/python2.6 -c'
928gcc-mp-4.3: _configtest.c
929_configtest.c:4: warning: function declaration isn't a prototype
930_configtest.c: In function 'main':
931_configtest.c:5: error: size of array 'test_array' is negative
932_configtest.c:4: warning: function declaration isn't a prototype
933_configtest.c: In function 'main':
934_configtest.c:5: error: size of array 'test_array' is negative
935C compiler: /opt/local/bin/gcc-mp-4.3 -DNDEBUG -g -fwrapv -O3 -Wall -Wstrict-prototypes -m64
936
937compile options: '-Inumpy/core/src/private -Inumpy/core/src -Inumpy/core -Inumpy/core/src/npymath -Inumpy/core/src/multiarray -Inumpy/core/src/umath -Inumpy/core/include -I/opt/local/Library/Frameworks/Python.framework/Versions/2.6/include/python2.6 -c'
938gcc-mp-4.3: _configtest.c
939_configtest.c:4: warning: function declaration isn't a prototype
940_configtest.c: In function 'main':
941_configtest.c:5: error: size of array 'test_array' is negative
942_configtest.c:4: warning: function declaration isn't a prototype
943_configtest.c: In function 'main':
944_configtest.c:5: error: size of array 'test_array' is negative
945C compiler: /opt/local/bin/gcc-mp-4.3 -DNDEBUG -g -fwrapv -O3 -Wall -Wstrict-prototypes -m64
946
947compile options: '-Inumpy/core/src/private -Inumpy/core/src -Inumpy/core -Inumpy/core/src/npymath -Inumpy/core/src/multiarray -Inumpy/core/src/umath -Inumpy/core/include -I/opt/local/Library/Frameworks/Python.framework/Versions/2.6/include/python2.6 -c'
948gcc-mp-4.3: _configtest.c
949_configtest.c:4: warning: function declaration isn't a prototype
950_configtest.c: In function 'main':
951_configtest.c:5: error: size of array 'test_array' is negative
952_configtest.c:4: warning: function declaration isn't a prototype
953_configtest.c: In function 'main':
954_configtest.c:5: error: size of array 'test_array' is negative
955C compiler: /opt/local/bin/gcc-mp-4.3 -DNDEBUG -g -fwrapv -O3 -Wall -Wstrict-prototypes -m64
956
957compile options: '-Inumpy/core/src/private -Inumpy/core/src -Inumpy/core -Inumpy/core/src/npymath -Inumpy/core/src/multiarray -Inumpy/core/src/umath -Inumpy/core/include -I/opt/local/Library/Frameworks/Python.framework/Versions/2.6/include/python2.6 -c'
958gcc-mp-4.3: _configtest.c
959_configtest.c:4: warning: function declaration isn't a prototype
960removing: _configtest.c _configtest.o _configtest.c _configtest.o _configtest.c _configtest.o _configtest.c _configtest.o _configtest.c _configtest.o _configtest.c _configtest.o _configtest.c _configtest.o
961C compiler: /opt/local/bin/gcc-mp-4.3 -DNDEBUG -g -fwrapv -O3 -Wall -Wstrict-prototypes -m64
962
963compile options: '-Inumpy/core/src/private -Inumpy/core/src -Inumpy/core -Inumpy/core/src/npymath -Inumpy/core/src/multiarray -Inumpy/core/src/umath -Inumpy/core/include -I/opt/local/Library/Frameworks/Python.framework/Versions/2.6/include/python2.6 -c'
964gcc-mp-4.3: _configtest.c
965_configtest.c:4: warning: function declaration isn't a prototype
966removing: _configtest.c _configtest.o
967C compiler: /opt/local/bin/gcc-mp-4.3 -DNDEBUG -g -fwrapv -O3 -Wall -Wstrict-prototypes -m64
968
969compile options: '-Inumpy/core/src/private -Inumpy/core/src -Inumpy/core -Inumpy/core/src/npymath -Inumpy/core/src/multiarray -Inumpy/core/src/umath -Inumpy/core/include -I/opt/local/Library/Frameworks/Python.framework/Versions/2.6/include/python2.6 -c'
970gcc-mp-4.3: _configtest.c
971_configtest.c:4: warning: function declaration isn't a prototype
972removing: _configtest.c _configtest.o
973C compiler: /opt/local/bin/gcc-mp-4.3 -DNDEBUG -g -fwrapv -O3 -Wall -Wstrict-prototypes -m64
974
975compile options: '-Inumpy/core/src/private -Inumpy/core/src -Inumpy/core -Inumpy/core/src/npymath -Inumpy/core/src/multiarray -Inumpy/core/src/umath -Inumpy/core/include -I/opt/local/Library/Frameworks/Python.framework/Versions/2.6/include/python2.6 -c'
976gcc-mp-4.3: _configtest.c
977_configtest.c:4: warning: function declaration isn't a prototype
978removing: _configtest.c _configtest.o
979C compiler: /opt/local/bin/gcc-mp-4.3 -DNDEBUG -g -fwrapv -O3 -Wall -Wstrict-prototypes -m64
980
981compile options: '-Inumpy/core/src/private -Inumpy/core/src -Inumpy/core -Inumpy/core/src/npymath -Inumpy/core/src/multiarray -Inumpy/core/src/umath -Inumpy/core/include -I/opt/local/Library/Frameworks/Python.framework/Versions/2.6/include/python2.6 -c'
982gcc-mp-4.3: _configtest.c
983_configtest.c:5: warning: function declaration isn't a prototype
984success!
985removing: _configtest.c _configtest.o
986C compiler: /opt/local/bin/gcc-mp-4.3 -DNDEBUG -g -fwrapv -O3 -Wall -Wstrict-prototypes -m64
987
988compile options: '-Inumpy/core/src/private -Inumpy/core/src -Inumpy/core -Inumpy/core/src/npymath -Inumpy/core/src/multiarray -Inumpy/core/src/umath -Inumpy/core/include -I/opt/local/Library/Frameworks/Python.framework/Versions/2.6/include/python2.6 -c'
989gcc-mp-4.3: _configtest.c
990_configtest.c:4: warning: function declaration isn't a prototype
991removing: _configtest.c _configtest.o
992C compiler: /opt/local/bin/gcc-mp-4.3 -DNDEBUG -g -fwrapv -O3 -Wall -Wstrict-prototypes -m64
993
994compile options: '-Inumpy/core/src/private -Inumpy/core/src -Inumpy/core -Inumpy/core/src/npymath -Inumpy/core/src/multiarray -Inumpy/core/src/umath -Inumpy/core/include -I/opt/local/Library/Frameworks/Python.framework/Versions/2.6/include/python2.6 -c'
995gcc-mp-4.3: _configtest.c
996_configtest.c:4: warning: function declaration isn't a prototype
997removing: _configtest.c _configtest.o
998C compiler: /opt/local/bin/gcc-mp-4.3 -DNDEBUG -g -fwrapv -O3 -Wall -Wstrict-prototypes -m64
999
1000compile options: '-Inumpy/core/src/private -Inumpy/core/src -Inumpy/core -Inumpy/core/src/npymath -Inumpy/core/src/multiarray -Inumpy/core/src/umath -Inumpy/core/include -I/opt/local/Library/Frameworks/Python.framework/Versions/2.6/include/python2.6 -c'
1001gcc-mp-4.3: _configtest.c
1002_configtest.c:4: warning: function declaration isn't a prototype
1003removing: _configtest.c _configtest.o
1004C compiler: /opt/local/bin/gcc-mp-4.3 -DNDEBUG -g -fwrapv -O3 -Wall -Wstrict-prototypes -m64
1005
1006compile options: '-Inumpy/core/src/private -Inumpy/core/src -Inumpy/core -Inumpy/core/src/npymath -Inumpy/core/src/multiarray -Inumpy/core/src/umath -Inumpy/core/include -I/opt/local/Library/Frameworks/Python.framework/Versions/2.6/include/python2.6 -c'
1007gcc-mp-4.3: _configtest.c
1008_configtest.c:4: warning: function declaration isn't a prototype
1009_configtest.c: In function 'main':
1010_configtest.c:5: error: size of array 'test_array' is negative
1011_configtest.c:4: warning: function declaration isn't a prototype
1012_configtest.c: In function 'main':
1013_configtest.c:5: error: size of array 'test_array' is negative
1014C compiler: /opt/local/bin/gcc-mp-4.3 -DNDEBUG -g -fwrapv -O3 -Wall -Wstrict-prototypes -m64
1015
1016compile options: '-Inumpy/core/src/private -Inumpy/core/src -Inumpy/core -Inumpy/core/src/npymath -Inumpy/core/src/multiarray -Inumpy/core/src/umath -Inumpy/core/include -I/opt/local/Library/Frameworks/Python.framework/Versions/2.6/include/python2.6 -c'
1017gcc-mp-4.3: _configtest.c
1018_configtest.c:4: warning: function declaration isn't a prototype
1019_configtest.c: In function 'main':
1020_configtest.c:5: error: size of array 'test_array' is negative
1021_configtest.c:4: warning: function declaration isn't a prototype
1022_configtest.c: In function 'main':
1023_configtest.c:5: error: size of array 'test_array' is negative
1024C compiler: /opt/local/bin/gcc-mp-4.3 -DNDEBUG -g -fwrapv -O3 -Wall -Wstrict-prototypes -m64
1025
1026compile options: '-Inumpy/core/src/private -Inumpy/core/src -Inumpy/core -Inumpy/core/src/npymath -Inumpy/core/src/multiarray -Inumpy/core/src/umath -Inumpy/core/include -I/opt/local/Library/Frameworks/Python.framework/Versions/2.6/include/python2.6 -c'
1027gcc-mp-4.3: _configtest.c
1028_configtest.c:4: warning: function declaration isn't a prototype
1029_configtest.c: In function 'main':
1030_configtest.c:5: error: size of array 'test_array' is negative
1031_configtest.c:4: warning: function declaration isn't a prototype
1032_configtest.c: In function 'main':
1033_configtest.c:5: error: size of array 'test_array' is negative
1034C compiler: /opt/local/bin/gcc-mp-4.3 -DNDEBUG -g -fwrapv -O3 -Wall -Wstrict-prototypes -m64
1035
1036compile options: '-Inumpy/core/src/private -Inumpy/core/src -Inumpy/core -Inumpy/core/src/npymath -Inumpy/core/src/multiarray -Inumpy/core/src/umath -Inumpy/core/include -I/opt/local/Library/Frameworks/Python.framework/Versions/2.6/include/python2.6 -c'
1037gcc-mp-4.3: _configtest.c
1038_configtest.c:4: warning: function declaration isn't a prototype
1039_configtest.c: In function 'main':
1040_configtest.c:5: error: size of array 'test_array' is negative
1041_configtest.c:4: warning: function declaration isn't a prototype
1042_configtest.c: In function 'main':
1043_configtest.c:5: error: size of array 'test_array' is negative
1044C compiler: /opt/local/bin/gcc-mp-4.3 -DNDEBUG -g -fwrapv -O3 -Wall -Wstrict-prototypes -m64
1045
1046compile options: '-Inumpy/core/src/private -Inumpy/core/src -Inumpy/core -Inumpy/core/src/npymath -Inumpy/core/src/multiarray -Inumpy/core/src/umath -Inumpy/core/include -I/opt/local/Library/Frameworks/Python.framework/Versions/2.6/include/python2.6 -c'
1047gcc-mp-4.3: _configtest.c
1048_configtest.c:4: warning: function declaration isn't a prototype
1049_configtest.c: In function 'main':
1050_configtest.c:5: error: size of array 'test_array' is negative
1051_configtest.c:4: warning: function declaration isn't a prototype
1052_configtest.c: In function 'main':
1053_configtest.c:5: error: size of array 'test_array' is negative
1054C compiler: /opt/local/bin/gcc-mp-4.3 -DNDEBUG -g -fwrapv -O3 -Wall -Wstrict-prototypes -m64
1055
1056compile options: '-Inumpy/core/src/private -Inumpy/core/src -Inumpy/core -Inumpy/core/src/npymath -Inumpy/core/src/multiarray -Inumpy/core/src/umath -Inumpy/core/include -I/opt/local/Library/Frameworks/Python.framework/Versions/2.6/include/python2.6 -c'
1057gcc-mp-4.3: _configtest.c
1058_configtest.c:4: warning: function declaration isn't a prototype
1059_configtest.c: In function 'main':
1060_configtest.c:5: error: size of array 'test_array' is negative
1061_configtest.c:4: warning: function declaration isn't a prototype
1062_configtest.c: In function 'main':
1063_configtest.c:5: error: size of array 'test_array' is negative
1064C compiler: /opt/local/bin/gcc-mp-4.3 -DNDEBUG -g -fwrapv -O3 -Wall -Wstrict-prototypes -m64
1065
1066compile options: '-Inumpy/core/src/private -Inumpy/core/src -Inumpy/core -Inumpy/core/src/npymath -Inumpy/core/src/multiarray -Inumpy/core/src/umath -Inumpy/core/include -I/opt/local/Library/Frameworks/Python.framework/Versions/2.6/include/python2.6 -c'
1067gcc-mp-4.3: _configtest.c
1068_configtest.c:4: warning: function declaration isn't a prototype
1069_configtest.c: In function 'main':
1070_configtest.c:5: error: size of array 'test_array' is negative
1071_configtest.c:4: warning: function declaration isn't a prototype
1072_configtest.c: In function 'main':
1073_configtest.c:5: error: size of array 'test_array' is negative
1074C compiler: /opt/local/bin/gcc-mp-4.3 -DNDEBUG -g -fwrapv -O3 -Wall -Wstrict-prototypes -m64
1075
1076compile options: '-Inumpy/core/src/private -Inumpy/core/src -Inumpy/core -Inumpy/core/src/npymath -Inumpy/core/src/multiarray -Inumpy/core/src/umath -Inumpy/core/include -I/opt/local/Library/Frameworks/Python.framework/Versions/2.6/include/python2.6 -c'
1077gcc-mp-4.3: _configtest.c
1078_configtest.c:4: warning: function declaration isn't a prototype
1079removing: _configtest.c _configtest.o _configtest.c _configtest.o _configtest.c _configtest.o _configtest.c _configtest.o _configtest.c _configtest.o _configtest.c _configtest.o _configtest.c _configtest.o _configtest.c _configtest.o
1080C compiler: /opt/local/bin/gcc-mp-4.3 -DNDEBUG -g -fwrapv -O3 -Wall -Wstrict-prototypes -m64
1081
1082compile options: '-Inumpy/core/src/private -Inumpy/core/src -Inumpy/core -Inumpy/core/src/npymath -Inumpy/core/src/multiarray -Inumpy/core/src/umath -Inumpy/core/include -I/opt/local/Library/Frameworks/Python.framework/Versions/2.6/include/python2.6 -c'
1083gcc-mp-4.3: _configtest.c
1084_configtest.c:4: warning: function declaration isn't a prototype
1085removing: _configtest.c _configtest.o
1086C compiler: /opt/local/bin/gcc-mp-4.3 -DNDEBUG -g -fwrapv -O3 -Wall -Wstrict-prototypes -m64
1087
1088compile options: '-Inumpy/core/src/private -Inumpy/core/src -Inumpy/core -Inumpy/core/src/npymath -Inumpy/core/src/multiarray -Inumpy/core/src/umath -Inumpy/core/include -I/opt/local/Library/Frameworks/Python.framework/Versions/2.6/include/python2.6 -c'
1089gcc-mp-4.3: _configtest.c
1090_configtest.c:4: warning: function declaration isn't a prototype
1091removing: _configtest.c _configtest.o
1092C compiler: /opt/local/bin/gcc-mp-4.3 -DNDEBUG -g -fwrapv -O3 -Wall -Wstrict-prototypes -m64
1093
1094compile options: '-Inumpy/core/src/private -Inumpy/core/src -Inumpy/core -Inumpy/core/src/npymath -Inumpy/core/src/multiarray -Inumpy/core/src/umath -Inumpy/core/include -I/opt/local/Library/Frameworks/Python.framework/Versions/2.6/include/python2.6 -c'
1095gcc-mp-4.3: _configtest.c
1096_configtest.c:4: warning: function declaration isn't a prototype
1097removing: _configtest.c _configtest.o
1098C compiler: /opt/local/bin/gcc-mp-4.3 -DNDEBUG -g -fwrapv -O3 -Wall -Wstrict-prototypes -m64
1099
1100compile options: '-Inumpy/core/src/private -Inumpy/core/src -Inumpy/core -Inumpy/core/src/npymath -Inumpy/core/src/multiarray -Inumpy/core/src/umath -Inumpy/core/include -I/opt/local/Library/Frameworks/Python.framework/Versions/2.6/include/python2.6 -c'
1101gcc-mp-4.3: _configtest.c
1102_configtest.c:4: warning: function declaration isn't a prototype
1103removing: _configtest.c _configtest.o
1104C compiler: /opt/local/bin/gcc-mp-4.3 -DNDEBUG -g -fwrapv -O3 -Wall -Wstrict-prototypes -m64
1105
1106compile options: '-Inumpy/core/src/private -Inumpy/core/src -Inumpy/core -Inumpy/core/src/npymath -Inumpy/core/src/multiarray -Inumpy/core/src/umath -Inumpy/core/include -I/opt/local/Library/Frameworks/Python.framework/Versions/2.6/include/python2.6 -c'
1107gcc-mp-4.3: _configtest.c
1108_configtest.c:5: warning: function declaration isn't a prototype
1109_configtest.c: In function 'main':
1110_configtest.c:7: error: 'SIZEOF_LONGDOUBLE' undeclared (first use in this function)
1111_configtest.c:7: error: (Each undeclared identifier is reported only once
1112_configtest.c:7: error: for each function it appears in.)
1113_configtest.c:5: warning: function declaration isn't a prototype
1114_configtest.c: In function 'main':
1115_configtest.c:7: error: 'SIZEOF_LONGDOUBLE' undeclared (first use in this function)
1116_configtest.c:7: error: (Each undeclared identifier is reported only once
1117_configtest.c:7: error: for each function it appears in.)
1118failure.
1119removing: _configtest.c _configtest.o
1120C compiler: /opt/local/bin/gcc-mp-4.3 -DNDEBUG -g -fwrapv -O3 -Wall -Wstrict-prototypes -m64
1121
1122compile options: '-Inumpy/core/src/private -Inumpy/core/src -Inumpy/core -Inumpy/core/src/npymath -Inumpy/core/src/multiarray -Inumpy/core/src/umath -Inumpy/core/include -I/opt/local/Library/Frameworks/Python.framework/Versions/2.6/include/python2.6 -c'
1123gcc-mp-4.3: _configtest.c
1124_configtest.c:4: warning: function declaration isn't a prototype
1125removing: _configtest.c _configtest.o
1126C compiler: /opt/local/bin/gcc-mp-4.3 -DNDEBUG -g -fwrapv -O3 -Wall -Wstrict-prototypes -m64
1127
1128compile options: '-Inumpy/core/src/private -Inumpy/core/src -Inumpy/core -Inumpy/core/src/npymath -Inumpy/core/src/multiarray -Inumpy/core/src/umath -Inumpy/core/include -I/opt/local/Library/Frameworks/Python.framework/Versions/2.6/include/python2.6 -c'
1129gcc-mp-4.3: _configtest.c
1130_configtest.c:4: warning: function declaration isn't a prototype
1131_configtest.c: In function 'main':
1132_configtest.c:5: error: size of array 'test_array' is negative
1133_configtest.c:4: warning: function declaration isn't a prototype
1134_configtest.c: In function 'main':
1135_configtest.c:5: error: size of array 'test_array' is negative
1136C compiler: /opt/local/bin/gcc-mp-4.3 -DNDEBUG -g -fwrapv -O3 -Wall -Wstrict-prototypes -m64
1137
1138compile options: '-Inumpy/core/src/private -Inumpy/core/src -Inumpy/core -Inumpy/core/src/npymath -Inumpy/core/src/multiarray -Inumpy/core/src/umath -Inumpy/core/include -I/opt/local/Library/Frameworks/Python.framework/Versions/2.6/include/python2.6 -c'
1139gcc-mp-4.3: _configtest.c
1140_configtest.c:4: warning: function declaration isn't a prototype
1141_configtest.c: In function 'main':
1142_configtest.c:5: error: size of array 'test_array' is negative
1143_configtest.c:4: warning: function declaration isn't a prototype
1144_configtest.c: In function 'main':
1145_configtest.c:5: error: size of array 'test_array' is negative
1146C compiler: /opt/local/bin/gcc-mp-4.3 -DNDEBUG -g -fwrapv -O3 -Wall -Wstrict-prototypes -m64
1147
1148compile options: '-Inumpy/core/src/private -Inumpy/core/src -Inumpy/core -Inumpy/core/src/npymath -Inumpy/core/src/multiarray -Inumpy/core/src/umath -Inumpy/core/include -I/opt/local/Library/Frameworks/Python.framework/Versions/2.6/include/python2.6 -c'
1149gcc-mp-4.3: _configtest.c
1150_configtest.c:4: warning: function declaration isn't a prototype
1151removing: _configtest.c _configtest.o _configtest.c _configtest.o _configtest.c _configtest.o
1152C compiler: /opt/local/bin/gcc-mp-4.3 -DNDEBUG -g -fwrapv -O3 -Wall -Wstrict-prototypes -m64
1153
1154compile options: '-Inumpy/core/src/private -Inumpy/core/src -Inumpy/core -Inumpy/core/src/npymath -Inumpy/core/src/multiarray -Inumpy/core/src/umath -Inumpy/core/include -I/opt/local/Library/Frameworks/Python.framework/Versions/2.6/include/python2.6 -c'
1155gcc-mp-4.3: _configtest.c
1156_configtest.c:4: warning: function declaration isn't a prototype
1157removing: _configtest.c _configtest.o
1158C compiler: /opt/local/bin/gcc-mp-4.3 -DNDEBUG -g -fwrapv -O3 -Wall -Wstrict-prototypes -m64
1159
1160compile options: '-Inumpy/core/src/private -Inumpy/core/src -Inumpy/core -Inumpy/core/src/npymath -Inumpy/core/src/multiarray -Inumpy/core/src/umath -Inumpy/core/include -I/opt/local/Library/Frameworks/Python.framework/Versions/2.6/include/python2.6 -c'
1161gcc-mp-4.3: _configtest.c
1162_configtest.c:4: warning: function declaration isn't a prototype
1163_configtest.c: In function 'main':
1164_configtest.c:5: error: size of array 'test_array' is negative
1165_configtest.c:4: warning: function declaration isn't a prototype
1166_configtest.c: In function 'main':
1167_configtest.c:5: error: size of array 'test_array' is negative
1168C compiler: /opt/local/bin/gcc-mp-4.3 -DNDEBUG -g -fwrapv -O3 -Wall -Wstrict-prototypes -m64
1169
1170compile options: '-Inumpy/core/src/private -Inumpy/core/src -Inumpy/core -Inumpy/core/src/npymath -Inumpy/core/src/multiarray -Inumpy/core/src/umath -Inumpy/core/include -I/opt/local/Library/Frameworks/Python.framework/Versions/2.6/include/python2.6 -c'
1171gcc-mp-4.3: _configtest.c
1172_configtest.c:4: warning: function declaration isn't a prototype
1173_configtest.c: In function 'main':
1174_configtest.c:5: error: size of array 'test_array' is negative
1175_configtest.c:4: warning: function declaration isn't a prototype
1176_configtest.c: In function 'main':
1177_configtest.c:5: error: size of array 'test_array' is negative
1178C compiler: /opt/local/bin/gcc-mp-4.3 -DNDEBUG -g -fwrapv -O3 -Wall -Wstrict-prototypes -m64
1179
1180compile options: '-Inumpy/core/src/private -Inumpy/core/src -Inumpy/core -Inumpy/core/src/npymath -Inumpy/core/src/multiarray -Inumpy/core/src/umath -Inumpy/core/include -I/opt/local/Library/Frameworks/Python.framework/Versions/2.6/include/python2.6 -c'
1181gcc-mp-4.3: _configtest.c
1182_configtest.c:4: warning: function declaration isn't a prototype
1183_configtest.c: In function 'main':
1184_configtest.c:5: error: size of array 'test_array' is negative
1185_configtest.c:4: warning: function declaration isn't a prototype
1186_configtest.c: In function 'main':
1187_configtest.c:5: error: size of array 'test_array' is negative
1188C compiler: /opt/local/bin/gcc-mp-4.3 -DNDEBUG -g -fwrapv -O3 -Wall -Wstrict-prototypes -m64
1189
1190compile options: '-Inumpy/core/src/private -Inumpy/core/src -Inumpy/core -Inumpy/core/src/npymath -Inumpy/core/src/multiarray -Inumpy/core/src/umath -Inumpy/core/include -I/opt/local/Library/Frameworks/Python.framework/Versions/2.6/include/python2.6 -c'
1191gcc-mp-4.3: _configtest.c
1192_configtest.c:4: warning: function declaration isn't a prototype
1193_configtest.c: In function 'main':
1194_configtest.c:5: error: size of array 'test_array' is negative
1195_configtest.c:4: warning: function declaration isn't a prototype
1196_configtest.c: In function 'main':
1197_configtest.c:5: error: size of array 'test_array' is negative
1198C compiler: /opt/local/bin/gcc-mp-4.3 -DNDEBUG -g -fwrapv -O3 -Wall -Wstrict-prototypes -m64
1199
1200compile options: '-Inumpy/core/src/private -Inumpy/core/src -Inumpy/core -Inumpy/core/src/npymath -Inumpy/core/src/multiarray -Inumpy/core/src/umath -Inumpy/core/include -I/opt/local/Library/Frameworks/Python.framework/Versions/2.6/include/python2.6 -c'
1201gcc-mp-4.3: _configtest.c
1202_configtest.c:4: warning: function declaration isn't a prototype
1203_configtest.c: In function 'main':
1204_configtest.c:5: error: size of array 'test_array' is negative
1205_configtest.c:4: warning: function declaration isn't a prototype
1206_configtest.c: In function 'main':
1207_configtest.c:5: error: size of array 'test_array' is negative
1208C compiler: /opt/local/bin/gcc-mp-4.3 -DNDEBUG -g -fwrapv -O3 -Wall -Wstrict-prototypes -m64
1209
1210compile options: '-Inumpy/core/src/private -Inumpy/core/src -Inumpy/core -Inumpy/core/src/npymath -Inumpy/core/src/multiarray -Inumpy/core/src/umath -Inumpy/core/include -I/opt/local/Library/Frameworks/Python.framework/Versions/2.6/include/python2.6 -c'
1211gcc-mp-4.3: _configtest.c
1212_configtest.c:4: warning: function declaration isn't a prototype
1213_configtest.c: In function 'main':
1214_configtest.c:5: error: size of array 'test_array' is negative
1215_configtest.c:4: warning: function declaration isn't a prototype
1216_configtest.c: In function 'main':
1217_configtest.c:5: error: size of array 'test_array' is negative
1218C compiler: /opt/local/bin/gcc-mp-4.3 -DNDEBUG -g -fwrapv -O3 -Wall -Wstrict-prototypes -m64
1219
1220compile options: '-Inumpy/core/src/private -Inumpy/core/src -Inumpy/core -Inumpy/core/src/npymath -Inumpy/core/src/multiarray -Inumpy/core/src/umath -Inumpy/core/include -I/opt/local/Library/Frameworks/Python.framework/Versions/2.6/include/python2.6 -c'
1221gcc-mp-4.3: _configtest.c
1222_configtest.c:4: warning: function declaration isn't a prototype
1223_configtest.c: In function 'main':
1224_configtest.c:5: error: size of array 'test_array' is negative
1225_configtest.c:4: warning: function declaration isn't a prototype
1226_configtest.c: In function 'main':
1227_configtest.c:5: error: size of array 'test_array' is negative
1228C compiler: /opt/local/bin/gcc-mp-4.3 -DNDEBUG -g -fwrapv -O3 -Wall -Wstrict-prototypes -m64
1229
1230compile options: '-Inumpy/core/src/private -Inumpy/core/src -Inumpy/core -Inumpy/core/src/npymath -Inumpy/core/src/multiarray -Inumpy/core/src/umath -Inumpy/core/include -I/opt/local/Library/Frameworks/Python.framework/Versions/2.6/include/python2.6 -c'
1231gcc-mp-4.3: _configtest.c
1232_configtest.c:4: warning: function declaration isn't a prototype
1233_configtest.c: In function 'main':
1234_configtest.c:5: error: size of array 'test_array' is negative
1235_configtest.c:4: warning: function declaration isn't a prototype
1236_configtest.c: In function 'main':
1237_configtest.c:5: error: size of array 'test_array' is negative
1238C compiler: /opt/local/bin/gcc-mp-4.3 -DNDEBUG -g -fwrapv -O3 -Wall -Wstrict-prototypes -m64
1239
1240compile options: '-Inumpy/core/src/private -Inumpy/core/src -Inumpy/core -Inumpy/core/src/npymath -Inumpy/core/src/multiarray -Inumpy/core/src/umath -Inumpy/core/include -I/opt/local/Library/Frameworks/Python.framework/Versions/2.6/include/python2.6 -c'
1241gcc-mp-4.3: _configtest.c
1242_configtest.c:4: warning: function declaration isn't a prototype
1243_configtest.c: In function 'main':
1244_configtest.c:5: error: size of array 'test_array' is negative
1245_configtest.c:4: warning: function declaration isn't a prototype
1246_configtest.c: In function 'main':
1247_configtest.c:5: error: size of array 'test_array' is negative
1248C compiler: /opt/local/bin/gcc-mp-4.3 -DNDEBUG -g -fwrapv -O3 -Wall -Wstrict-prototypes -m64
1249
1250compile options: '-Inumpy/core/src/private -Inumpy/core/src -Inumpy/core -Inumpy/core/src/npymath -Inumpy/core/src/multiarray -Inumpy/core/src/umath -Inumpy/core/include -I/opt/local/Library/Frameworks/Python.framework/Versions/2.6/include/python2.6 -c'
1251gcc-mp-4.3: _configtest.c
1252_configtest.c:4: warning: function declaration isn't a prototype
1253_configtest.c: In function 'main':
1254_configtest.c:5: error: size of array 'test_array' is negative
1255_configtest.c:4: warning: function declaration isn't a prototype
1256_configtest.c: In function 'main':
1257_configtest.c:5: error: size of array 'test_array' is negative
1258C compiler: /opt/local/bin/gcc-mp-4.3 -DNDEBUG -g -fwrapv -O3 -Wall -Wstrict-prototypes -m64
1259
1260compile options: '-Inumpy/core/src/private -Inumpy/core/src -Inumpy/core -Inumpy/core/src/npymath -Inumpy/core/src/multiarray -Inumpy/core/src/umath -Inumpy/core/include -I/opt/local/Library/Frameworks/Python.framework/Versions/2.6/include/python2.6 -c'
1261gcc-mp-4.3: _configtest.c
1262_configtest.c:4: warning: function declaration isn't a prototype
1263_configtest.c: In function 'main':
1264_configtest.c:5: error: size of array 'test_array' is negative
1265_configtest.c:4: warning: function declaration isn't a prototype
1266_configtest.c: In function 'main':
1267_configtest.c:5: error: size of array 'test_array' is negative
1268C compiler: /opt/local/bin/gcc-mp-4.3 -DNDEBUG -g -fwrapv -O3 -Wall -Wstrict-prototypes -m64
1269
1270compile options: '-Inumpy/core/src/private -Inumpy/core/src -Inumpy/core -Inumpy/core/src/npymath -Inumpy/core/src/multiarray -Inumpy/core/src/umath -Inumpy/core/include -I/opt/local/Library/Frameworks/Python.framework/Versions/2.6/include/python2.6 -c'
1271gcc-mp-4.3: _configtest.c
1272_configtest.c:4: warning: function declaration isn't a prototype
1273_configtest.c: In function 'main':
1274_configtest.c:5: error: size of array 'test_array' is negative
1275_configtest.c:4: warning: function declaration isn't a prototype
1276_configtest.c: In function 'main':
1277_configtest.c:5: error: size of array 'test_array' is negative
1278C compiler: /opt/local/bin/gcc-mp-4.3 -DNDEBUG -g -fwrapv -O3 -Wall -Wstrict-prototypes -m64
1279
1280compile options: '-Inumpy/core/src/private -Inumpy/core/src -Inumpy/core -Inumpy/core/src/npymath -Inumpy/core/src/multiarray -Inumpy/core/src/umath -Inumpy/core/include -I/opt/local/Library/Frameworks/Python.framework/Versions/2.6/include/python2.6 -c'
1281gcc-mp-4.3: _configtest.c
1282_configtest.c:4: warning: function declaration isn't a prototype
1283removing: _configtest.c _configtest.o _configtest.c _configtest.o _configtest.c _configtest.o _configtest.c _configtest.o _configtest.c _configtest.o _configtest.c _configtest.o _configtest.c _configtest.o _configtest.c _configtest.o _configtest.c _configtest.o _configtest.c _configtest.o _configtest.c _configtest.o _configtest.c _configtest.o _configtest.c _configtest.o
1284C compiler: /opt/local/bin/gcc-mp-4.3 -DNDEBUG -g -fwrapv -O3 -Wall -Wstrict-prototypes -m64
1285
1286compile options: '-Inumpy/core/src/private -Inumpy/core/src -Inumpy/core -Inumpy/core/src/npymath -Inumpy/core/src/multiarray -Inumpy/core/src/umath -Inumpy/core/include -I/opt/local/Library/Frameworks/Python.framework/Versions/2.6/include/python2.6 -c'
1287gcc-mp-4.3: _configtest.c
1288_configtest.c:4: warning: function declaration isn't a prototype
1289removing: _configtest.c _configtest.o
1290C compiler: /opt/local/bin/gcc-mp-4.3 -DNDEBUG -g -fwrapv -O3 -Wall -Wstrict-prototypes -m64
1291
1292compile options: '-Inumpy/core/src/private -Inumpy/core/src -Inumpy/core -Inumpy/core/src/npymath -Inumpy/core/src/multiarray -Inumpy/core/src/umath -Inumpy/core/include -I/opt/local/Library/Frameworks/Python.framework/Versions/2.6/include/python2.6 -c'
1293gcc-mp-4.3: _configtest.c
1294_configtest.c:4: warning: function declaration isn't a prototype
1295removing: _configtest.c _configtest.o
1296C compiler: /opt/local/bin/gcc-mp-4.3 -DNDEBUG -g -fwrapv -O3 -Wall -Wstrict-prototypes -m64
1297
1298compile options: '-Inumpy/core/src/private -Inumpy/core/src -Inumpy/core -Inumpy/core/src/npymath -Inumpy/core/src/multiarray -Inumpy/core/src/umath -Inumpy/core/include -I/opt/local/Library/Frameworks/Python.framework/Versions/2.6/include/python2.6 -c'
1299gcc-mp-4.3: _configtest.c
1300_configtest.c:4: warning: function declaration isn't a prototype
1301removing: _configtest.c _configtest.o
1302C compiler: /opt/local/bin/gcc-mp-4.3 -DNDEBUG -g -fwrapv -O3 -Wall -Wstrict-prototypes -m64
1303
1304compile options: '-Inumpy/core/src/private -Inumpy/core/src -Inumpy/core -Inumpy/core/src/npymath -Inumpy/core/src/multiarray -Inumpy/core/src/umath -Inumpy/core/include -I/opt/local/Library/Frameworks/Python.framework/Versions/2.6/include/python2.6 -c'
1305gcc-mp-4.3: _configtest.c
1306_configtest.c:4: warning: function declaration isn't a prototype
1307removing: _configtest.c _configtest.o
1308C compiler: /opt/local/bin/gcc-mp-4.3 -DNDEBUG -g -fwrapv -O3 -Wall -Wstrict-prototypes -m64
1309
1310compile options: '-Inumpy/core/src/private -Inumpy/core/src -Inumpy/core -Inumpy/core/src/npymath -Inumpy/core/src/multiarray -Inumpy/core/src/umath -Inumpy/core/include -I/opt/local/Library/Frameworks/Python.framework/Versions/2.6/include/python2.6 -c'
1311gcc-mp-4.3: _configtest.c
1312_configtest.c:4: warning: function declaration isn't a prototype
1313removing: _configtest.c _configtest.o
1314C compiler: /opt/local/bin/gcc-mp-4.3 -DNDEBUG -g -fwrapv -O3 -Wall -Wstrict-prototypes -m64
1315
1316compile options: '-Inumpy/core/src/private -Inumpy/core/src -Inumpy/core -Inumpy/core/src/npymath -Inumpy/core/src/multiarray -Inumpy/core/src/umath -Inumpy/core/include -I/opt/local/Library/Frameworks/Python.framework/Versions/2.6/include/python2.6 -c'
1317gcc-mp-4.3: _configtest.c
1318_configtest.c:6: warning: function declaration isn't a prototype
1319removing: _configtest.c _configtest.o
1320C compiler: /opt/local/bin/gcc-mp-4.3 -DNDEBUG -g -fwrapv -O3 -Wall -Wstrict-prototypes -m64
1321
1322compile options: '-Inumpy/core/src/private -Inumpy/core/src -Inumpy/core -Inumpy/core/src/npymath -Inumpy/core/src/multiarray -Inumpy/core/src/umath -Inumpy/core/include -I/opt/local/Library/Frameworks/Python.framework/Versions/2.6/include/python2.6 -c'
1323gcc-mp-4.3: _configtest.c
1324_configtest.c:6: warning: function declaration isn't a prototype
1325_configtest.c: In function 'main':
1326_configtest.c:7: error: size of array 'test_array' is negative
1327_configtest.c:6: warning: function declaration isn't a prototype
1328_configtest.c: In function 'main':
1329_configtest.c:7: error: size of array 'test_array' is negative
1330C compiler: /opt/local/bin/gcc-mp-4.3 -DNDEBUG -g -fwrapv -O3 -Wall -Wstrict-prototypes -m64
1331
1332compile options: '-Inumpy/core/src/private -Inumpy/core/src -Inumpy/core -Inumpy/core/src/npymath -Inumpy/core/src/multiarray -Inumpy/core/src/umath -Inumpy/core/include -I/opt/local/Library/Frameworks/Python.framework/Versions/2.6/include/python2.6 -c'
1333gcc-mp-4.3: _configtest.c
1334_configtest.c:6: warning: function declaration isn't a prototype
1335removing: _configtest.c _configtest.o _configtest.c _configtest.o
1336C compiler: /opt/local/bin/gcc-mp-4.3 -DNDEBUG -g -fwrapv -O3 -Wall -Wstrict-prototypes -m64
1337
1338compile options: '-Inumpy/core/src/private -Inumpy/core/src -Inumpy/core -Inumpy/core/src/npymath -Inumpy/core/src/multiarray -Inumpy/core/src/umath -Inumpy/core/include -I/opt/local/Library/Frameworks/Python.framework/Versions/2.6/include/python2.6 -c'
1339gcc-mp-4.3: _configtest.c
1340_configtest.c:5: warning: function declaration isn't a prototype
1341success!
1342removing: _configtest.c _configtest.o
1343C compiler: /opt/local/bin/gcc-mp-4.3 -DNDEBUG -g -fwrapv -O3 -Wall -Wstrict-prototypes -m64
1344
1345compile options: '-Inumpy/core/src/private -Inumpy/core/src -Inumpy/core -Inumpy/core/src/npymath -Inumpy/core/src/multiarray -Inumpy/core/src/umath -Inumpy/core/include -I/opt/local/Library/Frameworks/Python.framework/Versions/2.6/include/python2.6 -c'
1346gcc-mp-4.3: _configtest.c
1347_configtest.c:6: warning: function declaration isn't a prototype
1348removing: _configtest.c _configtest.o
1349C compiler: /opt/local/bin/gcc-mp-4.3 -DNDEBUG -g -fwrapv -O3 -Wall -Wstrict-prototypes -m64
1350
1351compile options: '-Inumpy/core/src/private -Inumpy/core/src -Inumpy/core -Inumpy/core/src/npymath -Inumpy/core/src/multiarray -Inumpy/core/src/umath -Inumpy/core/include -I/opt/local/Library/Frameworks/Python.framework/Versions/2.6/include/python2.6 -c'
1352gcc-mp-4.3: _configtest.c
1353_configtest.c:6: warning: function declaration isn't a prototype
1354removing: _configtest.c _configtest.o
1355C compiler: /opt/local/bin/gcc-mp-4.3 -DNDEBUG -g -fwrapv -O3 -Wall -Wstrict-prototypes -m64
1356
1357compile options: '-Inumpy/core/src/private -Inumpy/core/src -Inumpy/core -Inumpy/core/src/npymath -Inumpy/core/src/multiarray -Inumpy/core/src/umath -Inumpy/core/include -I/opt/local/Library/Frameworks/Python.framework/Versions/2.6/include/python2.6 -c'
1358gcc-mp-4.3: _configtest.c
1359_configtest.c:4: warning: function declaration isn't a prototype
1360removing: _configtest.c _configtest.o
1361C compiler: /opt/local/bin/gcc-mp-4.3 -DNDEBUG -g -fwrapv -O3 -Wall -Wstrict-prototypes -m64
1362
1363compile options: '-Inumpy/core/src/private -Inumpy/core/src -Inumpy/core -Inumpy/core/src/npymath -Inumpy/core/src/multiarray -Inumpy/core/src/umath -Inumpy/core/include -I/opt/local/Library/Frameworks/Python.framework/Versions/2.6/include/python2.6 -c'
1364gcc-mp-4.3: _configtest.c
1365_configtest.c:4: warning: function declaration isn't a prototype
1366removing: _configtest.c _configtest.o
1367C compiler: /opt/local/bin/gcc-mp-4.3 -DNDEBUG -g -fwrapv -O3 -Wall -Wstrict-prototypes -m64
1368
1369compile options: '-Inumpy/core/src/private -Inumpy/core/src -Inumpy/core -Inumpy/core/src/npymath -Inumpy/core/src/multiarray -Inumpy/core/src/umath -Inumpy/core/include -I/opt/local/Library/Frameworks/Python.framework/Versions/2.6/include/python2.6 -c'
1370gcc-mp-4.3: _configtest.c
1371_configtest.c:5: warning: function declaration isn't a prototype
1372success!
1373removing: _configtest.c _configtest.o
1374C compiler: /opt/local/bin/gcc-mp-4.3 -DNDEBUG -g -fwrapv -O3 -Wall -Wstrict-prototypes -m64
1375
1376compile options: '-Inumpy/core/src/private -Inumpy/core/src -Inumpy/core -Inumpy/core/src/npymath -Inumpy/core/src/multiarray -Inumpy/core/src/umath -Inumpy/core/include -I/opt/local/Library/Frameworks/Python.framework/Versions/2.6/include/python2.6 -c'
1377gcc-mp-4.3: _configtest.c
1378_configtest.c:1: warning: conflicting types for built-in function 'exp'
1379/opt/local/bin/gcc-mp-4.3 _configtest.o -o _configtest
1380success!
1381removing: _configtest.c _configtest.o _configtest
1382C compiler: /opt/local/bin/gcc-mp-4.3 -DNDEBUG -g -fwrapv -O3 -Wall -Wstrict-prototypes -m64
1383
1384compile options: '-Inumpy/core/src/private -Inumpy/core/src -Inumpy/core -Inumpy/core/src/npymath -Inumpy/core/src/multiarray -Inumpy/core/src/umath -Inumpy/core/include -I/opt/local/Library/Frameworks/Python.framework/Versions/2.6/include/python2.6 -c'
1385gcc-mp-4.3: _configtest.c
1386_configtest.c:1: warning: conflicting types for built-in function 'asin'
1387_configtest.c:2: warning: conflicting types for built-in function 'cos'
1388_configtest.c:3: warning: conflicting types for built-in function 'log'
1389_configtest.c:4: warning: conflicting types for built-in function 'fabs'
1390_configtest.c:5: warning: conflicting types for built-in function 'tanh'
1391_configtest.c:6: warning: conflicting types for built-in function 'atan'
1392_configtest.c:7: warning: conflicting types for built-in function 'acos'
1393_configtest.c:8: warning: conflicting types for built-in function 'floor'
1394_configtest.c:9: warning: conflicting types for built-in function 'fmod'
1395_configtest.c:10: warning: conflicting types for built-in function 'sqrt'
1396_configtest.c:11: warning: conflicting types for built-in function 'cosh'
1397_configtest.c:12: warning: conflicting types for built-in function 'modf'
1398_configtest.c:13: warning: conflicting types for built-in function 'sinh'
1399_configtest.c:14: warning: conflicting types for built-in function 'frexp'
1400_configtest.c:15: warning: conflicting types for built-in function 'exp'
1401_configtest.c:16: warning: conflicting types for built-in function 'tan'
1402_configtest.c:17: warning: conflicting types for built-in function 'ceil'
1403_configtest.c:18: warning: conflicting types for built-in function 'log10'
1404_configtest.c:19: warning: conflicting types for built-in function 'sin'
1405_configtest.c:20: warning: conflicting types for built-in function 'ldexp'
1406/opt/local/bin/gcc-mp-4.3 _configtest.o -o _configtest
1407success!
1408removing: _configtest.c _configtest.o _configtest
1409C compiler: /opt/local/bin/gcc-mp-4.3 -DNDEBUG -g -fwrapv -O3 -Wall -Wstrict-prototypes -m64
1410
1411compile options: '-Inumpy/core/src/private -Inumpy/core/src -Inumpy/core -Inumpy/core/src/npymath -Inumpy/core/src/multiarray -Inumpy/core/src/umath -Inumpy/core/include -I/opt/local/Library/Frameworks/Python.framework/Versions/2.6/include/python2.6 -c'
1412gcc-mp-4.3: _configtest.c
1413_configtest.c:6: warning: function declaration isn't a prototype
1414success!
1415removing: _configtest.c _configtest.o
1416C compiler: /opt/local/bin/gcc-mp-4.3 -DNDEBUG -g -fwrapv -O3 -Wall -Wstrict-prototypes -m64
1417
1418compile options: '-Inumpy/core/src/private -Inumpy/core/src -Inumpy/core -Inumpy/core/src/npymath -Inumpy/core/src/multiarray -Inumpy/core/src/umath -Inumpy/core/include -I/opt/local/Library/Frameworks/Python.framework/Versions/2.6/include/python2.6 -c'
1419gcc-mp-4.3: _configtest.c
1420_configtest.c:6: warning: function declaration isn't a prototype
1421success!
1422removing: _configtest.c _configtest.o
1423C compiler: /opt/local/bin/gcc-mp-4.3 -DNDEBUG -g -fwrapv -O3 -Wall -Wstrict-prototypes -m64
1424
1425compile options: '-Inumpy/core/src/private -Inumpy/core/src -Inumpy/core -Inumpy/core/src/npymath -Inumpy/core/src/multiarray -Inumpy/core/src/umath -Inumpy/core/include -I/opt/local/Library/Frameworks/Python.framework/Versions/2.6/include/python2.6 -c'
1426gcc-mp-4.3: _configtest.c
1427_configtest.c:6: warning: function declaration isn't a prototype
1428success!
1429removing: _configtest.c _configtest.o
1430C compiler: /opt/local/bin/gcc-mp-4.3 -DNDEBUG -g -fwrapv -O3 -Wall -Wstrict-prototypes -m64
1431
1432compile options: '-Inumpy/core/src/private -Inumpy/core/src -Inumpy/core -Inumpy/core/src/npymath -Inumpy/core/src/multiarray -Inumpy/core/src/umath -Inumpy/core/include -I/opt/local/Library/Frameworks/Python.framework/Versions/2.6/include/python2.6 -c'
1433gcc-mp-4.3: _configtest.c
1434_configtest.c:6: warning: function declaration isn't a prototype
1435success!
1436removing: _configtest.c _configtest.o
1437C compiler: /opt/local/bin/gcc-mp-4.3 -DNDEBUG -g -fwrapv -O3 -Wall -Wstrict-prototypes -m64
1438
1439compile options: '-Inumpy/core/src/private -Inumpy/core/src -Inumpy/core -Inumpy/core/src/npymath -Inumpy/core/src/multiarray -Inumpy/core/src/umath -Inumpy/core/include -I/opt/local/Library/Frameworks/Python.framework/Versions/2.6/include/python2.6 -c'
1440gcc-mp-4.3: _configtest.c
1441_configtest.c:6: warning: function declaration isn't a prototype
1442success!
1443removing: _configtest.c _configtest.o
1444C compiler: /opt/local/bin/gcc-mp-4.3 -DNDEBUG -g -fwrapv -O3 -Wall -Wstrict-prototypes -m64
1445
1446compile options: '-Inumpy/core/src/private -Inumpy/core/src -Inumpy/core -Inumpy/core/src/npymath -Inumpy/core/src/multiarray -Inumpy/core/src/umath -Inumpy/core/include -I/opt/local/Library/Frameworks/Python.framework/Versions/2.6/include/python2.6 -c'
1447gcc-mp-4.3: _configtest.c
1448_configtest.c:6: warning: function declaration isn't a prototype
1449success!
1450removing: _configtest.c _configtest.o
1451C compiler: /opt/local/bin/gcc-mp-4.3 -DNDEBUG -g -fwrapv -O3 -Wall -Wstrict-prototypes -m64
1452
1453compile options: '-Inumpy/core/src/private -Inumpy/core/src -Inumpy/core -Inumpy/core/src/npymath -Inumpy/core/src/multiarray -Inumpy/core/src/umath -Inumpy/core/include -I/opt/local/Library/Frameworks/Python.framework/Versions/2.6/include/python2.6 -c'
1454gcc-mp-4.3: _configtest.c
1455_configtest.c:6: warning: function declaration isn't a prototype
1456success!
1457removing: _configtest.c _configtest.o
1458C compiler: /opt/local/bin/gcc-mp-4.3 -DNDEBUG -g -fwrapv -O3 -Wall -Wstrict-prototypes -m64
1459
1460compile options: '-Inumpy/core/src/private -Inumpy/core/src -Inumpy/core -Inumpy/core/src/npymath -Inumpy/core/src/multiarray -Inumpy/core/src/umath -Inumpy/core/include -I/opt/local/Library/Frameworks/Python.framework/Versions/2.6/include/python2.6 -c'
1461gcc-mp-4.3: _configtest.c
1462_configtest.c:1: warning: conflicting types for built-in function 'log2'
1463_configtest.c:2: warning: conflicting types for built-in function 'pow'
1464_configtest.c:3: warning: conflicting types for built-in function 'exp2'
1465_configtest.c:4: warning: conflicting types for built-in function 'atan2'
1466_configtest.c:5: warning: conflicting types for built-in function 'rint'
1467_configtest.c:6: warning: conflicting types for built-in function 'nextafter'
1468_configtest.c:7: warning: conflicting types for built-in function 'trunc'
1469/opt/local/bin/gcc-mp-4.3 _configtest.o -o _configtest
1470success!
1471removing: _configtest.c _configtest.o _configtest
1472C compiler: /opt/local/bin/gcc-mp-4.3 -DNDEBUG -g -fwrapv -O3 -Wall -Wstrict-prototypes -m64
1473
1474compile options: '-Inumpy/core/src/private -Inumpy/core/src -Inumpy/core -Inumpy/core/src/npymath -Inumpy/core/src/multiarray -Inumpy/core/src/umath -Inumpy/core/include -I/opt/local/Library/Frameworks/Python.framework/Versions/2.6/include/python2.6 -c'
1475gcc-mp-4.3: _configtest.c
1476_configtest.c:1: warning: conflicting types for built-in function 'cosf'
1477_configtest.c:2: warning: conflicting types for built-in function 'coshf'
1478_configtest.c:3: warning: conflicting types for built-in function 'rintf'
1479_configtest.c:4: warning: conflicting types for built-in function 'fabsf'
1480_configtest.c:5: warning: conflicting types for built-in function 'floorf'
1481_configtest.c:6: warning: conflicting types for built-in function 'nextafterf'
1482_configtest.c:7: warning: conflicting types for built-in function 'tanhf'
1483_configtest.c:8: warning: conflicting types for built-in function 'log10f'
1484_configtest.c:9: warning: conflicting types for built-in function 'logf'
1485_configtest.c:10: warning: conflicting types for built-in function 'sinhf'
1486_configtest.c:11: warning: conflicting types for built-in function 'acosf'
1487_configtest.c:12: warning: conflicting types for built-in function 'sqrtf'
1488_configtest.c:13: warning: conflicting types for built-in function 'ldexpf'
1489_configtest.c:14: warning: conflicting types for built-in function 'hypotf'
1490_configtest.c:15: warning: conflicting types for built-in function 'log2f'
1491_configtest.c:16: warning: conflicting types for built-in function 'exp2f'
1492_configtest.c:17: warning: conflicting types for built-in function 'atanf'
1493_configtest.c:18: warning: conflicting types for built-in function 'fmodf'
1494_configtest.c:19: warning: conflicting types for built-in function 'atan2f'
1495_configtest.c:20: warning: conflicting types for built-in function 'modff'
1496_configtest.c:21: warning: conflicting types for built-in function 'ceilf'
1497_configtest.c:22: warning: conflicting types for built-in function 'log1pf'
1498_configtest.c:23: warning: conflicting types for built-in function 'asinf'
1499_configtest.c:24: warning: conflicting types for built-in function 'copysignf'
1500_configtest.c:25: warning: conflicting types for built-in function 'acoshf'
1501_configtest.c:26: warning: conflicting types for built-in function 'sinf'
1502_configtest.c:27: warning: conflicting types for built-in function 'tanf'
1503_configtest.c:28: warning: conflicting types for built-in function 'atanhf'
1504_configtest.c:29: warning: conflicting types for built-in function 'truncf'
1505_configtest.c:30: warning: conflicting types for built-in function 'asinhf'
1506_configtest.c:31: warning: conflicting types for built-in function 'frexpf'
1507_configtest.c:32: warning: conflicting types for built-in function 'powf'
1508_configtest.c:33: warning: conflicting types for built-in function 'expf'
1509_configtest.c:34: warning: conflicting types for built-in function 'expm1f'
1510/opt/local/bin/gcc-mp-4.3 _configtest.o -o _configtest
1511success!
1512removing: _configtest.c _configtest.o _configtest
1513C compiler: /opt/local/bin/gcc-mp-4.3 -DNDEBUG -g -fwrapv -O3 -Wall -Wstrict-prototypes -m64
1514
1515compile options: '-Inumpy/core/src/private -Inumpy/core/src -Inumpy/core -Inumpy/core/src/npymath -Inumpy/core/src/multiarray -Inumpy/core/src/umath -Inumpy/core/include -I/opt/local/Library/Frameworks/Python.framework/Versions/2.6/include/python2.6 -c'
1516gcc-mp-4.3: _configtest.c
1517_configtest.c:1: warning: conflicting types for built-in function 'tanhl'
1518_configtest.c:2: warning: conflicting types for built-in function 'log10l'
1519_configtest.c:3: warning: conflicting types for built-in function 'nextafterl'
1520_configtest.c:4: warning: conflicting types for built-in function 'coshl'
1521_configtest.c:5: warning: conflicting types for built-in function 'cosl'
1522_configtest.c:6: warning: conflicting types for built-in function 'floorl'
1523_configtest.c:7: warning: conflicting types for built-in function 'rintl'
1524_configtest.c:8: warning: conflicting types for built-in function 'fabsl'
1525_configtest.c:9: warning: conflicting types for built-in function 'acosl'
1526_configtest.c:10: warning: conflicting types for built-in function 'ldexpl'
1527_configtest.c:11: warning: conflicting types for built-in function 'sqrtl'
1528_configtest.c:12: warning: conflicting types for built-in function 'logl'
1529_configtest.c:13: warning: conflicting types for built-in function 'expm1l'
1530_configtest.c:14: warning: conflicting types for built-in function 'hypotl'
1531_configtest.c:15: warning: conflicting types for built-in function 'log2l'
1532_configtest.c:16: warning: conflicting types for built-in function 'copysignl'
1533_configtest.c:17: warning: conflicting types for built-in function 'exp2l'
1534_configtest.c:18: warning: conflicting types for built-in function 'atanl'
1535_configtest.c:19: warning: conflicting types for built-in function 'frexpl'
1536_configtest.c:20: warning: conflicting types for built-in function 'atan2l'
1537_configtest.c:21: warning: conflicting types for built-in function 'sinhl'
1538_configtest.c:22: warning: conflicting types for built-in function 'fmodl'
1539_configtest.c:23: warning: conflicting types for built-in function 'log1pl'
1540_configtest.c:24: warning: conflicting types for built-in function 'asinl'
1541_configtest.c:25: warning: conflicting types for built-in function 'ceill'
1542_configtest.c:26: warning: conflicting types for built-in function 'sinl'
1543_configtest.c:27: warning: conflicting types for built-in function 'acoshl'
1544_configtest.c:28: warning: conflicting types for built-in function 'atanhl'
1545_configtest.c:29: warning: conflicting types for built-in function 'tanl'
1546_configtest.c:30: warning: conflicting types for built-in function 'truncl'
1547_configtest.c:31: warning: conflicting types for built-in function 'powl'
1548_configtest.c:32: warning: conflicting types for built-in function 'expl'
1549_configtest.c:33: warning: conflicting types for built-in function 'modfl'
1550_configtest.c:34: warning: conflicting types for built-in function 'asinhl'
1551/opt/local/bin/gcc-mp-4.3 _configtest.o -o _configtest
1552success!
1553removing: _configtest.c _configtest.o _configtest
1554C compiler: /opt/local/bin/gcc-mp-4.3 -DNDEBUG -g -fwrapv -O3 -Wall -Wstrict-prototypes -m64
1555
1556compile options: '-Inumpy/core/src/private -Inumpy/core/src -Inumpy/core -Inumpy/core/src/npymath -Inumpy/core/src/multiarray -Inumpy/core/src/umath -Inumpy/core/include -I/opt/local/Library/Frameworks/Python.framework/Versions/2.6/include/python2.6 -c'
1557gcc-mp-4.3: _configtest.c
1558_configtest.c:6: warning: function declaration isn't a prototype
1559success!
1560removing: _configtest.c _configtest.o
1561C compiler: /opt/local/bin/gcc-mp-4.3 -DNDEBUG -g -fwrapv -O3 -Wall -Wstrict-prototypes -m64
1562
1563compile options: '-Inumpy/core/src/private -Inumpy/core/src -Inumpy/core -Inumpy/core/src/npymath -Inumpy/core/src/multiarray -Inumpy/core/src/umath -Inumpy/core/include -I/opt/local/Library/Frameworks/Python.framework/Versions/2.6/include/python2.6 -c'
1564gcc-mp-4.3: _configtest.c
1565_configtest.c:6: warning: function declaration isn't a prototype
1566success!
1567removing: _configtest.c _configtest.o
1568C compiler: /opt/local/bin/gcc-mp-4.3 -DNDEBUG -g -fwrapv -O3 -Wall -Wstrict-prototypes -m64
1569
1570compile options: '-Inumpy/core/src/private -Inumpy/core/src -Inumpy/core -Inumpy/core/src/npymath -Inumpy/core/src/multiarray -Inumpy/core/src/umath -Inumpy/core/include -I/opt/local/Library/Frameworks/Python.framework/Versions/2.6/include/python2.6 -c'
1571gcc-mp-4.3: _configtest.c
1572_configtest.c:6: warning: function declaration isn't a prototype
1573_configtest.c: In function 'main':
1574_configtest.c:8: error: 'HAVE_DECL_SIGNBIT' undeclared (first use in this function)
1575_configtest.c:8: error: (Each undeclared identifier is reported only once
1576_configtest.c:8: error: for each function it appears in.)
1577_configtest.c:6: warning: function declaration isn't a prototype
1578_configtest.c: In function 'main':
1579_configtest.c:8: error: 'HAVE_DECL_SIGNBIT' undeclared (first use in this function)
1580_configtest.c:8: error: (Each undeclared identifier is reported only once
1581_configtest.c:8: error: for each function it appears in.)
1582failure.
1583removing: _configtest.c _configtest.o
1584C compiler: /opt/local/bin/gcc-mp-4.3 -DNDEBUG -g -fwrapv -O3 -Wall -Wstrict-prototypes -m64
1585
1586compile options: '-Inumpy/core/src/private -Inumpy/core/src -Inumpy/core -Inumpy/core/src/npymath -Inumpy/core/src/multiarray -Inumpy/core/src/umath -Inumpy/core/include -I/opt/local/Library/Frameworks/Python.framework/Versions/2.6/include/python2.6 -c'
1587gcc-mp-4.3: _configtest.c
1588_configtest.c:6: warning: function declaration isn't a prototype
1589success!
1590removing: _configtest.c _configtest.o
1591C compiler: /opt/local/bin/gcc-mp-4.3 -DNDEBUG -g -fwrapv -O3 -Wall -Wstrict-prototypes -m64
1592
1593compile options: '-Inumpy/core/src/private -Inumpy/core/src -Inumpy/core -Inumpy/core/src/npymath -Inumpy/core/src/multiarray -Inumpy/core/src/umath -Inumpy/core/include -I/opt/local/Library/Frameworks/Python.framework/Versions/2.6/include/python2.6 -c'
1594gcc-mp-4.3: _configtest.c
1595_configtest.c:6: warning: function declaration isn't a prototype
1596success!
1597removing: _configtest.c _configtest.o
1598C compiler: /opt/local/bin/gcc-mp-4.3 -DNDEBUG -g -fwrapv -O3 -Wall -Wstrict-prototypes -m64
1599
1600compile options: '-Inumpy/core/src/private -Inumpy/core/src -Inumpy/core -Inumpy/core/src/npymath -Inumpy/core/src/multiarray -Inumpy/core/src/umath -Inumpy/core/include -I/opt/local/Library/Frameworks/Python.framework/Versions/2.6/include/python2.6 -c'
1601gcc-mp-4.3: _configtest.c
1602success!
1603removing: _configtest.c _configtest.o
1604C compiler: /opt/local/bin/gcc-mp-4.3 -DNDEBUG -g -fwrapv -O3 -Wall -Wstrict-prototypes -m64
1605
1606compile options: '-Inumpy/core/src/private -Inumpy/core/src -Inumpy/core -Inumpy/core/src/npymath -Inumpy/core/src/multiarray -Inumpy/core/src/umath -Inumpy/core/include -I/opt/local/Library/Frameworks/Python.framework/Versions/2.6/include/python2.6 -c'
1607gcc-mp-4.3: _configtest.c
1608_configtest.c:4: warning: function declaration isn't a prototype
1609removing: _configtest.c _configtest.o
1610C compiler: /opt/local/bin/gcc-mp-4.3 -DNDEBUG -g -fwrapv -O3 -Wall -Wstrict-prototypes -m64
1611
1612compile options: '-Inumpy/core/src/private -Inumpy/core/src -Inumpy/core -Inumpy/core/src/npymath -Inumpy/core/src/multiarray -Inumpy/core/src/umath -Inumpy/core/include -I/opt/local/Library/Frameworks/Python.framework/Versions/2.6/include/python2.6 -c'
1613gcc-mp-4.3: _configtest.c
1614_configtest.c:4: warning: function declaration isn't a prototype
1615removing: _configtest.c _configtest.o
1616C compiler: /opt/local/bin/gcc-mp-4.3 -DNDEBUG -g -fwrapv -O3 -Wall -Wstrict-prototypes -m64
1617
1618compile options: '-Inumpy/core/src/private -Inumpy/core/src -Inumpy/core -Inumpy/core/src/npymath -Inumpy/core/src/multiarray -Inumpy/core/src/umath -Inumpy/core/include -I/opt/local/Library/Frameworks/Python.framework/Versions/2.6/include/python2.6 -c'
1619gcc-mp-4.3: _configtest.c
1620_configtest.c:4: warning: function declaration isn't a prototype
1621removing: _configtest.c _configtest.o
1622C compiler: /opt/local/bin/gcc-mp-4.3 -DNDEBUG -g -fwrapv -O3 -Wall -Wstrict-prototypes -m64
1623
1624compile options: '-Inumpy/core/src/private -Inumpy/core/src -Inumpy/core -Inumpy/core/src/npymath -Inumpy/core/src/multiarray -Inumpy/core/src/umath -Inumpy/core/include -I/opt/local/Library/Frameworks/Python.framework/Versions/2.6/include/python2.6 -c'
1625gcc-mp-4.3: _configtest.c
1626success!
1627removing: _configtest.c _configtest.o
1628C compiler: /opt/local/bin/gcc-mp-4.3 -DNDEBUG -g -fwrapv -O3 -Wall -Wstrict-prototypes -m64
1629
1630compile options: '-Inumpy/core/src/private -Inumpy/core/src -Inumpy/core -Inumpy/core/src/npymath -Inumpy/core/src/multiarray -Inumpy/core/src/umath -Inumpy/core/include -I/opt/local/Library/Frameworks/Python.framework/Versions/2.6/include/python2.6 -c'
1631gcc-mp-4.3: _configtest.c
1632_configtest.c:5: warning: function declaration isn't a prototype
1633_configtest.c: In function 'main':
1634_configtest.c:7: error: 'Py_UNICODE_WIDE' undeclared (first use in this function)
1635_configtest.c:7: error: (Each undeclared identifier is reported only once
1636_configtest.c:7: error: for each function it appears in.)
1637_configtest.c:5: warning: function declaration isn't a prototype
1638_configtest.c: In function 'main':
1639_configtest.c:7: error: 'Py_UNICODE_WIDE' undeclared (first use in this function)
1640_configtest.c:7: error: (Each undeclared identifier is reported only once
1641_configtest.c:7: error: for each function it appears in.)
1642failure.
1643removing: _configtest.c _configtest.o
1644File: build/src.macosx-10.6-x86_64-2.6/numpy/core/include/numpy/config.h
1645#define SIZEOF_PY_INTPTR_T 8
1646#define SIZEOF_PY_LONG_LONG 8
1647#define MATHLIB
1648#define HAVE_SIN
1649#define HAVE_COS
1650#define HAVE_TAN
1651#define HAVE_SINH
1652#define HAVE_COSH
1653#define HAVE_TANH
1654#define HAVE_FABS
1655#define HAVE_FLOOR
1656#define HAVE_CEIL
1657#define HAVE_SQRT
1658#define HAVE_LOG10
1659#define HAVE_LOG
1660#define HAVE_EXP
1661#define HAVE_ASIN
1662#define HAVE_ACOS
1663#define HAVE_ATAN
1664#define HAVE_FMOD
1665#define HAVE_MODF
1666#define HAVE_FREXP
1667#define HAVE_LDEXP
1668#define HAVE_RINT
1669#define HAVE_TRUNC
1670#define HAVE_EXP2
1671#define HAVE_LOG2
1672#define HAVE_ATAN2
1673#define HAVE_POW
1674#define HAVE_NEXTAFTER
1675#define HAVE_SINF
1676#define HAVE_COSF
1677#define HAVE_TANF
1678#define HAVE_SINHF
1679#define HAVE_COSHF
1680#define HAVE_TANHF
1681#define HAVE_FABSF
1682#define HAVE_FLOORF
1683#define HAVE_CEILF
1684#define HAVE_RINTF
1685#define HAVE_TRUNCF
1686#define HAVE_SQRTF
1687#define HAVE_LOG10F
1688#define HAVE_LOGF
1689#define HAVE_LOG1PF
1690#define HAVE_EXPF
1691#define HAVE_EXPM1F
1692#define HAVE_ASINF
1693#define HAVE_ACOSF
1694#define HAVE_ATANF
1695#define HAVE_ASINHF
1696#define HAVE_ACOSHF
1697#define HAVE_ATANHF
1698#define HAVE_HYPOTF
1699#define HAVE_ATAN2F
1700#define HAVE_POWF
1701#define HAVE_FMODF
1702#define HAVE_MODFF
1703#define HAVE_FREXPF
1704#define HAVE_LDEXPF
1705#define HAVE_EXP2F
1706#define HAVE_LOG2F
1707#define HAVE_COPYSIGNF
1708#define HAVE_NEXTAFTERF
1709#define HAVE_SINL
1710#define HAVE_COSL
1711#define HAVE_TANL
1712#define HAVE_SINHL
1713#define HAVE_COSHL
1714#define HAVE_TANHL
1715#define HAVE_FABSL
1716#define HAVE_FLOORL
1717#define HAVE_CEILL
1718#define HAVE_RINTL
1719#define HAVE_TRUNCL
1720#define HAVE_SQRTL
1721#define HAVE_LOG10L
1722#define HAVE_LOGL
1723#define HAVE_LOG1PL
1724#define HAVE_EXPL
1725#define HAVE_EXPM1L
1726#define HAVE_ASINL
1727#define HAVE_ACOSL
1728#define HAVE_ATANL
1729#define HAVE_ASINHL
1730#define HAVE_ACOSHL
1731#define HAVE_ATANHL
1732#define HAVE_HYPOTL
1733#define HAVE_ATAN2L
1734#define HAVE_POWL
1735#define HAVE_FMODL
1736#define HAVE_MODFL
1737#define HAVE_FREXPL
1738#define HAVE_LDEXPL
1739#define HAVE_EXP2L
1740#define HAVE_LOG2L
1741#define HAVE_COPYSIGNL
1742#define HAVE_NEXTAFTERL
1743#define HAVE_DECL_SIGNBIT
1744#define HAVE_COMPLEX_H
1745#ifndef __cplusplus
1746/* #undef inline */
1747#endif
1748
1749#ifndef _NPY_NPY_CONFIG_H_
1750#error config.h should never be included directly, include npy_config.h instead
1751#endif
1752
1753EOF
1754  adding 'build/src.macosx-10.6-x86_64-2.6/numpy/core/include/numpy/config.h' to sources.
1755Generating build/src.macosx-10.6-x86_64-2.6/numpy/core/include/numpy/_numpyconfig.h
1756C compiler: /opt/local/bin/gcc-mp-4.3 -DNDEBUG -g -fwrapv -O3 -Wall -Wstrict-prototypes -m64
1757
1758compile options: '-Inumpy/core/src/private -Inumpy/core/src -Inumpy/core -Inumpy/core/src/npymath -Inumpy/core/src/multiarray -Inumpy/core/src/umath -Inumpy/core/include -I/opt/local/Library/Frameworks/Python.framework/Versions/2.6/include/python2.6 -c'
1759gcc-mp-4.3: _configtest.c
1760_configtest.c:1: warning: conflicting types for built-in function 'exp'
1761/opt/local/bin/gcc-mp-4.3 _configtest.o -o _configtest
1762success!
1763removing: _configtest.c _configtest.o _configtest
1764C compiler: /opt/local/bin/gcc-mp-4.3 -DNDEBUG -g -fwrapv -O3 -Wall -Wstrict-prototypes -m64
1765
1766compile options: '-Inumpy/core/src/private -Inumpy/core/src -Inumpy/core -Inumpy/core/src/npymath -Inumpy/core/src/multiarray -Inumpy/core/src/umath -Inumpy/core/include -I/opt/local/Library/Frameworks/Python.framework/Versions/2.6/include/python2.6 -c'
1767gcc-mp-4.3: _configtest.c
1768_configtest.c:5: warning: function declaration isn't a prototype
1769success!
1770removing: _configtest.c _configtest.o
1771C compiler: /opt/local/bin/gcc-mp-4.3 -DNDEBUG -g -fwrapv -O3 -Wall -Wstrict-prototypes -m64
1772
1773compile options: '-Inumpy/core/src/private -Inumpy/core/src -Inumpy/core -Inumpy/core/src/npymath -Inumpy/core/src/multiarray -Inumpy/core/src/umath -Inumpy/core/include -I/opt/local/Library/Frameworks/Python.framework/Versions/2.6/include/python2.6 -c'
1774gcc-mp-4.3: _configtest.c
1775_configtest.c:4: warning: function declaration isn't a prototype
1776_configtest.c:5:18: warning: extra tokens at end of #ifndef directive
1777_configtest.c: In function 'main':
1778_configtest.c:8: warning: control reaches end of non-void function
1779success!
1780removing: _configtest.c _configtest.o
1781File: build/src.macosx-10.6-x86_64-2.6/numpy/core/include/numpy/_numpyconfig.h
1782#define NPY_SIZEOF_SHORT SIZEOF_SHORT
1783#define NPY_SIZEOF_INT SIZEOF_INT
1784#define NPY_SIZEOF_LONG SIZEOF_LONG
1785#define NPY_SIZEOF_FLOAT 4
1786#define NPY_SIZEOF_COMPLEX_FLOAT 8
1787#define NPY_SIZEOF_DOUBLE 8
1788#define NPY_SIZEOF_COMPLEX_DOUBLE 16
1789#define NPY_SIZEOF_LONGDOUBLE 16
1790#define NPY_SIZEOF_COMPLEX_LONGDOUBLE 32
1791#define NPY_SIZEOF_PY_INTPTR_T 8
1792#define NPY_SIZEOF_PY_LONG_LONG 8
1793#define NPY_SIZEOF_LONGLONG 8
1794#define NPY_NO_SMP 0
1795#define NPY_HAVE_DECL_SIGNBIT
1796#define NPY_USE_C99_COMPLEX
1797#define NPY_HAVE_COMPLEX_DOUBLE 1
1798#define NPY_HAVE_COMPLEX_FLOAT 1
1799#define NPY_HAVE_COMPLEX_LONG_DOUBLE 1
1800#define NPY_USE_C99_FORMATS 1
1801#define NPY_VISIBILITY_HIDDEN __attribute__((visibility("hidden")))
1802#define NPY_ABI_VERSION 0x01000009
1803#define NPY_API_VERSION 0x00000004
1804
1805#ifndef __STDC_FORMAT_MACROS
1806#define __STDC_FORMAT_MACROS 1
1807#endif
1808
1809EOF
1810  adding 'build/src.macosx-10.6-x86_64-2.6/numpy/core/include/numpy/_numpyconfig.h' to sources.
1811executing numpy/core/code_generators/generate_numpy_api.py
1812  adding 'build/src.macosx-10.6-x86_64-2.6/numpy/core/include/numpy/__multiarray_api.h' to sources.
1813conv_template:> build/src.macosx-10.6-x86_64-2.6/numpy/core/src/_sortmodule.c
1814numpy.core - nothing done with h_files = ['build/src.macosx-10.6-x86_64-2.6/numpy/core/include/numpy/config.h', 'build/src.macosx-10.6-x86_64-2.6/numpy/core/include/numpy/_numpyconfig.h', 'build/src.macosx-10.6-x86_64-2.6/numpy/core/include/numpy/__multiarray_api.h']
1815building extension "numpy.core.multiarray" sources
1816non-existing path in 'numpy/core': 'build/src.macosx-10.6-x86_64-2.6/numpy/core/src/multiarray'
1817creating build/src.macosx-10.6-x86_64-2.6/numpy/core/src/multiarray
1818conv_template:> build/src.macosx-10.6-x86_64-2.6/numpy/core/src/multiarray/scalartypes.c
1819conv_template:> build/src.macosx-10.6-x86_64-2.6/numpy/core/src/multiarray/arraytypes.c
1820  adding 'build/src.macosx-10.6-x86_64-2.6/numpy/core/include/numpy/config.h' to sources.
1821  adding 'build/src.macosx-10.6-x86_64-2.6/numpy/core/include/numpy/_numpyconfig.h' to sources.
1822executing numpy/core/code_generators/generate_numpy_api.py
1823  adding 'build/src.macosx-10.6-x86_64-2.6/numpy/core/include/numpy/__multiarray_api.h' to sources.
1824numpy.core - nothing done with h_files = ['build/src.macosx-10.6-x86_64-2.6/numpy/core/include/numpy/config.h', 'build/src.macosx-10.6-x86_64-2.6/numpy/core/include/numpy/_numpyconfig.h', 'build/src.macosx-10.6-x86_64-2.6/numpy/core/include/numpy/__multiarray_api.h']
1825building extension "numpy.core.umath" sources
1826  adding 'build/src.macosx-10.6-x86_64-2.6/numpy/core/include/numpy/config.h' to sources.
1827  adding 'build/src.macosx-10.6-x86_64-2.6/numpy/core/include/numpy/_numpyconfig.h' to sources.
1828executing numpy/core/code_generators/generate_ufunc_api.py
1829  adding 'build/src.macosx-10.6-x86_64-2.6/numpy/core/include/numpy/__ufunc_api.h' to sources.
1830non-existing path in 'numpy/core': 'build/src.macosx-10.6-x86_64-2.6/numpy/core/src/umath'
1831creating build/src.macosx-10.6-x86_64-2.6/numpy/core/src/umath
1832conv_template:> build/src.macosx-10.6-x86_64-2.6/numpy/core/src/umath/loops.c
1833conv_template:> build/src.macosx-10.6-x86_64-2.6/numpy/core/src/umath/umathmodule.c
1834conv_template:> build/src.macosx-10.6-x86_64-2.6/numpy/core/src/umath/funcs.inc
1835  adding 'build/src.macosx-10.6-x86_64-2.6/numpy/core/src/umath' to include_dirs.
1836numpy.core - nothing done with h_files = ['build/src.macosx-10.6-x86_64-2.6/numpy/core/src/umath/funcs.inc', 'build/src.macosx-10.6-x86_64-2.6/numpy/core/include/numpy/config.h', 'build/src.macosx-10.6-x86_64-2.6/numpy/core/include/numpy/_numpyconfig.h', 'build/src.macosx-10.6-x86_64-2.6/numpy/core/include/numpy/__ufunc_api.h']
1837building extension "numpy.core.scalarmath" sources
1838  adding 'build/src.macosx-10.6-x86_64-2.6/numpy/core/include/numpy/config.h' to sources.
1839  adding 'build/src.macosx-10.6-x86_64-2.6/numpy/core/include/numpy/_numpyconfig.h' to sources.
1840executing numpy/core/code_generators/generate_numpy_api.py
1841  adding 'build/src.macosx-10.6-x86_64-2.6/numpy/core/include/numpy/__multiarray_api.h' to sources.
1842executing numpy/core/code_generators/generate_ufunc_api.py
1843  adding 'build/src.macosx-10.6-x86_64-2.6/numpy/core/include/numpy/__ufunc_api.h' to sources.
1844conv_template:> build/src.macosx-10.6-x86_64-2.6/numpy/core/src/scalarmathmodule.c
1845numpy.core - nothing done with h_files = ['build/src.macosx-10.6-x86_64-2.6/numpy/core/include/numpy/config.h', 'build/src.macosx-10.6-x86_64-2.6/numpy/core/include/numpy/_numpyconfig.h', 'build/src.macosx-10.6-x86_64-2.6/numpy/core/include/numpy/__multiarray_api.h', 'build/src.macosx-10.6-x86_64-2.6/numpy/core/include/numpy/__ufunc_api.h']
1846building extension "numpy.core._dotblas" sources
1847  adding 'numpy/core/blasdot/_dotblas.c' to sources.
1848building extension "numpy.core.umath_tests" sources
1849conv_template:> build/src.macosx-10.6-x86_64-2.6/numpy/core/src/umath/umath_tests.c
1850building extension "numpy.core.multiarray_tests" sources
1851conv_template:> build/src.macosx-10.6-x86_64-2.6/numpy/core/src/multiarray/multiarray_tests.c
1852building extension "numpy.lib._compiled_base" sources
1853building extension "numpy.numarray._capi" sources
1854building extension "numpy.fft.fftpack_lite" sources
1855building extension "numpy.linalg.lapack_lite" sources
1856creating build/src.macosx-10.6-x86_64-2.6/numpy/linalg
1857  adding 'numpy/linalg/lapack_litemodule.c' to sources.
1858  adding 'numpy/linalg/python_xerbla.c' to sources.
1859building extension "numpy.random.mtrand" sources
1860creating build/src.macosx-10.6-x86_64-2.6/numpy/random
1861/opt/local/var/macports/build/_opt_local_var_macports_sources_svn.macports.org_trunk_dports_python_py26-numpy/work/numpy-1.4.1/numpy/distutils/command/config.py:39: DeprecationWarning:
1862+++++++++++++++++++++++++++++++++++++++++++++++++
1863Usage of try_run is deprecated: please do not
1864use it anymore, and avoid configuration checks
1865involving running executable on the target machine.
1866+++++++++++++++++++++++++++++++++++++++++++++++++
1867
1868  DeprecationWarning)
1869C compiler: /opt/local/bin/gcc-mp-4.3 -DNDEBUG -g -fwrapv -O3 -Wall -Wstrict-prototypes -m64
1870
1871compile options: '-Inumpy/core/src/private -Inumpy/core/src -Inumpy/core -Inumpy/core/src/npymath -Inumpy/core/src/multiarray -Inumpy/core/src/umath -Inumpy/core/include -I/opt/local/Library/Frameworks/Python.framework/Versions/2.6/include/python2.6 -c'
1872gcc-mp-4.3: _configtest.c
1873/opt/local/bin/gcc-mp-4.3 _configtest.o -o _configtest
1874_configtest
1875failure.
1876removing: _configtest.c _configtest.o _configtest
1877building data_files sources
1878build_src: building npy-pkg config files
1879running build_py
1880creating build/lib.macosx-10.6-x86_64-2.6
1881creating build/lib.macosx-10.6-x86_64-2.6/numpy
1882copying numpy/__init__.py -> build/lib.macosx-10.6-x86_64-2.6/numpy
1883copying numpy/_import_tools.py -> build/lib.macosx-10.6-x86_64-2.6/numpy
1884copying numpy/add_newdocs.py -> build/lib.macosx-10.6-x86_64-2.6/numpy
1885copying numpy/ctypeslib.py -> build/lib.macosx-10.6-x86_64-2.6/numpy
1886copying numpy/dual.py -> build/lib.macosx-10.6-x86_64-2.6/numpy
1887copying numpy/matlib.py -> build/lib.macosx-10.6-x86_64-2.6/numpy
1888copying numpy/setup.py -> build/lib.macosx-10.6-x86_64-2.6/numpy
1889copying numpy/setupscons.py -> build/lib.macosx-10.6-x86_64-2.6/numpy
1890copying numpy/version.py -> build/lib.macosx-10.6-x86_64-2.6/numpy
1891copying build/src.macosx-10.6-x86_64-2.6/numpy/__config__.py -> build/lib.macosx-10.6-x86_64-2.6/numpy
1892creating build/lib.macosx-10.6-x86_64-2.6/numpy/distutils
1893copying numpy/distutils/__init__.py -> build/lib.macosx-10.6-x86_64-2.6/numpy/distutils
1894copying numpy/distutils/__version__.py -> build/lib.macosx-10.6-x86_64-2.6/numpy/distutils
1895copying numpy/distutils/ccompiler.py -> build/lib.macosx-10.6-x86_64-2.6/numpy/distutils
1896copying numpy/distutils/conv_template.py -> build/lib.macosx-10.6-x86_64-2.6/numpy/distutils
1897copying numpy/distutils/core.py -> build/lib.macosx-10.6-x86_64-2.6/numpy/distutils
1898copying numpy/distutils/cpuinfo.py -> build/lib.macosx-10.6-x86_64-2.6/numpy/distutils
1899copying numpy/distutils/environment.py -> build/lib.macosx-10.6-x86_64-2.6/numpy/distutils
1900copying numpy/distutils/exec_command.py -> build/lib.macosx-10.6-x86_64-2.6/numpy/distutils
1901copying numpy/distutils/extension.py -> build/lib.macosx-10.6-x86_64-2.6/numpy/distutils
1902copying numpy/distutils/from_template.py -> build/lib.macosx-10.6-x86_64-2.6/numpy/distutils
1903copying numpy/distutils/info.py -> build/lib.macosx-10.6-x86_64-2.6/numpy/distutils
1904copying numpy/distutils/intelccompiler.py -> build/lib.macosx-10.6-x86_64-2.6/numpy/distutils
1905copying numpy/distutils/interactive.py -> build/lib.macosx-10.6-x86_64-2.6/numpy/distutils
1906copying numpy/distutils/lib2def.py -> build/lib.macosx-10.6-x86_64-2.6/numpy/distutils
1907copying numpy/distutils/line_endings.py -> build/lib.macosx-10.6-x86_64-2.6/numpy/distutils
1908copying numpy/distutils/log.py -> build/lib.macosx-10.6-x86_64-2.6/numpy/distutils
1909copying numpy/distutils/mingw32ccompiler.py -> build/lib.macosx-10.6-x86_64-2.6/numpy/distutils
1910copying numpy/distutils/misc_util.py -> build/lib.macosx-10.6-x86_64-2.6/numpy/distutils
1911copying numpy/distutils/npy_pkg_config.py -> build/lib.macosx-10.6-x86_64-2.6/numpy/distutils
1912copying numpy/distutils/numpy_distribution.py -> build/lib.macosx-10.6-x86_64-2.6/numpy/distutils
1913copying numpy/distutils/setup.py -> build/lib.macosx-10.6-x86_64-2.6/numpy/distutils
1914copying numpy/distutils/setupscons.py -> build/lib.macosx-10.6-x86_64-2.6/numpy/distutils
1915copying numpy/distutils/system_info.py -> build/lib.macosx-10.6-x86_64-2.6/numpy/distutils
1916copying numpy/distutils/unixccompiler.py -> build/lib.macosx-10.6-x86_64-2.6/numpy/distutils
1917copying build/src.macosx-10.6-x86_64-2.6/numpy/distutils/__config__.py -> build/lib.macosx-10.6-x86_64-2.6/numpy/distutils
1918creating build/lib.macosx-10.6-x86_64-2.6/numpy/distutils/command
1919copying numpy/distutils/command/__init__.py -> build/lib.macosx-10.6-x86_64-2.6/numpy/distutils/command
1920copying numpy/distutils/command/autodist.py -> build/lib.macosx-10.6-x86_64-2.6/numpy/distutils/command
1921copying numpy/distutils/command/bdist_rpm.py -> build/lib.macosx-10.6-x86_64-2.6/numpy/distutils/command
1922copying numpy/distutils/command/build.py -> build/lib.macosx-10.6-x86_64-2.6/numpy/distutils/command
1923copying numpy/distutils/command/build_clib.py -> build/lib.macosx-10.6-x86_64-2.6/numpy/distutils/command
1924copying numpy/distutils/command/build_ext.py -> build/lib.macosx-10.6-x86_64-2.6/numpy/distutils/command
1925copying numpy/distutils/command/build_py.py -> build/lib.macosx-10.6-x86_64-2.6/numpy/distutils/command
1926copying numpy/distutils/command/build_scripts.py -> build/lib.macosx-10.6-x86_64-2.6/numpy/distutils/command
1927copying numpy/distutils/command/build_src.py -> build/lib.macosx-10.6-x86_64-2.6/numpy/distutils/command
1928copying numpy/distutils/command/config.py -> build/lib.macosx-10.6-x86_64-2.6/numpy/distutils/command
1929copying numpy/distutils/command/config_compiler.py -> build/lib.macosx-10.6-x86_64-2.6/numpy/distutils/command
1930copying numpy/distutils/command/develop.py -> build/lib.macosx-10.6-x86_64-2.6/numpy/distutils/command
1931copying numpy/distutils/command/egg_info.py -> build/lib.macosx-10.6-x86_64-2.6/numpy/distutils/command
1932copying numpy/distutils/command/install.py -> build/lib.macosx-10.6-x86_64-2.6/numpy/distutils/command
1933copying numpy/distutils/command/install_clib.py -> build/lib.macosx-10.6-x86_64-2.6/numpy/distutils/command
1934copying numpy/distutils/command/install_data.py -> build/lib.macosx-10.6-x86_64-2.6/numpy/distutils/command
1935copying numpy/distutils/command/install_headers.py -> build/lib.macosx-10.6-x86_64-2.6/numpy/distutils/command
1936copying numpy/distutils/command/scons.py -> build/lib.macosx-10.6-x86_64-2.6/numpy/distutils/command
1937copying numpy/distutils/command/sdist.py -> build/lib.macosx-10.6-x86_64-2.6/numpy/distutils/command
1938creating build/lib.macosx-10.6-x86_64-2.6/numpy/distutils/fcompiler
1939copying numpy/distutils/fcompiler/__init__.py -> build/lib.macosx-10.6-x86_64-2.6/numpy/distutils/fcompiler
1940copying numpy/distutils/fcompiler/absoft.py -> build/lib.macosx-10.6-x86_64-2.6/numpy/distutils/fcompiler
1941copying numpy/distutils/fcompiler/compaq.py -> build/lib.macosx-10.6-x86_64-2.6/numpy/distutils/fcompiler
1942copying numpy/distutils/fcompiler/g95.py -> build/lib.macosx-10.6-x86_64-2.6/numpy/distutils/fcompiler
1943copying numpy/distutils/fcompiler/gnu.py -> build/lib.macosx-10.6-x86_64-2.6/numpy/distutils/fcompiler
1944copying numpy/distutils/fcompiler/hpux.py -> build/lib.macosx-10.6-x86_64-2.6/numpy/distutils/fcompiler
1945copying numpy/distutils/fcompiler/ibm.py -> build/lib.macosx-10.6-x86_64-2.6/numpy/distutils/fcompiler
1946copying numpy/distutils/fcompiler/intel.py -> build/lib.macosx-10.6-x86_64-2.6/numpy/distutils/fcompiler
1947copying numpy/distutils/fcompiler/lahey.py -> build/lib.macosx-10.6-x86_64-2.6/numpy/distutils/fcompiler
1948copying numpy/distutils/fcompiler/mips.py -> build/lib.macosx-10.6-x86_64-2.6/numpy/distutils/fcompiler
1949copying numpy/distutils/fcompiler/nag.py -> build/lib.macosx-10.6-x86_64-2.6/numpy/distutils/fcompiler
1950copying numpy/distutils/fcompiler/none.py -> build/lib.macosx-10.6-x86_64-2.6/numpy/distutils/fcompiler
1951copying numpy/distutils/fcompiler/pg.py -> build/lib.macosx-10.6-x86_64-2.6/numpy/distutils/fcompiler
1952copying numpy/distutils/fcompiler/sun.py -> build/lib.macosx-10.6-x86_64-2.6/numpy/distutils/fcompiler
1953copying numpy/distutils/fcompiler/vast.py -> build/lib.macosx-10.6-x86_64-2.6/numpy/distutils/fcompiler
1954creating build/lib.macosx-10.6-x86_64-2.6/numpy/testing
1955copying numpy/testing/__init__.py -> build/lib.macosx-10.6-x86_64-2.6/numpy/testing
1956copying numpy/testing/decorators.py -> build/lib.macosx-10.6-x86_64-2.6/numpy/testing
1957copying numpy/testing/noseclasses.py -> build/lib.macosx-10.6-x86_64-2.6/numpy/testing
1958copying numpy/testing/nosetester.py -> build/lib.macosx-10.6-x86_64-2.6/numpy/testing
1959copying numpy/testing/nulltester.py -> build/lib.macosx-10.6-x86_64-2.6/numpy/testing
1960copying numpy/testing/numpytest.py -> build/lib.macosx-10.6-x86_64-2.6/numpy/testing
1961copying numpy/testing/setup.py -> build/lib.macosx-10.6-x86_64-2.6/numpy/testing
1962copying numpy/testing/setupscons.py -> build/lib.macosx-10.6-x86_64-2.6/numpy/testing
1963copying numpy/testing/utils.py -> build/lib.macosx-10.6-x86_64-2.6/numpy/testing
1964creating build/lib.macosx-10.6-x86_64-2.6/numpy/f2py
1965copying numpy/f2py/__init__.py -> build/lib.macosx-10.6-x86_64-2.6/numpy/f2py
1966copying numpy/f2py/__version__.py -> build/lib.macosx-10.6-x86_64-2.6/numpy/f2py
1967copying numpy/f2py/auxfuncs.py -> build/lib.macosx-10.6-x86_64-2.6/numpy/f2py
1968copying numpy/f2py/capi_maps.py -> build/lib.macosx-10.6-x86_64-2.6/numpy/f2py
1969copying numpy/f2py/cb_rules.py -> build/lib.macosx-10.6-x86_64-2.6/numpy/f2py
1970copying numpy/f2py/cfuncs.py -> build/lib.macosx-10.6-x86_64-2.6/numpy/f2py
1971copying numpy/f2py/common_rules.py -> build/lib.macosx-10.6-x86_64-2.6/numpy/f2py
1972copying numpy/f2py/crackfortran.py -> build/lib.macosx-10.6-x86_64-2.6/numpy/f2py
1973copying numpy/f2py/diagnose.py -> build/lib.macosx-10.6-x86_64-2.6/numpy/f2py
1974copying numpy/f2py/f2py2e.py -> build/lib.macosx-10.6-x86_64-2.6/numpy/f2py
1975copying numpy/f2py/f2py_testing.py -> build/lib.macosx-10.6-x86_64-2.6/numpy/f2py
1976copying numpy/f2py/f90mod_rules.py -> build/lib.macosx-10.6-x86_64-2.6/numpy/f2py
1977copying numpy/f2py/func2subr.py -> build/lib.macosx-10.6-x86_64-2.6/numpy/f2py
1978copying numpy/f2py/info.py -> build/lib.macosx-10.6-x86_64-2.6/numpy/f2py
1979copying numpy/f2py/rules.py -> build/lib.macosx-10.6-x86_64-2.6/numpy/f2py
1980copying numpy/f2py/setup.py -> build/lib.macosx-10.6-x86_64-2.6/numpy/f2py
1981copying numpy/f2py/setupscons.py -> build/lib.macosx-10.6-x86_64-2.6/numpy/f2py
1982copying numpy/f2py/use_rules.py -> build/lib.macosx-10.6-x86_64-2.6/numpy/f2py
1983creating build/lib.macosx-10.6-x86_64-2.6/numpy/core
1984copying numpy/core/__init__.py -> build/lib.macosx-10.6-x86_64-2.6/numpy/core
1985copying numpy/core/_internal.py -> build/lib.macosx-10.6-x86_64-2.6/numpy/core
1986copying numpy/core/_mx_datetime_parser.py -> build/lib.macosx-10.6-x86_64-2.6/numpy/core
1987copying numpy/core/arrayprint.py -> build/lib.macosx-10.6-x86_64-2.6/numpy/core
1988copying numpy/core/defchararray.py -> build/lib.macosx-10.6-x86_64-2.6/numpy/core
1989copying numpy/core/fromnumeric.py -> build/lib.macosx-10.6-x86_64-2.6/numpy/core
1990copying numpy/core/function_base.py -> build/lib.macosx-10.6-x86_64-2.6/numpy/core
1991copying numpy/core/getlimits.py -> build/lib.macosx-10.6-x86_64-2.6/numpy/core
1992copying numpy/core/info.py -> build/lib.macosx-10.6-x86_64-2.6/numpy/core
1993copying numpy/core/machar.py -> build/lib.macosx-10.6-x86_64-2.6/numpy/core
1994copying numpy/core/memmap.py -> build/lib.macosx-10.6-x86_64-2.6/numpy/core
1995copying numpy/core/numeric.py -> build/lib.macosx-10.6-x86_64-2.6/numpy/core
1996copying numpy/core/numerictypes.py -> build/lib.macosx-10.6-x86_64-2.6/numpy/core
1997copying numpy/core/records.py -> build/lib.macosx-10.6-x86_64-2.6/numpy/core
1998copying numpy/core/scons_support.py -> build/lib.macosx-10.6-x86_64-2.6/numpy/core
1999copying numpy/core/setup.py -> build/lib.macosx-10.6-x86_64-2.6/numpy/core
2000copying numpy/core/setup_common.py -> build/lib.macosx-10.6-x86_64-2.6/numpy/core
2001copying numpy/core/setupscons.py -> build/lib.macosx-10.6-x86_64-2.6/numpy/core
2002copying numpy/core/shape_base.py -> build/lib.macosx-10.6-x86_64-2.6/numpy/core
2003copying numpy/core/code_generators/generate_numpy_api.py -> build/lib.macosx-10.6-x86_64-2.6/numpy/core
2004creating build/lib.macosx-10.6-x86_64-2.6/numpy/lib
2005copying numpy/lib/__init__.py -> build/lib.macosx-10.6-x86_64-2.6/numpy/lib
2006copying numpy/lib/_datasource.py -> build/lib.macosx-10.6-x86_64-2.6/numpy/lib
2007copying numpy/lib/_iotools.py -> build/lib.macosx-10.6-x86_64-2.6/numpy/lib
2008copying numpy/lib/arraysetops.py -> build/lib.macosx-10.6-x86_64-2.6/numpy/lib
2009copying numpy/lib/arrayterator.py -> build/lib.macosx-10.6-x86_64-2.6/numpy/lib
2010copying numpy/lib/financial.py -> build/lib.macosx-10.6-x86_64-2.6/numpy/lib
2011copying numpy/lib/format.py -> build/lib.macosx-10.6-x86_64-2.6/numpy/lib
2012copying numpy/lib/function_base.py -> build/lib.macosx-10.6-x86_64-2.6/numpy/lib
2013copying numpy/lib/index_tricks.py -> build/lib.macosx-10.6-x86_64-2.6/numpy/lib
2014copying numpy/lib/info.py -> build/lib.macosx-10.6-x86_64-2.6/numpy/lib
2015copying numpy/lib/io.py -> build/lib.macosx-10.6-x86_64-2.6/numpy/lib
2016copying numpy/lib/polynomial.py -> build/lib.macosx-10.6-x86_64-2.6/numpy/lib
2017copying numpy/lib/recfunctions.py -> build/lib.macosx-10.6-x86_64-2.6/numpy/lib
2018copying numpy/lib/scimath.py -> build/lib.macosx-10.6-x86_64-2.6/numpy/lib
2019copying numpy/lib/setup.py -> build/lib.macosx-10.6-x86_64-2.6/numpy/lib
2020copying numpy/lib/setupscons.py -> build/lib.macosx-10.6-x86_64-2.6/numpy/lib
2021copying numpy/lib/shape_base.py -> build/lib.macosx-10.6-x86_64-2.6/numpy/lib
2022copying numpy/lib/stride_tricks.py -> build/lib.macosx-10.6-x86_64-2.6/numpy/lib
2023copying numpy/lib/twodim_base.py -> build/lib.macosx-10.6-x86_64-2.6/numpy/lib
2024copying numpy/lib/type_check.py -> build/lib.macosx-10.6-x86_64-2.6/numpy/lib
2025copying numpy/lib/ufunclike.py -> build/lib.macosx-10.6-x86_64-2.6/numpy/lib
2026copying numpy/lib/user_array.py -> build/lib.macosx-10.6-x86_64-2.6/numpy/lib
2027copying numpy/lib/utils.py -> build/lib.macosx-10.6-x86_64-2.6/numpy/lib
2028creating build/lib.macosx-10.6-x86_64-2.6/numpy/oldnumeric
2029copying numpy/oldnumeric/__init__.py -> build/lib.macosx-10.6-x86_64-2.6/numpy/oldnumeric
2030copying numpy/oldnumeric/alter_code1.py -> build/lib.macosx-10.6-x86_64-2.6/numpy/oldnumeric
2031copying numpy/oldnumeric/alter_code2.py -> build/lib.macosx-10.6-x86_64-2.6/numpy/oldnumeric
2032copying numpy/oldnumeric/array_printer.py -> build/lib.macosx-10.6-x86_64-2.6/numpy/oldnumeric
2033copying numpy/oldnumeric/arrayfns.py -> build/lib.macosx-10.6-x86_64-2.6/numpy/oldnumeric
2034copying numpy/oldnumeric/compat.py -> build/lib.macosx-10.6-x86_64-2.6/numpy/oldnumeric
2035copying numpy/oldnumeric/fft.py -> build/lib.macosx-10.6-x86_64-2.6/numpy/oldnumeric
2036copying numpy/oldnumeric/fix_default_axis.py -> build/lib.macosx-10.6-x86_64-2.6/numpy/oldnumeric
2037copying numpy/oldnumeric/functions.py -> build/lib.macosx-10.6-x86_64-2.6/numpy/oldnumeric
2038copying numpy/oldnumeric/linear_algebra.py -> build/lib.macosx-10.6-x86_64-2.6/numpy/oldnumeric
2039copying numpy/oldnumeric/ma.py -> build/lib.macosx-10.6-x86_64-2.6/numpy/oldnumeric
2040copying numpy/oldnumeric/matrix.py -> build/lib.macosx-10.6-x86_64-2.6/numpy/oldnumeric
2041copying numpy/oldnumeric/misc.py -> build/lib.macosx-10.6-x86_64-2.6/numpy/oldnumeric
2042copying numpy/oldnumeric/mlab.py -> build/lib.macosx-10.6-x86_64-2.6/numpy/oldnumeric
2043copying numpy/oldnumeric/precision.py -> build/lib.macosx-10.6-x86_64-2.6/numpy/oldnumeric
2044copying numpy/oldnumeric/random_array.py -> build/lib.macosx-10.6-x86_64-2.6/numpy/oldnumeric
2045copying numpy/oldnumeric/rng.py -> build/lib.macosx-10.6-x86_64-2.6/numpy/oldnumeric
2046copying numpy/oldnumeric/rng_stats.py -> build/lib.macosx-10.6-x86_64-2.6/numpy/oldnumeric
2047copying numpy/oldnumeric/setup.py -> build/lib.macosx-10.6-x86_64-2.6/numpy/oldnumeric
2048copying numpy/oldnumeric/setupscons.py -> build/lib.macosx-10.6-x86_64-2.6/numpy/oldnumeric
2049copying numpy/oldnumeric/typeconv.py -> build/lib.macosx-10.6-x86_64-2.6/numpy/oldnumeric
2050copying numpy/oldnumeric/ufuncs.py -> build/lib.macosx-10.6-x86_64-2.6/numpy/oldnumeric
2051copying numpy/oldnumeric/user_array.py -> build/lib.macosx-10.6-x86_64-2.6/numpy/oldnumeric
2052creating build/lib.macosx-10.6-x86_64-2.6/numpy/numarray
2053copying numpy/numarray/__init__.py -> build/lib.macosx-10.6-x86_64-2.6/numpy/numarray
2054copying numpy/numarray/alter_code1.py -> build/lib.macosx-10.6-x86_64-2.6/numpy/numarray
2055copying numpy/numarray/alter_code2.py -> build/lib.macosx-10.6-x86_64-2.6/numpy/numarray
2056copying numpy/numarray/compat.py -> build/lib.macosx-10.6-x86_64-2.6/numpy/numarray
2057copying numpy/numarray/convolve.py -> build/lib.macosx-10.6-x86_64-2.6/numpy/numarray
2058copying numpy/numarray/fft.py -> build/lib.macosx-10.6-x86_64-2.6/numpy/numarray
2059copying numpy/numarray/functions.py -> build/lib.macosx-10.6-x86_64-2.6/numpy/numarray
2060copying numpy/numarray/image.py -> build/lib.macosx-10.6-x86_64-2.6/numpy/numarray
2061copying numpy/numarray/linear_algebra.py -> build/lib.macosx-10.6-x86_64-2.6/numpy/numarray
2062copying numpy/numarray/ma.py -> build/lib.macosx-10.6-x86_64-2.6/numpy/numarray
2063copying numpy/numarray/matrix.py -> build/lib.macosx-10.6-x86_64-2.6/numpy/numarray
2064copying numpy/numarray/mlab.py -> build/lib.macosx-10.6-x86_64-2.6/numpy/numarray
2065copying numpy/numarray/nd_image.py -> build/lib.macosx-10.6-x86_64-2.6/numpy/numarray
2066copying numpy/numarray/numerictypes.py -> build/lib.macosx-10.6-x86_64-2.6/numpy/numarray
2067copying numpy/numarray/random_array.py -> build/lib.macosx-10.6-x86_64-2.6/numpy/numarray
2068copying numpy/numarray/session.py -> build/lib.macosx-10.6-x86_64-2.6/numpy/numarray
2069copying numpy/numarray/setup.py -> build/lib.macosx-10.6-x86_64-2.6/numpy/numarray
2070copying numpy/numarray/setupscons.py -> build/lib.macosx-10.6-x86_64-2.6/numpy/numarray
2071copying numpy/numarray/ufuncs.py -> build/lib.macosx-10.6-x86_64-2.6/numpy/numarray
2072copying numpy/numarray/util.py -> build/lib.macosx-10.6-x86_64-2.6/numpy/numarray
2073creating build/lib.macosx-10.6-x86_64-2.6/numpy/fft
2074copying numpy/fft/__init__.py -> build/lib.macosx-10.6-x86_64-2.6/numpy/fft
2075copying numpy/fft/fftpack.py -> build/lib.macosx-10.6-x86_64-2.6/numpy/fft
2076copying numpy/fft/helper.py -> build/lib.macosx-10.6-x86_64-2.6/numpy/fft
2077copying numpy/fft/info.py -> build/lib.macosx-10.6-x86_64-2.6/numpy/fft
2078copying numpy/fft/setup.py -> build/lib.macosx-10.6-x86_64-2.6/numpy/fft
2079copying numpy/fft/setupscons.py -> build/lib.macosx-10.6-x86_64-2.6/numpy/fft
2080creating build/lib.macosx-10.6-x86_64-2.6/numpy/linalg
2081copying numpy/linalg/__init__.py -> build/lib.macosx-10.6-x86_64-2.6/numpy/linalg
2082copying numpy/linalg/info.py -> build/lib.macosx-10.6-x86_64-2.6/numpy/linalg
2083copying numpy/linalg/linalg.py -> build/lib.macosx-10.6-x86_64-2.6/numpy/linalg
2084copying numpy/linalg/setup.py -> build/lib.macosx-10.6-x86_64-2.6/numpy/linalg
2085copying numpy/linalg/setupscons.py -> build/lib.macosx-10.6-x86_64-2.6/numpy/linalg
2086creating build/lib.macosx-10.6-x86_64-2.6/numpy/random
2087copying numpy/random/__init__.py -> build/lib.macosx-10.6-x86_64-2.6/numpy/random
2088copying numpy/random/info.py -> build/lib.macosx-10.6-x86_64-2.6/numpy/random
2089copying numpy/random/setup.py -> build/lib.macosx-10.6-x86_64-2.6/numpy/random
2090copying numpy/random/setupscons.py -> build/lib.macosx-10.6-x86_64-2.6/numpy/random
2091creating build/lib.macosx-10.6-x86_64-2.6/numpy/ma
2092copying numpy/ma/__init__.py -> build/lib.macosx-10.6-x86_64-2.6/numpy/ma
2093copying numpy/ma/bench.py -> build/lib.macosx-10.6-x86_64-2.6/numpy/ma
2094copying numpy/ma/core.py -> build/lib.macosx-10.6-x86_64-2.6/numpy/ma
2095copying numpy/ma/extras.py -> build/lib.macosx-10.6-x86_64-2.6/numpy/ma
2096copying numpy/ma/mrecords.py -> build/lib.macosx-10.6-x86_64-2.6/numpy/ma
2097copying numpy/ma/setup.py -> build/lib.macosx-10.6-x86_64-2.6/numpy/ma
2098copying numpy/ma/setupscons.py -> build/lib.macosx-10.6-x86_64-2.6/numpy/ma
2099copying numpy/ma/testutils.py -> build/lib.macosx-10.6-x86_64-2.6/numpy/ma
2100copying numpy/ma/timer_comparison.py -> build/lib.macosx-10.6-x86_64-2.6/numpy/ma
2101copying numpy/ma/version.py -> build/lib.macosx-10.6-x86_64-2.6/numpy/ma
2102creating build/lib.macosx-10.6-x86_64-2.6/numpy/matrixlib
2103copying numpy/matrixlib/__init__.py -> build/lib.macosx-10.6-x86_64-2.6/numpy/matrixlib
2104copying numpy/matrixlib/defmatrix.py -> build/lib.macosx-10.6-x86_64-2.6/numpy/matrixlib
2105copying numpy/matrixlib/setup.py -> build/lib.macosx-10.6-x86_64-2.6/numpy/matrixlib
2106copying numpy/matrixlib/setupscons.py -> build/lib.macosx-10.6-x86_64-2.6/numpy/matrixlib
2107creating build/lib.macosx-10.6-x86_64-2.6/numpy/compat
2108copying numpy/compat/__init__.py -> build/lib.macosx-10.6-x86_64-2.6/numpy/compat
2109copying numpy/compat/_inspect.py -> build/lib.macosx-10.6-x86_64-2.6/numpy/compat
2110copying numpy/compat/setup.py -> build/lib.macosx-10.6-x86_64-2.6/numpy/compat
2111copying numpy/compat/setupscons.py -> build/lib.macosx-10.6-x86_64-2.6/numpy/compat
2112creating build/lib.macosx-10.6-x86_64-2.6/numpy/polynomial
2113copying numpy/polynomial/__init__.py -> build/lib.macosx-10.6-x86_64-2.6/numpy/polynomial
2114copying numpy/polynomial/chebyshev.py -> build/lib.macosx-10.6-x86_64-2.6/numpy/polynomial
2115copying numpy/polynomial/polynomial.py -> build/lib.macosx-10.6-x86_64-2.6/numpy/polynomial
2116copying numpy/polynomial/polytemplate.py -> build/lib.macosx-10.6-x86_64-2.6/numpy/polynomial
2117copying numpy/polynomial/polyutils.py -> build/lib.macosx-10.6-x86_64-2.6/numpy/polynomial
2118copying numpy/polynomial/setup.py -> build/lib.macosx-10.6-x86_64-2.6/numpy/polynomial
2119creating build/lib.macosx-10.6-x86_64-2.6/numpy/doc
2120copying numpy/doc/__init__.py -> build/lib.macosx-10.6-x86_64-2.6/numpy/doc
2121copying numpy/doc/basics.py -> build/lib.macosx-10.6-x86_64-2.6/numpy/doc
2122copying numpy/doc/broadcasting.py -> build/lib.macosx-10.6-x86_64-2.6/numpy/doc
2123copying numpy/doc/byteswapping.py -> build/lib.macosx-10.6-x86_64-2.6/numpy/doc
2124copying numpy/doc/constants.py -> build/lib.macosx-10.6-x86_64-2.6/numpy/doc
2125copying numpy/doc/creation.py -> build/lib.macosx-10.6-x86_64-2.6/numpy/doc
2126copying numpy/doc/glossary.py -> build/lib.macosx-10.6-x86_64-2.6/numpy/doc
2127copying numpy/doc/howtofind.py -> build/lib.macosx-10.6-x86_64-2.6/numpy/doc
2128copying numpy/doc/indexing.py -> build/lib.macosx-10.6-x86_64-2.6/numpy/doc
2129copying numpy/doc/internals.py -> build/lib.macosx-10.6-x86_64-2.6/numpy/doc
2130copying numpy/doc/io.py -> build/lib.macosx-10.6-x86_64-2.6/numpy/doc
2131copying numpy/doc/jargon.py -> build/lib.macosx-10.6-x86_64-2.6/numpy/doc
2132copying numpy/doc/methods_vs_functions.py -> build/lib.macosx-10.6-x86_64-2.6/numpy/doc
2133copying numpy/doc/misc.py -> build/lib.macosx-10.6-x86_64-2.6/numpy/doc
2134copying numpy/doc/performance.py -> build/lib.macosx-10.6-x86_64-2.6/numpy/doc
2135copying numpy/doc/structured_arrays.py -> build/lib.macosx-10.6-x86_64-2.6/numpy/doc
2136copying numpy/doc/subclassing.py -> build/lib.macosx-10.6-x86_64-2.6/numpy/doc
2137copying numpy/doc/ufuncs.py -> build/lib.macosx-10.6-x86_64-2.6/numpy/doc
2138running build_clib
2139customize UnixCCompiler
2140customize UnixCCompiler using build_clib
2141building 'npymath' library
2142compiling C sources
2143C compiler: /opt/local/bin/gcc-mp-4.3 -DNDEBUG -g -fwrapv -O3 -Wall -Wstrict-prototypes -m64
2144
2145creating build/temp.macosx-10.6-x86_64-2.6
2146creating build/temp.macosx-10.6-x86_64-2.6/build
2147creating build/temp.macosx-10.6-x86_64-2.6/build/src.macosx-10.6-x86_64-2.6
2148creating build/temp.macosx-10.6-x86_64-2.6/build/src.macosx-10.6-x86_64-2.6/numpy
2149creating build/temp.macosx-10.6-x86_64-2.6/build/src.macosx-10.6-x86_64-2.6/numpy/core
2150creating build/temp.macosx-10.6-x86_64-2.6/build/src.macosx-10.6-x86_64-2.6/numpy/core/src
2151creating build/temp.macosx-10.6-x86_64-2.6/build/src.macosx-10.6-x86_64-2.6/numpy/core/src/npymath
2152compile options: '-Inumpy/core/include -Ibuild/src.macosx-10.6-x86_64-2.6/numpy/core/include/numpy -Inumpy/core/src/private -Inumpy/core/src -Inumpy/core -Inumpy/core/src/npymath -Inumpy/core/src/multiarray -Inumpy/core/src/umath -Inumpy/core/include -I/opt/local/Library/Frameworks/Python.framework/Versions/2.6/include/python2.6 -Ibuild/src.macosx-10.6-x86_64-2.6/numpy/core/src/multiarray -Ibuild/src.macosx-10.6-x86_64-2.6/numpy/core/src/umath -c'
2153gcc-mp-4.3: build/src.macosx-10.6-x86_64-2.6/numpy/core/src/npymath/npy_math.c
2154gcc-mp-4.3: build/src.macosx-10.6-x86_64-2.6/numpy/core/src/npymath/npy_math_complex.c
2155gcc-mp-4.3: build/src.macosx-10.6-x86_64-2.6/numpy/core/src/npymath/ieee754.c
2156ar: adding 3 object files to build/temp.macosx-10.6-x86_64-2.6/libnpymath.a
2157ranlib:@ build/temp.macosx-10.6-x86_64-2.6/libnpymath.a
2158running build_ext
2159customize UnixCCompiler
2160customize UnixCCompiler using build_ext
2161customize NAGFCompiler
2162customize AbsoftFCompiler
2163customize IBMFCompiler
2164customize IntelFCompiler
2165customize GnuFCompiler
2166customize Gnu95FCompiler
2167customize Gnu95FCompiler
2168customize Gnu95FCompiler using build_ext
2169building 'numpy.core._sort' extension
2170compiling C sources
2171C compiler: /opt/local/bin/gcc-mp-4.3 -DNDEBUG -g -fwrapv -O3 -Wall -Wstrict-prototypes -m64
2172
2173compile options: '-Inumpy/core/include -Ibuild/src.macosx-10.6-x86_64-2.6/numpy/core/include/numpy -Inumpy/core/src/private -Inumpy/core/src -Inumpy/core -Inumpy/core/src/npymath -Inumpy/core/src/multiarray -Inumpy/core/src/umath -Inumpy/core/include -I/opt/local/Library/Frameworks/Python.framework/Versions/2.6/include/python2.6 -Ibuild/src.macosx-10.6-x86_64-2.6/numpy/core/src/multiarray -Ibuild/src.macosx-10.6-x86_64-2.6/numpy/core/src/umath -c'
2174gcc-mp-4.3: build/src.macosx-10.6-x86_64-2.6/numpy/core/src/_sortmodule.c
2175/usr/bin/gcc-4.2 -L/opt/local/lib -bundle -undefined dynamic_lookup -m64 build/temp.macosx-10.6-x86_64-2.6/build/src.macosx-10.6-x86_64-2.6/numpy/core/src/_sortmodule.o -Lbuild/temp.macosx-10.6-x86_64-2.6 -o build/lib.macosx-10.6-x86_64-2.6/numpy/core/_sort.so
2176building 'numpy.core.multiarray' extension
2177compiling C sources
2178C compiler: /opt/local/bin/gcc-mp-4.3 -DNDEBUG -g -fwrapv -O3 -Wall -Wstrict-prototypes -m64
2179
2180creating build/temp.macosx-10.6-x86_64-2.6/numpy
2181creating build/temp.macosx-10.6-x86_64-2.6/numpy/core
2182creating build/temp.macosx-10.6-x86_64-2.6/numpy/core/src
2183creating build/temp.macosx-10.6-x86_64-2.6/numpy/core/src/multiarray
2184compile options: '-Inumpy/core/include -Ibuild/src.macosx-10.6-x86_64-2.6/numpy/core/include/numpy -Inumpy/core/src/private -Inumpy/core/src -Inumpy/core -Inumpy/core/src/npymath -Inumpy/core/src/multiarray -Inumpy/core/src/umath -Inumpy/core/include -I/opt/local/Library/Frameworks/Python.framework/Versions/2.6/include/python2.6 -Ibuild/src.macosx-10.6-x86_64-2.6/numpy/core/src/multiarray -Ibuild/src.macosx-10.6-x86_64-2.6/numpy/core/src/umath -c'
2185gcc-mp-4.3: numpy/core/src/multiarray/multiarraymodule_onefile.c
2186In file included from numpy/core/src/multiarray/multiarraymodule_onefile.c:13:
2187numpy/core/src/multiarray/arraytypes.c.src: In function 'BOOL_to_STRING':
2188numpy/core/src/multiarray/arraytypes.c.src:995: warning: dereferencing type-punned pointer will break strict-aliasing rules
2189numpy/core/src/multiarray/arraytypes.c.src: In function 'BYTE_to_STRING':
2190numpy/core/src/multiarray/arraytypes.c.src:995: warning: dereferencing type-punned pointer will break strict-aliasing rules
2191numpy/core/src/multiarray/arraytypes.c.src: In function 'UBYTE_to_STRING':
2192numpy/core/src/multiarray/arraytypes.c.src:995: warning: dereferencing type-punned pointer will break strict-aliasing rules
2193numpy/core/src/multiarray/arraytypes.c.src: In function 'SHORT_to_STRING':
2194numpy/core/src/multiarray/arraytypes.c.src:995: warning: dereferencing type-punned pointer will break strict-aliasing rules
2195numpy/core/src/multiarray/arraytypes.c.src: In function 'USHORT_to_STRING':
2196numpy/core/src/multiarray/arraytypes.c.src:995: warning: dereferencing type-punned pointer will break strict-aliasing rules
2197numpy/core/src/multiarray/arraytypes.c.src: In function 'INT_to_STRING':
2198numpy/core/src/multiarray/arraytypes.c.src:995: warning: dereferencing type-punned pointer will break strict-aliasing rules
2199numpy/core/src/multiarray/arraytypes.c.src: In function 'UINT_to_STRING':
2200numpy/core/src/multiarray/arraytypes.c.src:995: warning: dereferencing type-punned pointer will break strict-aliasing rules
2201numpy/core/src/multiarray/arraytypes.c.src: In function 'LONG_to_STRING':
2202numpy/core/src/multiarray/arraytypes.c.src:995: warning: dereferencing type-punned pointer will break strict-aliasing rules
2203numpy/core/src/multiarray/arraytypes.c.src: In function 'ULONG_to_STRING':
2204numpy/core/src/multiarray/arraytypes.c.src:995: warning: dereferencing type-punned pointer will break strict-aliasing rules
2205numpy/core/src/multiarray/arraytypes.c.src: In function 'LONGLONG_to_STRING':
2206numpy/core/src/multiarray/arraytypes.c.src:995: warning: dereferencing type-punned pointer will break strict-aliasing rules
2207numpy/core/src/multiarray/arraytypes.c.src: In function 'ULONGLONG_to_STRING':
2208numpy/core/src/multiarray/arraytypes.c.src:995: warning: dereferencing type-punned pointer will break strict-aliasing rules
2209numpy/core/src/multiarray/arraytypes.c.src: In function 'FLOAT_to_STRING':
2210numpy/core/src/multiarray/arraytypes.c.src:995: warning: dereferencing type-punned pointer will break strict-aliasing rules
2211numpy/core/src/multiarray/arraytypes.c.src: In function 'DOUBLE_to_STRING':
2212numpy/core/src/multiarray/arraytypes.c.src:995: warning: dereferencing type-punned pointer will break strict-aliasing rules
2213numpy/core/src/multiarray/arraytypes.c.src: In function 'LONGDOUBLE_to_STRING':
2214numpy/core/src/multiarray/arraytypes.c.src:995: warning: dereferencing type-punned pointer will break strict-aliasing rules
2215numpy/core/src/multiarray/arraytypes.c.src: In function 'CFLOAT_to_STRING':
2216numpy/core/src/multiarray/arraytypes.c.src:995: warning: dereferencing type-punned pointer will break strict-aliasing rules
2217numpy/core/src/multiarray/arraytypes.c.src: In function 'CDOUBLE_to_STRING':
2218numpy/core/src/multiarray/arraytypes.c.src:995: warning: dereferencing type-punned pointer will break strict-aliasing rules
2219numpy/core/src/multiarray/arraytypes.c.src: In function 'CLONGDOUBLE_to_STRING':
2220numpy/core/src/multiarray/arraytypes.c.src:995: warning: dereferencing type-punned pointer will break strict-aliasing rules
2221numpy/core/src/multiarray/arraytypes.c.src: In function 'BOOL_to_UNICODE':
2222numpy/core/src/multiarray/arraytypes.c.src:995: warning: dereferencing type-punned pointer will break strict-aliasing rules
2223numpy/core/src/multiarray/arraytypes.c.src: In function 'BYTE_to_UNICODE':
2224numpy/core/src/multiarray/arraytypes.c.src:995: warning: dereferencing type-punned pointer will break strict-aliasing rules
2225numpy/core/src/multiarray/arraytypes.c.src: In function 'UBYTE_to_UNICODE':
2226numpy/core/src/multiarray/arraytypes.c.src:995: warning: dereferencing type-punned pointer will break strict-aliasing rules
2227numpy/core/src/multiarray/arraytypes.c.src: In function 'SHORT_to_UNICODE':
2228numpy/core/src/multiarray/arraytypes.c.src:995: warning: dereferencing type-punned pointer will break strict-aliasing rules
2229numpy/core/src/multiarray/arraytypes.c.src: In function 'USHORT_to_UNICODE':
2230numpy/core/src/multiarray/arraytypes.c.src:995: warning: dereferencing type-punned pointer will break strict-aliasing rules
2231numpy/core/src/multiarray/arraytypes.c.src: In function 'INT_to_UNICODE':
2232numpy/core/src/multiarray/arraytypes.c.src:995: warning: dereferencing type-punned pointer will break strict-aliasing rules
2233numpy/core/src/multiarray/arraytypes.c.src: In function 'UINT_to_UNICODE':
2234numpy/core/src/multiarray/arraytypes.c.src:995: warning: dereferencing type-punned pointer will break strict-aliasing rules
2235numpy/core/src/multiarray/arraytypes.c.src: In function 'LONG_to_UNICODE':
2236numpy/core/src/multiarray/arraytypes.c.src:995: warning: dereferencing type-punned pointer will break strict-aliasing rules
2237numpy/core/src/multiarray/arraytypes.c.src: In function 'ULONG_to_UNICODE':
2238numpy/core/src/multiarray/arraytypes.c.src:995: warning: dereferencing type-punned pointer will break strict-aliasing rules
2239numpy/core/src/multiarray/arraytypes.c.src: In function 'LONGLONG_to_UNICODE':
2240numpy/core/src/multiarray/arraytypes.c.src:995: warning: dereferencing type-punned pointer will break strict-aliasing rules
2241numpy/core/src/multiarray/arraytypes.c.src: In function 'ULONGLONG_to_UNICODE':
2242numpy/core/src/multiarray/arraytypes.c.src:995: warning: dereferencing type-punned pointer will break strict-aliasing rules
2243numpy/core/src/multiarray/arraytypes.c.src: In function 'FLOAT_to_UNICODE':
2244numpy/core/src/multiarray/arraytypes.c.src:995: warning: dereferencing type-punned pointer will break strict-aliasing rules
2245numpy/core/src/multiarray/arraytypes.c.src: In function 'DOUBLE_to_UNICODE':
2246numpy/core/src/multiarray/arraytypes.c.src:995: warning: dereferencing type-punned pointer will break strict-aliasing rules
2247numpy/core/src/multiarray/arraytypes.c.src: In function 'LONGDOUBLE_to_UNICODE':
2248numpy/core/src/multiarray/arraytypes.c.src:995: warning: dereferencing type-punned pointer will break strict-aliasing rules
2249numpy/core/src/multiarray/arraytypes.c.src: In function 'CFLOAT_to_UNICODE':
2250numpy/core/src/multiarray/arraytypes.c.src:995: warning: dereferencing type-punned pointer will break strict-aliasing rules
2251numpy/core/src/multiarray/arraytypes.c.src: In function 'CDOUBLE_to_UNICODE':
2252numpy/core/src/multiarray/arraytypes.c.src:995: warning: dereferencing type-punned pointer will break strict-aliasing rules
2253numpy/core/src/multiarray/arraytypes.c.src: In function 'CLONGDOUBLE_to_UNICODE':
2254numpy/core/src/multiarray/arraytypes.c.src:995: warning: dereferencing type-punned pointer will break strict-aliasing rules
2255numpy/core/src/multiarray/arraytypes.c.src: In function 'BOOL_to_VOID':
2256numpy/core/src/multiarray/arraytypes.c.src:995: warning: dereferencing type-punned pointer will break strict-aliasing rules
2257numpy/core/src/multiarray/arraytypes.c.src: In function 'BYTE_to_VOID':
2258numpy/core/src/multiarray/arraytypes.c.src:995: warning: dereferencing type-punned pointer will break strict-aliasing rules
2259numpy/core/src/multiarray/arraytypes.c.src: In function 'UBYTE_to_VOID':
2260numpy/core/src/multiarray/arraytypes.c.src:995: warning: dereferencing type-punned pointer will break strict-aliasing rules
2261numpy/core/src/multiarray/arraytypes.c.src: In function 'SHORT_to_VOID':
2262numpy/core/src/multiarray/arraytypes.c.src:995: warning: dereferencing type-punned pointer will break strict-aliasing rules
2263numpy/core/src/multiarray/arraytypes.c.src: In function 'USHORT_to_VOID':
2264numpy/core/src/multiarray/arraytypes.c.src:995: warning: dereferencing type-punned pointer will break strict-aliasing rules
2265numpy/core/src/multiarray/arraytypes.c.src: In function 'INT_to_VOID':
2266numpy/core/src/multiarray/arraytypes.c.src:995: warning: dereferencing type-punned pointer will break strict-aliasing rules
2267numpy/core/src/multiarray/arraytypes.c.src: In function 'UINT_to_VOID':
2268numpy/core/src/multiarray/arraytypes.c.src:995: warning: dereferencing type-punned pointer will break strict-aliasing rules
2269numpy/core/src/multiarray/arraytypes.c.src: In function 'LONG_to_VOID':
2270numpy/core/src/multiarray/arraytypes.c.src:995: warning: dereferencing type-punned pointer will break strict-aliasing rules
2271numpy/core/src/multiarray/arraytypes.c.src: In function 'ULONG_to_VOID':
2272numpy/core/src/multiarray/arraytypes.c.src:995: warning: dereferencing type-punned pointer will break strict-aliasing rules
2273numpy/core/src/multiarray/arraytypes.c.src: In function 'LONGLONG_to_VOID':
2274numpy/core/src/multiarray/arraytypes.c.src:995: warning: dereferencing type-punned pointer will break strict-aliasing rules
2275numpy/core/src/multiarray/arraytypes.c.src: In function 'ULONGLONG_to_VOID':
2276numpy/core/src/multiarray/arraytypes.c.src:995: warning: dereferencing type-punned pointer will break strict-aliasing rules
2277numpy/core/src/multiarray/arraytypes.c.src: In function 'FLOAT_to_VOID':
2278numpy/core/src/multiarray/arraytypes.c.src:995: warning: dereferencing type-punned pointer will break strict-aliasing rules
2279numpy/core/src/multiarray/arraytypes.c.src: In function 'DOUBLE_to_VOID':
2280numpy/core/src/multiarray/arraytypes.c.src:995: warning: dereferencing type-punned pointer will break strict-aliasing rules
2281numpy/core/src/multiarray/arraytypes.c.src: In function 'LONGDOUBLE_to_VOID':
2282numpy/core/src/multiarray/arraytypes.c.src:995: warning: dereferencing type-punned pointer will break strict-aliasing rules
2283numpy/core/src/multiarray/arraytypes.c.src: In function 'CFLOAT_to_VOID':
2284numpy/core/src/multiarray/arraytypes.c.src:995: warning: dereferencing type-punned pointer will break strict-aliasing rules
2285numpy/core/src/multiarray/arraytypes.c.src: In function 'CDOUBLE_to_VOID':
2286numpy/core/src/multiarray/arraytypes.c.src:995: warning: dereferencing type-punned pointer will break strict-aliasing rules
2287numpy/core/src/multiarray/arraytypes.c.src: In function 'CLONGDOUBLE_to_VOID':
2288numpy/core/src/multiarray/arraytypes.c.src:995: warning: dereferencing type-punned pointer will break strict-aliasing rules
2289numpy/core/src/multiarray/arraytypes.c.src: In function 'OBJECT_dot':
2290numpy/core/src/multiarray/arraytypes.c.src:2230: warning: dereferencing type-punned pointer will break strict-aliasing rules
2291numpy/core/src/multiarray/arraytypes.c.src: In function 'set_typeinfo':
2292numpy/core/src/multiarray/arraytypes.c.src:2938: warning: dereferencing type-punned pointer will break strict-aliasing rules
2293numpy/core/src/multiarray/arraytypes.c.src:2939: warning: dereferencing type-punned pointer will break strict-aliasing rules
2294numpy/core/src/multiarray/arraytypes.c.src:2940: warning: dereferencing type-punned pointer will break strict-aliasing rules
2295numpy/core/src/multiarray/arraytypes.c.src:2941: warning: dereferencing type-punned pointer will break strict-aliasing rules
2296numpy/core/src/multiarray/arraytypes.c.src:2942: warning: dereferencing type-punned pointer will break strict-aliasing rules
2297numpy/core/src/multiarray/arraytypes.c.src:2943: warning: dereferencing type-punned pointer will break strict-aliasing rules
2298numpy/core/src/multiarray/arraytypes.c.src:2944: warning: dereferencing type-punned pointer will break strict-aliasing rules
2299numpy/core/src/multiarray/arraytypes.c.src:2945: warning: dereferencing type-punned pointer will break strict-aliasing rules
2300numpy/core/src/multiarray/arraytypes.c.src:2946: warning: dereferencing type-punned pointer will break strict-aliasing rules
2301numpy/core/src/multiarray/arraytypes.c.src:2947: warning: dereferencing type-punned pointer will break strict-aliasing rules
2302In file included from numpy/core/src/multiarray/multiarraymodule_onefile.c:42:
2303numpy/core/src/multiarray/arrayobject.c: In function 'array_richcompare':
2304numpy/core/src/multiarray/arrayobject.c:884: warning: dereferencing type-punned pointer will break strict-aliasing rules
2305numpy/core/src/multiarray/arrayobject.c:904: warning: dereferencing type-punned pointer will break strict-aliasing rules
2306numpy/core/src/multiarray/arrayobject.c:947: warning: dereferencing type-punned pointer will break strict-aliasing rules
2307numpy/core/src/multiarray/arrayobject.c:953: warning: dereferencing type-punned pointer will break strict-aliasing rules
2308numpy/core/src/multiarray/arrayobject.c:971: warning: dereferencing type-punned pointer will break strict-aliasing rules
2309numpy/core/src/multiarray/arrayobject.c:1010: warning: dereferencing type-punned pointer will break strict-aliasing rules
2310In file included from numpy/core/src/multiarray/multiarraymodule_onefile.c:44:
2311numpy/core/src/multiarray/multiarraymodule.c: In function 'initmultiarray':
2312numpy/core/src/multiarray/multiarraymodule.c:2988: warning: dereferencing type-punned pointer will break strict-aliasing rules
2313numpy/core/src/multiarray/multiarraymodule.c:2990: warning: dereferencing type-punned pointer will break strict-aliasing rules
2314numpy/core/src/multiarray/multiarraymodule.c:2992: warning: dereferencing type-punned pointer will break strict-aliasing rules
2315numpy/core/src/multiarray/multiarraymodule.c:2995: warning: dereferencing type-punned pointer will break strict-aliasing rules
2316numpy/core/src/multiarray/multiarraymodule.c:2998: warning: dereferencing type-punned pointer will break strict-aliasing rules
2317numpy/core/src/multiarray/multiarraymodule_onefile.c: At top level:
2318numpy/core/src/multiarray/arraytypes.c.src:93: warning: '_SEQUENCE_MESSAGE' defined but not used
2319numpy/core/src/multiarray/mapping.c:73: warning: '_array_ass_item' defined but not used
2320/usr/bin/gcc-4.2 -L/opt/local/lib -bundle -undefined dynamic_lookup -m64 build/temp.macosx-10.6-x86_64-2.6/numpy/core/src/multiarray/multiarraymodule_onefile.o -Lbuild/temp.macosx-10.6-x86_64-2.6 -lnpymath -o build/lib.macosx-10.6-x86_64-2.6/numpy/core/multiarray.so
2321building 'numpy.core.umath' extension
2322compiling C sources
2323C compiler: /opt/local/bin/gcc-mp-4.3 -DNDEBUG -g -fwrapv -O3 -Wall -Wstrict-prototypes -m64
2324
2325creating build/temp.macosx-10.6-x86_64-2.6/numpy/core/src/umath
2326compile options: '-Ibuild/src.macosx-10.6-x86_64-2.6/numpy/core/src/umath -Inumpy/core/include -Ibuild/src.macosx-10.6-x86_64-2.6/numpy/core/include/numpy -Inumpy/core/src/private -Inumpy/core/src -Inumpy/core -Inumpy/core/src/npymath -Inumpy/core/src/multiarray -Inumpy/core/src/umath -Inumpy/core/include -I/opt/local/Library/Frameworks/Python.framework/Versions/2.6/include/python2.6 -Ibuild/src.macosx-10.6-x86_64-2.6/numpy/core/src/multiarray -Ibuild/src.macosx-10.6-x86_64-2.6/numpy/core/src/umath -c'
2327gcc-mp-4.3: numpy/core/src/umath/umathmodule_onefile.c
2328numpy/core/src/umath/loops.c.src:864: warning: 'DATETIME_ones_like' defined but not used
2329numpy/core/src/umath/loops.c.src:872: warning: 'DATETIME_negative' defined but not used
2330numpy/core/src/umath/loops.c.src:881: warning: 'DATETIME_logical_not' defined but not used
2331numpy/core/src/umath/loops.c.src:896: warning: 'DATETIME_equal' defined but not used
2332numpy/core/src/umath/loops.c.src:896: warning: 'DATETIME_not_equal' defined but not used
2333numpy/core/src/umath/loops.c.src:896: warning: 'DATETIME_greater' defined but not used
2334numpy/core/src/umath/loops.c.src:896: warning: 'DATETIME_greater_equal' defined but not used
2335numpy/core/src/umath/loops.c.src:896: warning: 'DATETIME_less' defined but not used
2336numpy/core/src/umath/loops.c.src:896: warning: 'DATETIME_less_equal' defined but not used
2337numpy/core/src/umath/loops.c.src:896: warning: 'DATETIME_logical_and' defined but not used
2338numpy/core/src/umath/loops.c.src:896: warning: 'DATETIME_logical_or' defined but not used
2339numpy/core/src/umath/loops.c.src:907: warning: 'DATETIME_logical_xor' defined but not used
2340numpy/core/src/umath/loops.c.src:921: warning: 'DATETIME_maximum' defined but not used
2341numpy/core/src/umath/loops.c.src:921: warning: 'DATETIME_minimum' defined but not used
2342numpy/core/src/umath/loops.c.src:932: warning: 'DATETIME_absolute' defined but not used
2343numpy/core/src/umath/loops.c.src:941: warning: 'DATETIME_sign' defined but not used
2344numpy/core/src/umath/loops.c.src:864: warning: 'TIMEDELTA_ones_like' defined but not used
2345numpy/core/src/umath/loops.c.src:872: warning: 'TIMEDELTA_negative' defined but not used
2346numpy/core/src/umath/loops.c.src:881: warning: 'TIMEDELTA_logical_not' defined but not used
2347numpy/core/src/umath/loops.c.src:896: warning: 'TIMEDELTA_equal' defined but not used
2348numpy/core/src/umath/loops.c.src:896: warning: 'TIMEDELTA_not_equal' defined but not used
2349numpy/core/src/umath/loops.c.src:896: warning: 'TIMEDELTA_greater' defined but not used
2350numpy/core/src/umath/loops.c.src:896: warning: 'TIMEDELTA_greater_equal' defined but not used
2351numpy/core/src/umath/loops.c.src:896: warning: 'TIMEDELTA_less' defined but not used
2352numpy/core/src/umath/loops.c.src:896: warning: 'TIMEDELTA_less_equal' defined but not used
2353numpy/core/src/umath/loops.c.src:896: warning: 'TIMEDELTA_logical_and' defined but not used
2354numpy/core/src/umath/loops.c.src:896: warning: 'TIMEDELTA_logical_or' defined but not used
2355numpy/core/src/umath/loops.c.src:907: warning: 'TIMEDELTA_logical_xor' defined but not used
2356numpy/core/src/umath/loops.c.src:921: warning: 'TIMEDELTA_maximum' defined but not used
2357numpy/core/src/umath/loops.c.src:921: warning: 'TIMEDELTA_minimum' defined but not used
2358numpy/core/src/umath/loops.c.src:932: warning: 'TIMEDELTA_absolute' defined but not used
2359numpy/core/src/umath/loops.c.src:941: warning: 'TIMEDELTA_sign' defined but not used
2360numpy/core/src/umath/loops.c.src:955: warning: 'DATETIME_Mm_M_add' defined but not used
2361numpy/core/src/umath/loops.c.src:965: warning: 'DATETIME_mM_M_add' defined but not used
2362numpy/core/src/umath/loops.c.src:975: warning: 'TIMEDELTA_mm_m_add' defined but not used
2363numpy/core/src/umath/loops.c.src:985: warning: 'DATETIME_Mm_M_subtract' defined but not used
2364numpy/core/src/umath/loops.c.src:995: warning: 'DATETIME_MM_m_subtract' defined but not used
2365numpy/core/src/umath/loops.c.src:1005: warning: 'TIMEDELTA_mm_m_subtract' defined but not used
2366numpy/core/src/umath/loops.c.src:1415: warning: 'CLONGDOUBLE_logical_and' defined but not used
2367numpy/core/src/umath/loops.c.src:1415: warning: 'CLONGDOUBLE_logical_or' defined but not used
2368numpy/core/src/umath/loops.c.src:1428: warning: 'CLONGDOUBLE_logical_xor' defined but not used
2369numpy/core/src/umath/loops.c.src:1442: warning: 'CLONGDOUBLE_logical_not' defined but not used
2370numpy/core/src/umath/loops.c.src:1499: warning: 'CLONGDOUBLE_ones_like' defined but not used
2371numpy/core/src/umath/loops.c.src:1556: warning: 'CLONGDOUBLE_maximum' defined but not used
2372numpy/core/src/umath/loops.c.src:1556: warning: 'CLONGDOUBLE_minimum' defined but not used
2373numpy/core/src/umath/loops.c.src:1580: warning: 'CLONGDOUBLE_fmax' defined but not used
2374numpy/core/src/umath/loops.c.src:1580: warning: 'CLONGDOUBLE_fmin' defined but not used
2375/usr/bin/gcc-4.2 -L/opt/local/lib -bundle -undefined dynamic_lookup -m64 build/temp.macosx-10.6-x86_64-2.6/numpy/core/src/umath/umathmodule_onefile.o -Lbuild/temp.macosx-10.6-x86_64-2.6 -lnpymath -o build/lib.macosx-10.6-x86_64-2.6/numpy/core/umath.so
2376building 'numpy.core.scalarmath' extension
2377compiling C sources
2378C compiler: /opt/local/bin/gcc-mp-4.3 -DNDEBUG -g -fwrapv -O3 -Wall -Wstrict-prototypes -m64
2379
2380compile options: '-Inumpy/core/include -Ibuild/src.macosx-10.6-x86_64-2.6/numpy/core/include/numpy -Inumpy/core/src/private -Inumpy/core/src -Inumpy/core -Inumpy/core/src/npymath -Inumpy/core/src/multiarray -Inumpy/core/src/umath -Inumpy/core/include -I/opt/local/Library/Frameworks/Python.framework/Versions/2.6/include/python2.6 -Ibuild/src.macosx-10.6-x86_64-2.6/numpy/core/src/multiarray -Ibuild/src.macosx-10.6-x86_64-2.6/numpy/core/src/umath -c'
2381gcc-mp-4.3: build/src.macosx-10.6-x86_64-2.6/numpy/core/src/scalarmathmodule.c
2382/usr/bin/gcc-4.2 -L/opt/local/lib -bundle -undefined dynamic_lookup -m64 build/temp.macosx-10.6-x86_64-2.6/build/src.macosx-10.6-x86_64-2.6/numpy/core/src/scalarmathmodule.o -Lbuild/temp.macosx-10.6-x86_64-2.6 -o build/lib.macosx-10.6-x86_64-2.6/numpy/core/scalarmath.so
2383building 'numpy.core._dotblas' extension
2384compiling C sources
2385C compiler: /opt/local/bin/gcc-mp-4.3 -DNDEBUG -g -fwrapv -O3 -Wall -Wstrict-prototypes -m64
2386
2387creating build/temp.macosx-10.6-x86_64-2.6/numpy/core/blasdot
2388compile options: '-DATLAS_INFO="\"3.8.3\"" -Inumpy/core/blasdot -I/opt/local/include -Inumpy/core/include -Ibuild/src.macosx-10.6-x86_64-2.6/numpy/core/include/numpy -Inumpy/core/src/private -Inumpy/core/src -Inumpy/core -Inumpy/core/src/npymath -Inumpy/core/src/multiarray -Inumpy/core/src/umath -Inumpy/core/include -I/opt/local/Library/Frameworks/Python.framework/Versions/2.6/include/python2.6 -Ibuild/src.macosx-10.6-x86_64-2.6/numpy/core/src/multiarray -Ibuild/src.macosx-10.6-x86_64-2.6/numpy/core/src/umath -c'
2389gcc-mp-4.3: numpy/core/blasdot/_dotblas.c
2390/usr/bin/gcc-4.2 -L/opt/local/lib -bundle -undefined dynamic_lookup -m64 build/temp.macosx-10.6-x86_64-2.6/numpy/core/blasdot/_dotblas.o -L/opt/local/lib -Lbuild/temp.macosx-10.6-x86_64-2.6 -lptf77blas -lptcblas -latlas -o build/lib.macosx-10.6-x86_64-2.6/numpy/core/_dotblas.so
2391building 'numpy.core.umath_tests' extension
2392compiling C sources
2393C compiler: /opt/local/bin/gcc-mp-4.3 -DNDEBUG -g -fwrapv -O3 -Wall -Wstrict-prototypes -m64
2394
2395creating build/temp.macosx-10.6-x86_64-2.6/build/src.macosx-10.6-x86_64-2.6/numpy/core/src/umath
2396compile options: '-Inumpy/core/include -Ibuild/src.macosx-10.6-x86_64-2.6/numpy/core/include/numpy -Inumpy/core/src/private -Inumpy/core/src -Inumpy/core -Inumpy/core/src/npymath -Inumpy/core/src/multiarray -Inumpy/core/src/umath -Inumpy/core/include -I/opt/local/Library/Frameworks/Python.framework/Versions/2.6/include/python2.6 -Ibuild/src.macosx-10.6-x86_64-2.6/numpy/core/src/multiarray -Ibuild/src.macosx-10.6-x86_64-2.6/numpy/core/src/umath -c'
2397gcc-mp-4.3: build/src.macosx-10.6-x86_64-2.6/numpy/core/src/umath/umath_tests.c
2398/usr/bin/gcc-4.2 -L/opt/local/lib -bundle -undefined dynamic_lookup -m64 build/temp.macosx-10.6-x86_64-2.6/build/src.macosx-10.6-x86_64-2.6/numpy/core/src/umath/umath_tests.o -Lbuild/temp.macosx-10.6-x86_64-2.6 -o build/lib.macosx-10.6-x86_64-2.6/numpy/core/umath_tests.so
2399building 'numpy.core.multiarray_tests' extension
2400compiling C sources
2401C compiler: /opt/local/bin/gcc-mp-4.3 -DNDEBUG -g -fwrapv -O3 -Wall -Wstrict-prototypes -m64
2402
2403creating build/temp.macosx-10.6-x86_64-2.6/build/src.macosx-10.6-x86_64-2.6/numpy/core/src/multiarray
2404compile options: '-Inumpy/core/include -Ibuild/src.macosx-10.6-x86_64-2.6/numpy/core/include/numpy -Inumpy/core/src/private -Inumpy/core/src -Inumpy/core -Inumpy/core/src/npymath -Inumpy/core/src/multiarray -Inumpy/core/src/umath -Inumpy/core/include -I/opt/local/Library/Frameworks/Python.framework/Versions/2.6/include/python2.6 -Ibuild/src.macosx-10.6-x86_64-2.6/numpy/core/src/multiarray -Ibuild/src.macosx-10.6-x86_64-2.6/numpy/core/src/umath -c'
2405gcc-mp-4.3: build/src.macosx-10.6-x86_64-2.6/numpy/core/src/multiarray/multiarray_tests.c
2406/usr/bin/gcc-4.2 -L/opt/local/lib -bundle -undefined dynamic_lookup -m64 build/temp.macosx-10.6-x86_64-2.6/build/src.macosx-10.6-x86_64-2.6/numpy/core/src/multiarray/multiarray_tests.o -Lbuild/temp.macosx-10.6-x86_64-2.6 -o build/lib.macosx-10.6-x86_64-2.6/numpy/core/multiarray_tests.so
2407building 'numpy.lib._compiled_base' extension
2408compiling C sources
2409C compiler: /opt/local/bin/gcc-mp-4.3 -DNDEBUG -g -fwrapv -O3 -Wall -Wstrict-prototypes -m64
2410
2411creating build/temp.macosx-10.6-x86_64-2.6/numpy/lib
2412creating build/temp.macosx-10.6-x86_64-2.6/numpy/lib/src
2413compile options: '-Inumpy/core/include -Ibuild/src.macosx-10.6-x86_64-2.6/numpy/core/include/numpy -Inumpy/core/src/private -Inumpy/core/src -Inumpy/core -Inumpy/core/src/npymath -Inumpy/core/src/multiarray -Inumpy/core/src/umath -Inumpy/core/include -I/opt/local/Library/Frameworks/Python.framework/Versions/2.6/include/python2.6 -Ibuild/src.macosx-10.6-x86_64-2.6/numpy/core/src/multiarray -Ibuild/src.macosx-10.6-x86_64-2.6/numpy/core/src/umath -c'
2414gcc-mp-4.3: numpy/lib/src/_compiled_base.c
2415/usr/bin/gcc-4.2 -L/opt/local/lib -bundle -undefined dynamic_lookup -m64 build/temp.macosx-10.6-x86_64-2.6/numpy/lib/src/_compiled_base.o -Lbuild/temp.macosx-10.6-x86_64-2.6 -o build/lib.macosx-10.6-x86_64-2.6/numpy/lib/_compiled_base.so
2416building 'numpy.numarray._capi' extension
2417compiling C sources
2418C compiler: /opt/local/bin/gcc-mp-4.3 -DNDEBUG -g -fwrapv -O3 -Wall -Wstrict-prototypes -m64
2419
2420creating build/temp.macosx-10.6-x86_64-2.6/numpy/numarray
2421compile options: '-Inumpy/core/include -Ibuild/src.macosx-10.6-x86_64-2.6/numpy/core/include/numpy -Inumpy/core/src/private -Inumpy/core/src -Inumpy/core -Inumpy/core/src/npymath -Inumpy/core/src/multiarray -Inumpy/core/src/umath -Inumpy/core/include -I/opt/local/Library/Frameworks/Python.framework/Versions/2.6/include/python2.6 -Ibuild/src.macosx-10.6-x86_64-2.6/numpy/core/src/multiarray -Ibuild/src.macosx-10.6-x86_64-2.6/numpy/core/src/umath -c'
2422gcc-mp-4.3: numpy/numarray/_capi.c
2423numpy/numarray/_capi.c: In function 'NA_IeeeMask32':
2424numpy/numarray/_capi.c:3040: warning: dereferencing type-punned pointer will break strict-aliasing rules
2425numpy/numarray/_capi.c: In function 'NA_IeeeMask64':
2426numpy/numarray/_capi.c:3084: warning: dereferencing type-punned pointer will break strict-aliasing rules
2427/usr/bin/gcc-4.2 -L/opt/local/lib -bundle -undefined dynamic_lookup -m64 build/temp.macosx-10.6-x86_64-2.6/numpy/numarray/_capi.o -Lbuild/temp.macosx-10.6-x86_64-2.6 -o build/lib.macosx-10.6-x86_64-2.6/numpy/numarray/_capi.so
2428building 'numpy.fft.fftpack_lite' extension
2429compiling C sources
2430C compiler: /opt/local/bin/gcc-mp-4.3 -DNDEBUG -g -fwrapv -O3 -Wall -Wstrict-prototypes -m64
2431
2432creating build/temp.macosx-10.6-x86_64-2.6/numpy/fft
2433compile options: '-Inumpy/core/include -Ibuild/src.macosx-10.6-x86_64-2.6/numpy/core/include/numpy -Inumpy/core/src/private -Inumpy/core/src -Inumpy/core -Inumpy/core/src/npymath -Inumpy/core/src/multiarray -Inumpy/core/src/umath -Inumpy/core/include -I/opt/local/Library/Frameworks/Python.framework/Versions/2.6/include/python2.6 -Ibuild/src.macosx-10.6-x86_64-2.6/numpy/core/src/multiarray -Ibuild/src.macosx-10.6-x86_64-2.6/numpy/core/src/umath -c'
2434gcc-mp-4.3: numpy/fft/fftpack_litemodule.c
2435gcc-mp-4.3: numpy/fft/fftpack.c
2436/usr/bin/gcc-4.2 -L/opt/local/lib -bundle -undefined dynamic_lookup -m64 build/temp.macosx-10.6-x86_64-2.6/numpy/fft/fftpack_litemodule.o build/temp.macosx-10.6-x86_64-2.6/numpy/fft/fftpack.o -Lbuild/temp.macosx-10.6-x86_64-2.6 -o build/lib.macosx-10.6-x86_64-2.6/numpy/fft/fftpack_lite.so
2437building 'numpy.linalg.lapack_lite' extension
2438compiling C sources
2439C compiler: /opt/local/bin/gcc-mp-4.3 -DNDEBUG -g -fwrapv -O3 -Wall -Wstrict-prototypes -m64
2440
2441creating build/temp.macosx-10.6-x86_64-2.6/numpy/linalg
2442compile options: '-DATLAS_INFO="\"3.8.3\"" -I/opt/local/include -Inumpy/core/include -Ibuild/src.macosx-10.6-x86_64-2.6/numpy/core/include/numpy -Inumpy/core/src/private -Inumpy/core/src -Inumpy/core -Inumpy/core/src/npymath -Inumpy/core/src/multiarray -Inumpy/core/src/umath -Inumpy/core/include -I/opt/local/Library/Frameworks/Python.framework/Versions/2.6/include/python2.6 -Ibuild/src.macosx-10.6-x86_64-2.6/numpy/core/src/multiarray -Ibuild/src.macosx-10.6-x86_64-2.6/numpy/core/src/umath -c'
2443gcc-mp-4.3: numpy/linalg/python_xerbla.c
2444gcc-mp-4.3: numpy/linalg/lapack_litemodule.c
2445/opt/local/bin/gfortran -Wall build/temp.macosx-10.6-x86_64-2.6/numpy/linalg/lapack_litemodule.o build/temp.macosx-10.6-x86_64-2.6/numpy/linalg/python_xerbla.o -L/opt/local/lib -L/opt/local/lib/gcc43/gcc/x86_64-apple-darwin10/4.3.4 -Lbuild/temp.macosx-10.6-x86_64-2.6 -llapack -lptf77blas -lptcblas -latlas -lgfortran -o build/lib.macosx-10.6-x86_64-2.6/numpy/linalg/lapack_lite.so
2446Undefined symbols:
2447  "_PyExc_ValueError", referenced from:
2448      _xerbla_ in python_xerbla.o
2449  "_PyDict_SetItemString", referenced from:
2450      _initlapack_lite in lapack_litemodule.o
2451  "_PyErr_Print", referenced from:
2452      _initlapack_lite in lapack_litemodule.o
2453  "_Py_InitModule4_64", referenced from:
2454      _initlapack_lite in lapack_litemodule.o
2455  "_PyType_IsSubtype", referenced from:
2456      _check_object in lapack_litemodule.o
2457  "_PyModule_GetDict", referenced from:
2458      _initlapack_lite in lapack_litemodule.o
2459  "_PyArg_ParseTuple", referenced from:
2460      _lapack_lite_zungqr in lapack_litemodule.o
2461      _lapack_lite_zgeqrf in lapack_litemodule.o
2462      _lapack_lite_zpotrf in lapack_litemodule.o
2463      _lapack_lite_zgetrf in lapack_litemodule.o
2464      _lapack_lite_zgesdd in lapack_litemodule.o
2465      _lapack_lite_zgesv in lapack_litemodule.o
2466      _lapack_lite_zgelsd in lapack_litemodule.o
2467      _lapack_lite_zgeev in lapack_litemodule.o
2468      _lapack_lite_dorgqr in lapack_litemodule.o
2469      _lapack_lite_dgeqrf in lapack_litemodule.o
2470      _lapack_lite_dpotrf in lapack_litemodule.o
2471      _lapack_lite_dgetrf in lapack_litemodule.o
2472      _lapack_lite_dgesdd in lapack_litemodule.o
2473      _lapack_lite_dgesv in lapack_litemodule.o
2474      _lapack_lite_dgelsd in lapack_litemodule.o
2475      _lapack_lite_dgeev in lapack_litemodule.o
2476      _lapack_lite_dsyevd in lapack_litemodule.o
2477      _lapack_lite_zheevd in lapack_litemodule.o
2478  "_PyExc_RuntimeError", referenced from:
2479      _initlapack_lite in lapack_litemodule.o
2480      _initlapack_lite in lapack_litemodule.o
2481      _initlapack_lite in lapack_litemodule.o
2482      _initlapack_lite in lapack_litemodule.o
2483  "_PyExc_ImportError", referenced from:
2484      _initlapack_lite in lapack_litemodule.o
2485  "_PyCObject_AsVoidPtr", referenced from:
2486      _initlapack_lite in lapack_litemodule.o
2487  "_MAIN__", referenced from:
2488      _main in libgfortranbegin.a(fmain.o)
2489  "_PyCObject_Type", referenced from:
2490      _initlapack_lite in lapack_litemodule.o
2491  "_PyImport_ImportModule", referenced from:
2492      _initlapack_lite in lapack_litemodule.o
2493  "_PyErr_SetString", referenced from:
2494      _initlapack_lite in lapack_litemodule.o
2495      _xerbla_ in python_xerbla.o
2496  "_PyErr_Format", referenced from:
2497      _check_object in lapack_litemodule.o
2498      _check_object in lapack_litemodule.o
2499      _check_object in lapack_litemodule.o
2500      _initlapack_lite in lapack_litemodule.o
2501      _initlapack_lite in lapack_litemodule.o
2502      _initlapack_lite in lapack_litemodule.o
2503      _initlapack_lite in lapack_litemodule.o
2504  "_PyObject_GetAttrString", referenced from:
2505      _initlapack_lite in lapack_litemodule.o
2506  "_Py_BuildValue", referenced from:
2507      _lapack_lite_zungqr in lapack_litemodule.o
2508      _lapack_lite_zgeqrf in lapack_litemodule.o
2509      _lapack_lite_zpotrf in lapack_litemodule.o
2510      _lapack_lite_zgetrf in lapack_litemodule.o
2511      _lapack_lite_zgesdd in lapack_litemodule.o
2512      _lapack_lite_zgesv in lapack_litemodule.o
2513      _lapack_lite_zgelsd in lapack_litemodule.o
2514      _lapack_lite_zgeev in lapack_litemodule.o
2515      _lapack_lite_dorgqr in lapack_litemodule.o
2516      _lapack_lite_dgeqrf in lapack_litemodule.o
2517      _lapack_lite_dpotrf in lapack_litemodule.o
2518      _lapack_lite_dgetrf in lapack_litemodule.o
2519      _lapack_lite_dgesdd in lapack_litemodule.o
2520      _lapack_lite_dgesv in lapack_litemodule.o
2521      _lapack_lite_dgelsd in lapack_litemodule.o
2522      _lapack_lite_dgeev in lapack_litemodule.o
2523      _lapack_lite_dsyevd in lapack_litemodule.o
2524      _lapack_lite_zheevd in lapack_litemodule.o
2525  "_PyErr_NewException", referenced from:
2526      _initlapack_lite in lapack_litemodule.o
2527ld: symbol(s) not found
2528collect2: ld returned 1 exit status
2529Undefined symbols:
2530  "_PyExc_ValueError", referenced from:
2531      _xerbla_ in python_xerbla.o
2532  "_PyDict_SetItemString", referenced from:
2533      _initlapack_lite in lapack_litemodule.o
2534  "_PyErr_Print", referenced from:
2535      _initlapack_lite in lapack_litemodule.o
2536  "_Py_InitModule4_64", referenced from:
2537      _initlapack_lite in lapack_litemodule.o
2538  "_PyType_IsSubtype", referenced from:
2539      _check_object in lapack_litemodule.o
2540  "_PyModule_GetDict", referenced from:
2541      _initlapack_lite in lapack_litemodule.o
2542  "_PyArg_ParseTuple", referenced from:
2543      _lapack_lite_zungqr in lapack_litemodule.o
2544      _lapack_lite_zgeqrf in lapack_litemodule.o
2545      _lapack_lite_zpotrf in lapack_litemodule.o
2546      _lapack_lite_zgetrf in lapack_litemodule.o
2547      _lapack_lite_zgesdd in lapack_litemodule.o
2548      _lapack_lite_zgesv in lapack_litemodule.o
2549      _lapack_lite_zgelsd in lapack_litemodule.o
2550      _lapack_lite_zgeev in lapack_litemodule.o
2551      _lapack_lite_dorgqr in lapack_litemodule.o
2552      _lapack_lite_dgeqrf in lapack_litemodule.o
2553      _lapack_lite_dpotrf in lapack_litemodule.o
2554      _lapack_lite_dgetrf in lapack_litemodule.o
2555      _lapack_lite_dgesdd in lapack_litemodule.o
2556      _lapack_lite_dgesv in lapack_litemodule.o
2557      _lapack_lite_dgelsd in lapack_litemodule.o
2558      _lapack_lite_dgeev in lapack_litemodule.o
2559      _lapack_lite_dsyevd in lapack_litemodule.o
2560      _lapack_lite_zheevd in lapack_litemodule.o
2561  "_PyExc_RuntimeError", referenced from:
2562      _initlapack_lite in lapack_litemodule.o
2563      _initlapack_lite in lapack_litemodule.o
2564      _initlapack_lite in lapack_litemodule.o
2565      _initlapack_lite in lapack_litemodule.o
2566  "_PyExc_ImportError", referenced from:
2567      _initlapack_lite in lapack_litemodule.o
2568  "_PyCObject_AsVoidPtr", referenced from:
2569      _initlapack_lite in lapack_litemodule.o
2570  "_MAIN__", referenced from:
2571      _main in libgfortranbegin.a(fmain.o)
2572  "_PyCObject_Type", referenced from:
2573      _initlapack_lite in lapack_litemodule.o
2574  "_PyImport_ImportModule", referenced from:
2575      _initlapack_lite in lapack_litemodule.o
2576  "_PyErr_SetString", referenced from:
2577      _initlapack_lite in lapack_litemodule.o
2578      _xerbla_ in python_xerbla.o
2579  "_PyErr_Format", referenced from:
2580      _check_object in lapack_litemodule.o
2581      _check_object in lapack_litemodule.o
2582      _check_object in lapack_litemodule.o
2583      _initlapack_lite in lapack_litemodule.o
2584      _initlapack_lite in lapack_litemodule.o
2585      _initlapack_lite in lapack_litemodule.o
2586      _initlapack_lite in lapack_litemodule.o
2587  "_PyObject_GetAttrString", referenced from:
2588      _initlapack_lite in lapack_litemodule.o
2589  "_Py_BuildValue", referenced from:
2590      _lapack_lite_zungqr in lapack_litemodule.o
2591      _lapack_lite_zgeqrf in lapack_litemodule.o
2592      _lapack_lite_zpotrf in lapack_litemodule.o
2593      _lapack_lite_zgetrf in lapack_litemodule.o
2594      _lapack_lite_zgesdd in lapack_litemodule.o
2595      _lapack_lite_zgesv in lapack_litemodule.o
2596      _lapack_lite_zgelsd in lapack_litemodule.o
2597      _lapack_lite_zgeev in lapack_litemodule.o
2598      _lapack_lite_dorgqr in lapack_litemodule.o
2599      _lapack_lite_dgeqrf in lapack_litemodule.o
2600      _lapack_lite_dpotrf in lapack_litemodule.o
2601      _lapack_lite_dgetrf in lapack_litemodule.o
2602      _lapack_lite_dgesdd in lapack_litemodule.o
2603      _lapack_lite_dgesv in lapack_litemodule.o
2604      _lapack_lite_dgelsd in lapack_litemodule.o
2605      _lapack_lite_dgeev in lapack_litemodule.o
2606      _lapack_lite_dsyevd in lapack_litemodule.o
2607      _lapack_lite_zheevd in lapack_litemodule.o
2608  "_PyErr_NewException", referenced from:
2609      _initlapack_lite in lapack_litemodule.o
2610ld: symbol(s) not found
2611collect2: ld returned 1 exit status
2612error: Command "/opt/local/bin/gfortran -Wall build/temp.macosx-10.6-x86_64-2.6/numpy/linalg/lapack_litemodule.o build/temp.macosx-10.6-x86_64-2.6/numpy/linalg/python_xerbla.o -L/opt/local/lib -L/opt/local/lib/gcc43/gcc/x86_64-apple-darwin10/4.3.4 -Lbuild/temp.macosx-10.6-x86_64-2.6 -llapack -lptf77blas -lptcblas -latlas -lgfortran -o build/lib.macosx-10.6-x86_64-2.6/numpy/linalg/lapack_lite.so" failed with exit status 1
2613shell command " cd "/opt/local/var/macports/build/_opt_local_var_macports_sources_svn.macports.org_trunk_dports_python_py26-numpy/work/numpy-1.4.1" && /opt/local/Library/Frameworks/Python.framework/Versions/2.6/bin/python2.6 setup.py --no-user-cfg build " returned error 1
2614Error: Target org.macports.build returned: shell command failed
2615DEBUG: Backtrace: shell command failed
2616    while executing
2617"command_exec build"
2618    (procedure "portbuild::build_main" line 8)
2619    invoked from within
2620"$procedure $targetname"
2621Warning: the following items did not execute (for py26-numpy): org.macports.activate org.macports.build org.macports.destroot org.macports.install
2622Log for py26-numpy is at: /opt/local/var/macports/logs/_opt_local_var_macports_sources_svn.macports.org_trunk_dports_python_py26-numpy/main.log
2623Error: Status 1 encountered during processing.
2624To report a bug, see <http://guide.macports.org/#project.tickets>