Ticket #24984: ustl_build.log

File ustl_build.log, 4.9 KB (added by lminder@…, 11 years ago)

full log with debug output

Line 
1DEBUG: Found port in file:///opt/local/var/macports/sources/rsync.macports.org/release/ports/devel/ustl
2DEBUG: Changing to port directory: /opt/local/var/macports/sources/rsync.macports.org/release/ports/devel/ustl
3DEBUG: OS Platform: darwin
4DEBUG: OS Version: 10.3.0
5DEBUG: Mac OS X Version: 10.6
6DEBUG: System Arch: i386
7DEBUG: setting option os.universal_supported to yes
8DEBUG: org.macports.load registered provides 'load', a pre-existing procedure. Target override will not be provided
9DEBUG: org.macports.unload registered provides 'unload', a pre-existing procedure. Target override will not be provided
10DEBUG: org.macports.distfiles registered provides 'distfiles', a pre-existing procedure. Target override will not be provided
11DEBUG: adding the default universal variant
12DEBUG: Reading variant descriptions from /opt/local/var/macports/sources/rsync.macports.org/release/ports/_resources/port1.0/variant_descriptions.conf
13DEBUG: Requested variant darwin is not provided by port ustl.
14DEBUG: Requested variant i386 is not provided by port ustl.
15DEBUG: Requested variant macosx is not provided by port ustl.
16DEBUG: Attempting ln -sf /opt/local/var/macports/build/_opt_local_var_macports_sources_rsync.macports.org_release_ports_devel_ustl/work /opt/local/var/macports/sources/rsync.macports.org/release/ports/devel/ustl/work
17--->  Computing dependencies for ustl
18DEBUG: Executing org.macports.main (ustl)
19--->  Fetching ustl
20DEBUG: Executing org.macports.fetch (ustl)
21--->  Verifying checksum(s) for ustl
22DEBUG: Executing org.macports.checksum (ustl)
23--->  Checksumming ustl-0.8-0.tar.bz2
24DEBUG: Correct (md5) checksum for ustl-0.8-0.tar.bz2
25DEBUG: setting option extract.cmd to /usr/bin/bzip2
26--->  Extracting ustl
27DEBUG: Executing org.macports.extract (ustl)
28--->  Extracting ustl-0.8-0.tar.bz2
29DEBUG: setting option extract.args to /opt/local/var/macports/distfiles/ustl/ustl-0.8-0.tar.bz2
30DEBUG: Environment: MACOSX_DEPLOYMENT_TARGET='10.6'
31DEBUG: Assembled command: 'cd "/opt/local/var/macports/build/_opt_local_var_macports_sources_rsync.macports.org_release_ports_devel_ustl/work" && /usr/bin/bzip2 -dc /opt/local/var/macports/distfiles/ustl/ustl-0.8-0.tar.bz2 | /usr/bin/gnutar --no-same-owner -xf -'
32DEBUG: Executing org.macports.patch (ustl)
33--->  Configuring ustl
34DEBUG: Using compiler 'Mac OS X gcc 4.2'
35DEBUG: Executing org.macports.configure (ustl)
36DEBUG: Environment: CFLAGS='-O2 -arch x86_64' CPPFLAGS='-I/opt/local/include' CXXFLAGS='-O2 -arch x86_64' MACOSX_DEPLOYMENT_TARGET='10.6' CXX='/usr/bin/g++-4.2' F90FLAGS='-O2 -m64' LDFLAGS='-L/opt/local/lib' OBJC='/usr/bin/gcc-4.2' FCFLAGS='-O2 -m64' INSTALL='/usr/bin/install -c' OBJCFLAGS='-O2 -arch x86_64' FFLAGS='-O2 -m64' CC='/usr/bin/gcc-4.2'
37DEBUG: Assembled command: 'cd "/opt/local/var/macports/build/_opt_local_var_macports_sources_rsync.macports.org_release_ports_devel_ustl/work/ustl-0.8" && ./configure --prefix=/opt/local'
38bsconf.c: In function 'SubstituteHostOptions':
39bsconf.c:813: warning: format '%d' expects type 'int', but argument 5 has type 'long unsigned int'
40bsconf.c:815: warning: format '%d' expects type 'int', but argument 5 has type 'long unsigned int'
41bsconf.c:817: warning: format '%d' expects type 'int', but argument 5 has type 'long unsigned int'
42bsconf.c:819: warning: format '%d' expects type 'int', but argument 5 has type 'long unsigned int'
43bsconf.c:821: warning: format '%d' expects type 'int', but argument 5 has type 'long unsigned int'
44bsconf.c:823: warning: format '%d' expects type 'int', but argument 5 has type 'long unsigned int'
45bsconf.c:838: warning: format '%d' expects type 'int', but argument 5 has type 'long unsigned int'
46--->  Building ustl
47DEBUG: Executing org.macports.build (ustl)
48DEBUG: Environment: MACOSX_DEPLOYMENT_TARGET='10.6'
49DEBUG: Assembled command: 'cd "/opt/local/var/macports/build/_opt_local_var_macports_sources_rsync.macports.org_release_ports_devel_ustl/work/ustl-0.8" && /usr/bin/make -j2 all'
50    Compiling cmemlink.cc ...
51    Compiling fdostream.cc ...
52cc1plus: error: unrecognized command line option "-Wno-long-double"
53cc1plus: error: unrecognized command line option "-Wno-long-double"
54make: *** [fdostream.o] Error 1
55make: *** Waiting for unfinished jobs....
56make: *** [cmemlink.o] Error 1
57Error: Target org.macports.build returned: shell command " cd "/opt/local/var/macports/build/_opt_local_var_macports_sources_rsync.macports.org_release_ports_devel_ustl/work/ustl-0.8" && /usr/bin/make -j2 all " returned error 2
58DEBUG: Backtrace: shell command " cd "/opt/local/var/macports/build/_opt_local_var_macports_sources_rsync.macports.org_release_ports_devel_ustl/work/ustl-0.8" && /usr/bin/make -j2 all " returned error 2
59    while executing
60"command_exec build"
61    (procedure "portbuild::build_main" line 9)
62    invoked from within
63"$procedure $targetname"
64Warning: the following items did not execute (for ustl): org.macports.activate org.macports.build org.macports.destroot org.macports.install
65Error: Status 1 encountered during processing.
66To report a bug, see <http://guide.macports.org/#project.tickets>