Ticket #25164: alpine-i386.txt

File alpine-i386.txt, 29.2 KB (added by ryandesign (Ryan Schmidt), 11 years ago)

build log

Line 
1--->  Computing dependencies for alpine.
2--->  Fetching alpine
3--->  Verifying checksum(s) for alpine
4--->  Checksumming alpine.tar.bz2
5--->  Extracting alpine
6--->  Extracting alpine.tar.bz2
7--->  Applying patches to alpine
8--->  Applying /Users/rschmidt/macports/dports/mail/alpine/files/alpine-osx-10.6.patch
9patching file imap/Makefile
10patching file imap/src/osdep/unix/ckp_pam.c
11--->  Configuring alpine
12checking for a BSD-compatible install... /usr/bin/install -c
13checking whether build environment is sane... yes
14checking for a thread-safe mkdir -p... /i386-10.6-mp/bin/gmkdir -p
15checking for gawk... gawk
16checking whether make sets $(MAKE)... yes
17checking whether to enable maintainer-specific portions of Makefiles... no
18checking build system type... i686-apple-darwin10.3.0
19checking host system type... i686-apple-darwin10.3.0
20configure: Configuring for alpine 2.00 (i686-apple-darwin10.3.0))
21checking for gcc... /usr/bin/gcc-4.2
22checking for C compiler default output file name... a.out
23checking whether the C compiler works... yes
24checking whether we are cross compiling... no
25checking for suffix of executables...
26checking for suffix of object files... o
27checking whether we are using the GNU C compiler... yes
28checking whether /usr/bin/gcc-4.2 accepts -g... yes
29checking for /usr/bin/gcc-4.2 option to accept ISO C89... none needed
30checking for style of include used by make... GNU
31checking dependency style of /usr/bin/gcc-4.2... gcc3
32checking for /usr/bin/gcc-4.2 option to accept ISO C99... -std=gnu99
33checking for /usr/bin/gcc-4.2 -std=gnu99 option to accept ISO Standard C... (cached) -std=gnu99
34checking for a BSD-compatible install... /usr/bin/install -c
35checking whether make sets $(MAKE)... (cached) yes
36checking whether ln -s works... yes
37checking for gawk... (cached) gawk
38checking for ranlib... ranlib
39checking for a sed that does not truncate output... /usr/bin/sed
40checking for grep that handles long lines and -e... /usr/bin/grep
41checking for egrep... /usr/bin/grep -E
42checking for ld used by /usr/bin/gcc-4.2 -std=gnu99... /usr/libexec/gcc/i686-apple-darwin10/4.2.1/ld
43checking if the linker (/usr/libexec/gcc/i686-apple-darwin10/4.2.1/ld) is GNU ld... no
44checking for /usr/libexec/gcc/i686-apple-darwin10/4.2.1/ld option to reload object files... -r
45checking for BSD-compatible nm... /usr/bin/nm
46checking how to recognize dependent libraries... pass_all
47checking how to run the C preprocessor... /usr/bin/gcc-4.2 -std=gnu99 -E
48checking for ANSI C header files... yes
49checking for sys/types.h... yes
50checking for sys/stat.h... yes
51checking for stdlib.h... yes
52checking for string.h... yes
53checking for memory.h... yes
54checking for strings.h... yes
55checking for inttypes.h... yes
56checking for stdint.h... yes
57checking for unistd.h... yes
58checking dlfcn.h usability... yes
59checking dlfcn.h presence... yes
60checking for dlfcn.h... yes
61checking whether we are using the GNU C++ compiler... yes
62checking whether /usr/bin/g++-4.2 accepts -g... yes
63checking dependency style of /usr/bin/g++-4.2... gcc3
64checking how to run the C++ preprocessor... /usr/bin/g++-4.2 -E
65checking for g77... no
66checking for xlf... no
67checking for f77... no
68checking for frt... no
69checking for pgf77... no
70checking for cf77... no
71checking for fort77... no
72checking for fl32... no
73checking for af77... no
74checking for xlf90... no
75checking for f90... no
76checking for pgf90... no
77checking for pghpf... no
78checking for epcf90... no
79checking for gfortran... no
80checking for g95... no
81checking for xlf95... no
82checking for f95... no
83checking for fort... no
84checking for ifort... no
85checking for ifc... no
86checking for efc... no
87checking for pgf95... no
88checking for lf95... no
89checking for ftn... no
90checking whether we are using the GNU Fortran 77 compiler... no
91checking whether  accepts -g... no
92checking the maximum length of command line arguments... 196608
93checking command to parse /usr/bin/nm output from /usr/bin/gcc-4.2 -std=gnu99 object... ok
94checking for objdir... .libs
95checking for ar... ar
96checking for ranlib... (cached) ranlib
97checking for strip... strip
98checking if /usr/bin/gcc-4.2 -std=gnu99 supports -fno-rtti -fno-exceptions... no
99checking for /usr/bin/gcc-4.2 -std=gnu99 option to produce PIC... -fno-common
100checking if /usr/bin/gcc-4.2 -std=gnu99 PIC flag -fno-common works... yes
101checking if /usr/bin/gcc-4.2 -std=gnu99 static flag -static works... no
102checking if /usr/bin/gcc-4.2 -std=gnu99 supports -c -o file.o... yes
103checking whether the /usr/bin/gcc-4.2 -std=gnu99 linker (/usr/libexec/gcc/i686-apple-darwin10/4.2.1/ld) supports shared libraries... yes
104checking dynamic linker characteristics... darwin10.3.0 dyld
105checking how to hardcode library paths into programs... immediate
106checking whether stripping libraries is possible... yes
107checking if libtool supports shared libraries... yes
108checking whether to build shared libraries... yes
109checking whether to build static libraries... yes
110configure: creating libtool
111appending configuration tag "CXX" to libtool
112checking for ld used by /usr/bin/g++-4.2... /usr/libexec/gcc/i686-apple-darwin10/4.2.1/ld
113checking if the linker (/usr/libexec/gcc/i686-apple-darwin10/4.2.1/ld) is GNU ld... no
114checking whether the /usr/bin/g++-4.2 linker (/usr/libexec/gcc/i686-apple-darwin10/4.2.1/ld) supports shared libraries... yes
115checking for /usr/bin/g++-4.2 option to produce PIC... -fno-common
116checking if /usr/bin/g++-4.2 PIC flag -fno-common works... yes
117checking if /usr/bin/g++-4.2 static flag -static works... no
118checking if /usr/bin/g++-4.2 supports -c -o file.o... yes
119checking whether the /usr/bin/g++-4.2 linker (/usr/libexec/gcc/i686-apple-darwin10/4.2.1/ld) supports shared libraries... yes
120checking dynamic linker characteristics... darwin10.3.0 dyld
121checking how to hardcode library paths into programs... immediate
122appending configuration tag "F77" to libtool
123checking for ar... /usr/bin/ar
124checking for rm... /bin/rm
125checking for cp... /bin/cp
126checking for ln... /bin/ln
127checking for sed... /usr/bin/sed
128checking for make... /usr/bin/make
129checking whether NLS is requested... yes
130checking for msgfmt... /i386-10.6-mp/bin/msgfmt
131checking for gmsgfmt... /i386-10.6-mp/bin/msgfmt
132checking for xgettext... /i386-10.6-mp/bin/xgettext
133checking for msgmerge... /i386-10.6-mp/bin/msgmerge
134checking for ld used by GCC... /usr/libexec/gcc/i686-apple-darwin10/4.2.1/ld
135checking if the linker (/usr/libexec/gcc/i686-apple-darwin10/4.2.1/ld) is GNU ld... no
136checking for shared library run path origin... done
137checking for CFPreferencesCopyAppValue... yes
138checking for CFLocaleCopyCurrent... yes
139checking whether NLS is requested... yes
140checking for GNU gettext in libc... no
141checking for iconv... yes
142checking how to link with libiconv... -liconv
143checking for GNU gettext in libintl... yes
144checking whether to use NLS... yes
145checking where the gettext function comes from... external libintl
146checking how to link with libintl... -lintl -liconv -lc  -Wl,-framework -Wl,CoreFoundation
147checking option: dmalloc enabled... no
148checking option: debugging is enabled... yes
149checking option: optimization is enabled... yes
150checking option: mouse support enabled... yes
151checking option: quotas enabled... no
152checking option: From changing enabled... yes
153checking option: background post enabled... yes
154checking option: keyboard lock enabled... yes
155checking option: from encoding enabled... no
156checking for sendmail... /usr/sbin/sendmail
157checking for inews... no
158checking for passwd... /usr/bin/passwd
159checking for aspell... no
160checking for ispell... no
161checking for spell... no
162checking for aspell... no
163checking for ispell... no
164configure: Excluding TCL Support, and thus Web Alpine Support
165checking for setupterm in -ltinfo... no
166checking for setupterm in -lncurses... yes
167checking for ber_alloc in -llber... yes
168checking for library containing ldap_init... -lldap
169configure: Including LDAP Support
170checking if we should define LDAP_DEPRECATED... yes
171checking for library containing SSL_library_init... -lssl
172configure: OpenSSL libraries FOUND
173checking for library containing gss_init_sec_context... -lgss
174checking gssapi/gssapi_generic.h usability... yes
175checking gssapi/gssapi_generic.h presence... yes
176checking for gssapi/gssapi_generic.h... yes
177checking for library containing regcomp... none required
178checking regex.h usability... yes
179checking regex.h presence... yes
180checking for regex.h... yes
181checking for pthread support... checking for the pthreads library -lpthreads... no
182checking whether pthreads work without any flags... yes
183checking for joinable pthread attribute... PTHREAD_CREATE_JOINABLE
184checking if more special flags are required for pthreads... -D_THREAD_SAFE
185yes
186checking for library containing nanosleep... none required
187checking for ANSI C header files... (cached) yes
188checking for dirent.h that defines DIR... yes
189checking for library containing opendir... none required
190checking whether stat file-mode macros are broken... no
191checking for sys/wait.h that is POSIX.1 compatible... yes
192checking whether time.h and sys/time.h may both be included... yes
193checking whether termios.h defines TIOCGWINSZ... yes
194checking for unistd.h... (cached) yes
195checking errno.h usability... yes
196checking errno.h presence... yes
197checking for errno.h... yes
198checking ctype.h usability... yes
199checking ctype.h presence... yes
200checking for ctype.h... yes
201checking fcntl.h usability... yes
202checking fcntl.h presence... yes
203checking for fcntl.h... yes
204checking signal.h usability... yes
205checking signal.h presence... yes
206checking for signal.h... yes
207checking setjmp.h usability... yes
208checking setjmp.h presence... yes
209checking for setjmp.h... yes
210checking for memory.h... (cached) yes
211checking sys/param.h usability... yes
212checking sys/param.h presence... yes
213checking for sys/param.h... yes
214checking sys/socket.h usability... yes
215checking sys/socket.h presence... yes
216checking for sys/socket.h... yes
217checking sys/uio.h usability... yes
218checking sys/uio.h presence... yes
219checking for sys/uio.h... yes
220checking sys/un.h usability... yes
221checking sys/un.h presence... yes
222checking for sys/un.h... yes
223checking limits.h usability... yes
224checking limits.h presence... yes
225checking for limits.h... yes
226checking wchar.h usability... yes
227checking wchar.h presence... yes
228checking for wchar.h... yes
229checking sys/poll.h usability... yes
230checking sys/poll.h presence... yes
231checking for sys/poll.h... yes
232checking stropts.h usability... no
233checking stropts.h presence... no
234checking for stropts.h... no
235checking netdb.h usability... yes
236checking netdb.h presence... yes
237checking for netdb.h... yes
238checking syslog.h usability... yes
239checking syslog.h presence... yes
240checking for syslog.h... yes
241checking sys/syslog.h usability... yes
242checking sys/syslog.h presence... yes
243checking for sys/syslog.h... yes
244checking locale.h usability... yes
245checking locale.h presence... yes
246checking for locale.h... yes
247checking langinfo.h usability... yes
248checking langinfo.h presence... yes
249checking for langinfo.h... yes
250checking utime.h usability... yes
251checking utime.h presence... yes
252checking for utime.h... yes
253checking sys/utime.h usability... no
254checking sys/utime.h presence... no
255checking for sys/utime.h... no
256checking pthread.h usability... yes
257checking pthread.h presence... yes
258checking for pthread.h... yes
259checking pwd.h usability... yes
260checking pwd.h presence... yes
261checking for pwd.h... yes
262checking assert.h usability... yes
263checking assert.h presence... yes
264checking for assert.h... yes
265checking termios.h usability... yes
266checking termios.h presence... yes
267checking for termios.h... yes
268checking return type of signal handlers... void
269checking for size_t... yes
270checking for mode_t... yes
271checking for pid_t... yes
272checking for uid_t in sys/types.h... yes
273checking whether struct tm is in sys/time.h or time.h... time.h
274checking for union wait... yes
275checking for stdint.h... (cached) yes
276checking for stdint.h... (cached) yes
277checking argument pointer type of qsort compare function and base... void
278checking sys/select.h usability... yes
279checking sys/select.h presence... yes
280checking for sys/select.h... yes
281checking for sys/socket.h... (cached) yes
282checking types of arguments for select... int,fd_set *,struct timeval *
283checking for working strcoll... yes
284checking vfork.h usability... no
285checking vfork.h presence... no
286checking for vfork.h... no
287checking for fork... yes
288checking for vfork... yes
289checking for working fork... yes
290checking for working vfork... (cached) yes
291checking for strchr... yes
292checking for memcpy... yes
293checking for strtol... yes
294checking for strtoul... yes
295checking for select... yes
296checking for poll... yes
297checking for qsort... yes
298checking for getuid... yes
299checking for getpwuid... yes
300checking for getpwnam... yes
301checking for gettimeofday... yes
302checking for tmpfile... yes
303checking for uname... yes
304checking for rename... yes
305checking for read... yes
306checking for signal... yes
307checking for setjmp... yes
308checking for chown... yes
309checking for wait4... yes
310checking for waitpid... yes
311checking for wait... yes
312checking for srandom... yes
313checking for popen... yes
314checking for pclose... yes
315checking for fsync... yes
316checking for truncate... yes
317checking for listen... yes
318checking for wcwidth... yes
319checking for mbstowcs... yes
320checking for wcrtomb... yes
321checking for putenv... yes
322checking for setenv... yes
323checking for library containing gethostname... none required
324checking for library containing socket... none required
325checking for library containing bind... none required
326checking for sigaction... yes
327checking for sigemptyset... yes
328checking for sigaddset... yes
329checking for sigprocmask... yes
330checking for library containing syslog... none required
331checking for pam_start in -lpam... yes
332configure: * * * SSL file "/System/Library/OpenSSL/certs/factory.pem" is missing.
333configure: * * *   This might indicate that CA certs did not get properly
334configure: * * *   installed.  If you get certificate validation failures
335configure: * * *   in Alpine, this might be the reason for them.
336configure: * * * No 8-hexdigit symlinks in certificate directory "/System/Library/OpenSSL/certs".
337configure: * * *   This might indicate that CA certs did not get properly
338configure: * * *   installed.  If you get certificate validation failures
339configure: * * *   in Alpine, this might be the reason for them.
340configure: * * * Including Kerberos5 functionality
341configure: * * * TCL libraries could not be found.
342configure: * * * WEB ALPINE COMPONENT WILL NOT BE BUILT.
343configure: creating ./config.status
344config.status: creating m4/Makefile
345config.status: creating po/Makefile.in
346config.status: WARNING:  po/Makefile.in.in seems to ignore the --datarootdir setting
347config.status: creating regex/Makefile
348config.status: creating pith/osdep/Makefile
349config.status: creating pith/charconv/Makefile
350config.status: creating pith/Makefile
351config.status: creating pico/osdep/Makefile
352config.status: creating pico/Makefile
353config.status: creating alpine/osdep/Makefile
354config.status: creating alpine/Makefile
355config.status: creating web/src/Makefile
356config.status: creating web/src/pubcookie/Makefile
357config.status: creating web/src/alpined.d/Makefile
358config.status: creating Makefile
359config.status: creating include/config.h
360config.status: executing depfiles commands
361config.status: executing default-1 commands
362config.status: creating po/POTFILES
363config.status: creating po/Makefile
364--->  Building alpine
365if test ! -L c-client ; then ln -s imap/c-client c-client ; fi
366touch imap/ip6
367cd imap && /usr/bin/make oxp    EXTRASPECIALS="GSSLIB=//i386-10.6-mp/lib SSLDIR=/i386-10.6-mp"
368+++++++++++++++++++++++++++++++++++++++++++++++++++++++++++++++++
369+ Building in full compliance with RFC 3501 security
370+ requirements:
371++ TLS/SSL encryption is supported
372++ Unencrypted plaintext passwords are prohibited
373+++++++++++++++++++++++++++++++++++++++++++++++++++++++++++++++++
374Applying an process to sources...
375tools/an "ln -s" src/c-client c-client
376tools/an "ln -s" src/ansilib c-client
377tools/an "ln -s" src/charset c-client
378tools/an "ln -s" src/osdep/unix c-client
379tools/an "ln -s" src/mtest mtest
380tools/an "ln -s" src/ipopd ipopd
381tools/an "ln -s" src/imapd imapd
382tools/an "ln -s" src/mailutil mailutil
383tools/an "ln -s" src/mlock mlock
384tools/an "ln -s" src/dmail dmail
385tools/an "ln -s" src/tmail tmail
386ln -s tools/an .
387touch ip6
388make build EXTRACFLAGS='' EXTRALDFLAGS='' EXTRADRIVERS='mbox' EXTRAAUTHENTICATORS='' PASSWDTYPE=std SSLTYPE=nopwd IP=4 EXTRASPECIALS='GSSLIB=//i386-10.6-mp/lib SSLDIR=/i386-10.6-mp' BUILDTYPE=osx IP=6 EXTRAAUTHENTICATORS=" gss" \
389        PASSWDTYPE=pam \
390        SPECIALS="SSLINCLUDE=/usr/include/openssl SSLLIB=/usr/lib SSLCERTS=/System/Library/OpenSSL/certs SSLKEYS=/System/Library/OpenSSL/private GSSINCLUDE=/usr/include GSSLIB=/usr/lib PAMDLFLAGS=-lpam"
391make[3]: `ip6' is up to date.
392Building c-client for osx...
393echo `cat SPECIALS` GSSLIB=//i386-10.6-mp/lib SSLDIR=/i386-10.6-mp > c-client/SPECIALS
394cd c-client;make osx EXTRACFLAGS=''\
395         EXTRALDFLAGS=''\
396         EXTRADRIVERS='mbox'\
397         EXTRAAUTHENTICATORS='gss'\
398         PASSWDTYPE=pam SSLTYPE=nopwd IP=6\
399         SSLINCLUDE=/usr/include/openssl SSLLIB=/usr/lib SSLCERTS=/System/Library/OpenSSL/certs SSLKEYS=/System/Library/OpenSSL/private GSSINCLUDE=/usr/include GSSLIB=/usr/lib PAMDLFLAGS=-lpam GSSLIB=//i386-10.6-mp/lib SSLDIR=/i386-10.6-mp
400make build EXTRACFLAGS='' EXTRALDFLAGS='' EXTRADRIVERS='mbox' EXTRAAUTHENTICATORS='gss' PASSWDTYPE=pam SSLTYPE=nopwd IP=6 `cat SPECIALS` OS=osx \
401         CRXTYPE=nfs \
402         SPOOLDIR=/var/spool MAILSPOOL=/var/mail \
403         RSHPATH=/usr/bin/rsh \
404         BASECFLAGS="-g -O2 -pipe -fno-omit-frame-pointer -Wno-pointer-sign"
405sh -c 'rm -rf auths.c crexcl.c ip_unix.c linkage.[ch] siglocal.c osdep*.[ch] *.o ARCHIVE *FLAGS *TYPE c-client.a || true'
406Once-only environment setup...
407echo cc > CCTYPE
408echo -g -O2 -pipe -fno-omit-frame-pointer -Wno-pointer-sign '' -DCHUNKSIZE=65536 > CFLAGS
409echo -DCREATEPROTO=unixproto -DEMPTYPROTO=unixproto \
410         -DMD5ENABLE=\"/etc/cram-md5.pwd\" -DMAILSPOOL=\"/var/mail\" \
411         -DANONYMOUSHOME=\"/var/mail/anonymous\" \
412         -DACTIVEFILE=\"/usr/lib/news/active\" -DNEWSSPOOL=\"/var/spool/news\" \
413         -DRSHPATH=\"/usr/bin/rsh\" -DLOCKPGM=\"\" \
414         -DLOCKPGM1=\"/usr/libexec/mlock\" -DLOCKPGM2=\"/usr/sbin/mlock\" \
415         -DLOCKPGM3=\"/etc/mlock\" > OSCFLAGS
416echo   > LDFLAGS
417echo "ar rc c-client.a osdep.o mail.o misc.o newsrc.o smanager.o utf8.o utf8aux.o siglocal.o dummy.o pseudo.o netmsg.o flstring.o fdstring.o rfc822.o nntp.o smtp.o imap4r1.o pop3.o unix.o mbx.o mmdf.o tenex.o mtx.o news.o phile.o mh.o mx.o mix.o;ranlib c-client.a" > ARCHIVE
418echo osx > OSTYPE
419./drivers mbox imap nntp pop3 mix mx mbx tenex mtx mh mmdf unix news phile dummy
420./mkauths gss ext md5 pla log
421echo -I/usr/include -DGSS_C_NT_HOSTBASED_SERVICE=gss_nt_service_name -DKRB5_DEPRECATED=1 >> OSCFLAGS
422sh -c '(test -f //i386-10.6-mp/lib/libk5crypto.a) && echo -L//i386-10.6-mp/lib -lgssapi_krb5 -lkrb5 -lk5crypto -lcom_err || echo -L//i386-10.6-mp/lib -lgssapi_krb5 -lkrb5 -lcrypto -lcom_err' >> LDFLAGS
423echo "#include \"kerb_mit.c\"" >> auths.c
424echo "  mail_versioncheck (CCLIENTVERSION);" >> linkage.c
425ln -s os_osx.h osdep.h
426ln -s os_osx.c osdepbas.c
427ln -s log_std.c osdeplog.c
428ln -s sig_bsd.c siglocal.c
429ln -s crx_nfs.c crexcl.c
430ln -s ip6_unix.c ip_unix.c
431sh -c '(test osx = sc5 -o osx = sco -o ! -f /usr/include/sys/statvfs.h) && echo -DNOFSTATVFS >> OSCFLAGS || fgrep statvfs64 /usr/include/sys/statvfs.h > /dev/null || echo -DNOFSTATVFS64 >> OSCFLAGS'
432PAM password authentication
433echo -lpam -ldl >> LDFLAGS
434ln -s ckp_pam.c osdepckp.c
435Building with SSL
436ln -s ssl_unix.c osdepssl.c
437echo -I/usr/include/openssl -I/usr/include/openssl/openssl -DSSL_CERT_DIRECTORY=\"/System/Library/OpenSSL/certs\" -DSSL_KEY_DIRECTORY=\"/System/Library/OpenSSL/private\" >> OSCFLAGS
438echo "  ssl_onceonlyinit ();" >> linkage.c
439echo -L/usr/lib -lssl -lcrypto  >> LDFLAGS
440Building with SSL and plaintext passwords disabled unless SSL/TLS
441echo "  mail_parameters (NIL,SET_DISABLEPLAINTEXT,(void *) 2);" >> linkage.c
442cat osdepbas.c osdepckp.c osdeplog.c osdepssl.c > osdep.c
443Building OS-dependent module
444If you get No such file error messages for files x509.h, ssl.h,
445pem.h, buffer.h, bio.h, and crypto.h, that means that OpenSSL
446is not installed on your system. Either install OpenSSL first
447or build with command: make osx SSLTYPE=none
448`cat CCTYPE` -c `cat CFLAGS` `cat OSCFLAGS` -c osdep.c
449`cat CCTYPE` -c `cat CFLAGS` mail.c
450`cat CCTYPE` -c `cat CFLAGS` misc.c
451`cat CCTYPE` -c `cat CFLAGS` newsrc.c
452`cat CCTYPE` -c `cat CFLAGS` smanager.c
453`cat CCTYPE` -c `cat CFLAGS` utf8.c
454`cat CCTYPE` -c `cat CFLAGS` utf8aux.c
455`cat CCTYPE` -c `cat CFLAGS` siglocal.c
456`cat CCTYPE` -c `cat CFLAGS` dummy.c
457`cat CCTYPE` -c `cat CFLAGS` pseudo.c
458`cat CCTYPE` -c `cat CFLAGS` netmsg.c
459`cat CCTYPE` -c `cat CFLAGS` flstring.c
460`cat CCTYPE` -c `cat CFLAGS` fdstring.c
461`cat CCTYPE` -c `cat CFLAGS` rfc822.c
462`cat CCTYPE` -c `cat CFLAGS` nntp.c
463`cat CCTYPE` -c `cat CFLAGS` smtp.c
464`cat CCTYPE` -c `cat CFLAGS` imap4r1.c
465`cat CCTYPE` -c `cat CFLAGS` pop3.c
466`cat CCTYPE` -c `cat CFLAGS` unix.c
467`cat CCTYPE` -c `cat CFLAGS` mbx.c
468`cat CCTYPE` -c `cat CFLAGS` mmdf.c
469`cat CCTYPE` -c `cat CFLAGS` tenex.c
470`cat CCTYPE` -c `cat CFLAGS` mtx.c
471`cat CCTYPE` -c `cat CFLAGS` news.c
472`cat CCTYPE` -c `cat CFLAGS` phile.c
473`cat CCTYPE` -c `cat CFLAGS` mh.c
474`cat CCTYPE` -c `cat CFLAGS` mx.c
475`cat CCTYPE` -c `cat CFLAGS` mix.c
476mix.c: In function 'mix_create':
477mix.c:420: warning: format '%08lx' expects type 'long unsigned int', but argument 4 has type 'int'
478mix.c: In function 'mix_copy':
479mix.c:1393: warning: format '%08lx' expects type 'long unsigned int', but argument 6 has type 'int'
480mix.c:1393: warning: format '%08lx' expects type 'long unsigned int', but argument 16 has type 'int'
481mix.c: In function 'mix_append':
482mix.c:1550: warning: format '%08lx' expects type 'long unsigned int', but argument 6 has type 'int'
483mix.c:1550: warning: format '%08lx' expects type 'long unsigned int', but argument 16 has type 'int'
484mix.c: In function 'mix_index_update':
485mix.c:2237: warning: format '%08lx' expects type 'long unsigned int', but argument 5 has type 'int'
486mix.c:2237: warning: format '%08lx' expects type 'long unsigned int', but argument 15 has type 'int'
487mix.c:2237: warning: format '%08lx' expects type 'long unsigned int', but argument 16 has type 'int'
488mix.c:2237: warning: format '%08lx' expects type 'long unsigned int', but argument 17 has type 'int'
489mix.c:2237: warning: format '%08lx' expects type 'long unsigned int', but argument 18 has type 'int'
490mix.c:2237: warning: format '%08lx' expects type 'long unsigned int', but argument 19 has type 'int'
491mix.c: In function 'mix_status_update':
492mix.c:2318: warning: format '%08lx' expects type 'long unsigned int', but argument 5 has type 'int'
493mix.c:2318: warning: format '%08lx' expects type 'long unsigned int', but argument 6 has type 'int'
494mix.c:2318: warning: format '%08lx' expects type 'long unsigned int', but argument 8 has type 'int'
495mix.c: In function 'mix_data_open':
496mix.c:2410: warning: format '%ld' expects type 'long int', but argument 7 has type 'off_t'
497sh -c 'rm -rf c-client.a || true'
498ar rc c-client.a osdep.o mail.o misc.o newsrc.o smanager.o utf8.o utf8aux.o siglocal.o dummy.o pseudo.o netmsg.o flstring.o fdstring.o rfc822.o nntp.o smtp.o imap4r1.o pop3.o unix.o mbx.o mmdf.o tenex.o mtx.o news.o phile.o mh.o mx.o mix.o;ranlib c-client.a
499echo osx > OSTYPE
500touch rebuild
501sh -c 'rm -rf rebuild || true'
502Building bundled tools...
503cd mtest;make
504`cat ../c-client/CCTYPE` -I../c-client `cat ../c-client/CFLAGS`   -c -o mtest.o mtest.c
505`cat ../c-client/CCTYPE` -I../c-client `cat ../c-client/CFLAGS` -o mtest mtest.o ../c-client/c-client.a `cat ../c-client/LDFLAGS`
506ld: warning: in //i386-10.6-mp/lib/libcrypto.dylib, file was built for i386 which is not the architecture being linked (x86_64)
507ld: warning: in //i386-10.6-mp/lib/libssl.dylib, file was built for i386 which is not the architecture being linked (x86_64)
508Undefined symbols:
509  "_SSL_write", referenced from:
510      _ssl_sout in c-client.a(osdep.o)
511      _ssl_start in c-client.a(osdep.o)
512  "_ERR_get_error", referenced from:
513      _ssl_genkey in c-client.a(osdep.o)
514      _ssl_server_init in c-client.a(osdep.o)
515  "_SSLv23_client_method", referenced from:
516      _ssl_start in c-client.a(osdep.o)
517  "_SSL_CTX_load_verify_locations", referenced from:
518      _ssl_start in c-client.a(osdep.o)
519  "_ERR_load_crypto_strings", referenced from:
520      _ssl_server_init in c-client.a(osdep.o)
521  "_PEM_read_bio_X509", referenced from:
522      _ssl_start in c-client.a(osdep.o)
523  "_X509_free", referenced from:
524      _ssl_start in c-client.a(osdep.o)
525  "_SSL_ctrl", referenced from:
526      _ssl_start in c-client.a(osdep.o)
527  "_SSL_state", referenced from:
528      _ssl_start in c-client.a(osdep.o)
529  "_SSL_pending", referenced from:
530      _ssl_server_input_wait in c-client.a(osdep.o)
531      _ssl_getdata in c-client.a(osdep.o)
532  "_SSL_CTX_set_verify", referenced from:
533      _ssl_start in c-client.a(osdep.o)
534      _ssl_start in c-client.a(osdep.o)
535  "_BIO_free", referenced from:
536      _ssl_start in c-client.a(osdep.o)
537      _ssl_start in c-client.a(osdep.o)
538      _ssl_start in c-client.a(osdep.o)
539  "_X509_STORE_CTX_get_error", referenced from:
540      _ssl_open_verify in c-client.a(osdep.o)
541  "_SSL_CTX_use_RSAPrivateKey_file", referenced from:
542      _ssl_server_init in c-client.a(osdep.o)
543  "_SSLv23_server_method", referenced from:
544      _ssl_server_init in c-client.a(osdep.o)
545  "_RAND_seed", referenced from:
546      _ssl_onceonlyinit in c-client.a(osdep.o)
547  "_SSL_free", referenced from:
548      _ssl_abort in c-client.a(osdep.o)
549  "_SSL_new", referenced from:
550      _ssl_start in c-client.a(osdep.o)
551      _ssl_server_init in c-client.a(osdep.o)
552  "_TLSv1_client_method", referenced from:
553      _ssl_start in c-client.a(osdep.o)
554  "_PEM_read_bio_PrivateKey", referenced from:
555      _ssl_start in c-client.a(osdep.o)
556  "_SSL_CTX_use_certificate", referenced from:
557      _ssl_start in c-client.a(osdep.o)
558  "_SSL_accept", referenced from:
559      _ssl_server_init in c-client.a(osdep.o)
560  "_ERR_error_string", referenced from:
561      _ssl_genkey in c-client.a(osdep.o)
562      _ssl_server_init in c-client.a(osdep.o)
563  "_EVP_PKEY_free", referenced from:
564      _ssl_start in c-client.a(osdep.o)
565  "_SSL_set_bio", referenced from:
566      _ssl_start in c-client.a(osdep.o)
567  "_X509_NAME_oneline", referenced from:
568      _ssl_open_verify in c-client.a(osdep.o)
569  "_SSL_set_connect_state", referenced from:
570      _ssl_start in c-client.a(osdep.o)
571  "_SSL_CTX_use_certificate_chain_file", referenced from:
572      _ssl_server_init in c-client.a(osdep.o)
573  "_SSL_CTX_use_PrivateKey", referenced from:
574      _ssl_start in c-client.a(osdep.o)
575  "_SSL_get_fd", referenced from:
576      _ssl_server_input_wait in c-client.a(osdep.o)
577      _ssl_getdata in c-client.a(osdep.o)
578  "_sk_num", referenced from:
579      _ssl_start in c-client.a(osdep.o)
580  "_BIO_new_mem_buf", referenced from:
581      _ssl_start in c-client.a(osdep.o)
582      _ssl_start in c-client.a(osdep.o)
583  "_TLSv1_server_method", referenced from:
584      _ssl_server_init in c-client.a(osdep.o)
585  "_SSL_CTX_set_tmp_rsa_callback", referenced from:
586      _ssl_server_init in c-client.a(osdep.o)
587  "_X509_get_ext_d2i", referenced from:
588      _ssl_start in c-client.a(osdep.o)
589  "_SSL_CTX_ctrl", referenced from:
590      _ssl_start in c-client.a(osdep.o)
591      _ssl_server_init in c-client.a(osdep.o)
592      _ssl_server_init in c-client.a(osdep.o)
593  "_X509_verify_cert_error_string", referenced from:
594      _ssl_open_verify in c-client.a(osdep.o)
595  "_SSL_CTX_free", referenced from:
596      _ssl_abort in c-client.a(osdep.o)
597  "_X509_STORE_CTX_get_current_cert", referenced from:
598      _ssl_open_verify in c-client.a(osdep.o)
599  "_SSL_load_error_strings", referenced from:
600      _ssl_server_init in c-client.a(osdep.o)
601  "_SSL_read", referenced from:
602      _ssl_server_input_wait in c-client.a(osdep.o)
603      _ssl_getdata in c-client.a(osdep.o)
604  "_SSL_set_fd", referenced from:
605      _ssl_server_init in c-client.a(osdep.o)
606  "_SSL_shutdown", referenced from:
607      _ssl_abort in c-client.a(osdep.o)
608  "_SSL_library_init", referenced from:
609      _ssl_onceonlyinit in c-client.a(osdep.o)
610  "_X509_get_subject_name", referenced from:
611      _ssl_open_verify in c-client.a(osdep.o)
612  "_sk_value", referenced from:
613      _ssl_start in c-client.a(osdep.o)
614  "_SSL_CTX_set_cipher_list", referenced from:
615      _ssl_server_init in c-client.a(osdep.o)
616  "_RSA_generate_key", referenced from:
617      _ssl_genkey in c-client.a(osdep.o)
618  "_SSL_get_peer_certificate", referenced from:
619      _ssl_start in c-client.a(osdep.o)
620  "_SSL_CTX_set_default_verify_paths", referenced from:
621      _ssl_start in c-client.a(osdep.o)
622  "_SSL_get_error", referenced from:
623      _ssl_sout in c-client.a(osdep.o)
624      _ssl_getdata in c-client.a(osdep.o)
625      _ssl_getdata in c-client.a(osdep.o)
626  "_BIO_new_socket", referenced from:
627      _ssl_start in c-client.a(osdep.o)
628  "_SSL_CTX_new", referenced from:
629      _ssl_start in c-client.a(osdep.o)
630      _ssl_server_init in c-client.a(osdep.o)
631ld: symbol(s) not found
632collect2: ld returned 1 exit status
633make[3]: *** [mtest] Error 1
634make[2]: *** [bundled] Error 2
635make[1]: *** [oxp] Error 2
636make: *** [c-client] Error 2
637shell command " cd "/i386-10.6-mp/var/macports/build/_Users_rschmidt_macports_dports_mail_alpine/work/alpine-2.00" && /usr/bin/make all C_CLIENT_SPECIALS="GSSLIB=//i386-10.6-mp/lib SSLDIR=/i386-10.6-mp" " returned error 2
638Error: Target org.macports.build returned: shell command failed
639Warning: the following items did not execute (for alpine): org.macports.activate org.macports.build org.macports.destroot org.macports.install
640Log for alpine is at: /i386-10.6-mp/var/macports/logs/_Users_rschmidt_macports_dports_mail_alpine/main.log
641Error: Status 1 encountered during processing.
642To report a bug, see <http://guide.macports.org/#project.tickets>