Ticket #26048: main.log

File main.log, 121.6 KB (added by enrique.fernandez.perdomo@…, 11 years ago)

macports log file after build failure

Line 
1version:1
2:debug:main epoch: in tree: 0 installed: 0
3:debug:main libtool 2.2.10_0 exists in the ports tree
4:debug:main libtool 2.2.10_0  is the latest installed
5:debug:main libtool 2.2.10_0  is active
6:debug:main Merging existing variants '' into variants
7:debug:main new fully merged portvariants:
8:debug:main Changing to port directory: /opt/local/var/macports/sources/rsync.macports.org/release/ports/devel/libtool
9:debug:main OS darwin/10.4.0 (Mac OS X 10.6) arch i386
10:debug:main org.macports.load registered provides 'load', a pre-existing procedure. Target override will not be provided
11:debug:main org.macports.unload registered provides 'unload', a pre-existing procedure. Target override will not be provided
12:debug:main org.macports.distfiles registered provides 'distfiles', a pre-existing procedure. Target override will not be provided
13:debug:main adding the default universal variant
14:debug:main Reading variant descriptions from /opt/local/var/macports/sources/rsync.macports.org/release/ports/_resources/port1.0/variant_descriptions.conf
15:debug:main No need to upgrade! libtool 2.2.10_0 >= libtool 2.2.10_0
16:debug:main epoch: in tree: 0 installed: 0
17:debug:main pkgconfig 0.25_1 exists in the ports tree
18:debug:main pkgconfig 0.25_1  is the latest installed
19:debug:main pkgconfig 0.25_1  is active
20:debug:main Merging existing variants '' into variants
21:debug:main new fully merged portvariants:
22:debug:main Changing to port directory: /opt/local/var/macports/sources/rsync.macports.org/release/ports/devel/pkgconfig
23:debug:main OS darwin/10.4.0 (Mac OS X 10.6) arch i386
24:debug:main org.macports.load registered provides 'load', a pre-existing procedure. Target override will not be provided
25:debug:main org.macports.unload registered provides 'unload', a pre-existing procedure. Target override will not be provided
26:debug:main org.macports.distfiles registered provides 'distfiles', a pre-existing procedure. Target override will not be provided
27:debug:main adding the default universal variant
28:debug:main Reading variant descriptions from /opt/local/var/macports/sources/rsync.macports.org/release/ports/_resources/port1.0/variant_descriptions.conf
29:debug:main No need to upgrade! pkgconfig 0.25_1 >= pkgconfig 0.25_1
30:debug:main epoch: in tree: 0 installed: 0
31:debug:main gtk2 2.20.1_0 exists in the ports tree
32:debug:main gtk2 2.20.1_0 +x11 is the latest installed
33:debug:main gtk2 2.20.1_0 +x11 is active
34:debug:main Merging existing variants '+x11' into variants
35:debug:main new fully merged portvariants: x11 +
36:debug:main Changing to port directory: /opt/local/var/macports/sources/rsync.macports.org/release/ports/x11/gtk2
37:debug:main OS darwin/10.4.0 (Mac OS X 10.6) arch i386
38:debug:main org.macports.load registered provides 'load', a pre-existing procedure. Target override will not be provided
39:debug:main org.macports.unload registered provides 'unload', a pre-existing procedure. Target override will not be provided
40:debug:main org.macports.distfiles registered provides 'distfiles', a pre-existing procedure. Target override will not be provided
41:debug:main Using group file /opt/local/var/macports/sources/rsync.macports.org/release/ports/_resources/port1.0/group/archcheck-1.0.tcl
42:debug:main Using group file /opt/local/var/macports/sources/rsync.macports.org/release/ports/_resources/port1.0/group/muniversal-1.0.tcl
43:debug:main Reading variant descriptions from /opt/local/var/macports/sources/rsync.macports.org/release/ports/_resources/port1.0/variant_descriptions.conf
44:debug:main Using group file /opt/local/var/macports/sources/rsync.macports.org/release/ports/_resources/port1.0/group/xcodeversion-1.0.tcl
45:debug:main universal variant already exists, so not adding the default one
46:debug:main Executing variant x11 provides x11
47:debug:main No need to upgrade! gtk2 2.20.1_0 >= gtk2 2.20.1_0
48:debug:main epoch: in tree: 0 installed: 0
49:debug:main tiff 3.9.4_0 exists in the ports tree
50:debug:main tiff 3.9.4_0  is the latest installed
51:debug:main tiff 3.9.4_0  is active
52:debug:main Merging existing variants '' into variants
53:debug:main new fully merged portvariants:
54:debug:main Changing to port directory: /opt/local/var/macports/sources/rsync.macports.org/release/ports/graphics/tiff
55:debug:main OS darwin/10.4.0 (Mac OS X 10.6) arch i386
56:debug:main org.macports.load registered provides 'load', a pre-existing procedure. Target override will not be provided
57:debug:main org.macports.unload registered provides 'unload', a pre-existing procedure. Target override will not be provided
58:debug:main org.macports.distfiles registered provides 'distfiles', a pre-existing procedure. Target override will not be provided
59:debug:main Using group file /opt/local/var/macports/sources/rsync.macports.org/release/ports/_resources/port1.0/group/xcodeversion-1.0.tcl
60:debug:main adding the default universal variant
61:debug:main Reading variant descriptions from /opt/local/var/macports/sources/rsync.macports.org/release/ports/_resources/port1.0/variant_descriptions.conf
62:debug:main No need to upgrade! tiff 3.9.4_0 >= tiff 3.9.4_0
63:debug:main epoch: in tree: 0 installed: 0
64:debug:main jpeg 8b_0 exists in the ports tree
65:debug:main jpeg 8b_0  is the latest installed
66:debug:main jpeg 8b_0  is active
67:debug:main Merging existing variants '' into variants
68:debug:main new fully merged portvariants:
69:debug:main Changing to port directory: /opt/local/var/macports/sources/rsync.macports.org/release/ports/graphics/jpeg
70:debug:main OS darwin/10.4.0 (Mac OS X 10.6) arch i386
71:debug:main org.macports.load registered provides 'load', a pre-existing procedure. Target override will not be provided
72:debug:main org.macports.unload registered provides 'unload', a pre-existing procedure. Target override will not be provided
73:debug:main org.macports.distfiles registered provides 'distfiles', a pre-existing procedure. Target override will not be provided
74:debug:main adding the default universal variant
75:debug:main Reading variant descriptions from /opt/local/var/macports/sources/rsync.macports.org/release/ports/_resources/port1.0/variant_descriptions.conf
76:debug:main No need to upgrade! jpeg 8b_0 >= jpeg 8b_0
77:debug:main epoch: in tree: 0 installed: 0
78:debug:main zlib 1.2.5_0 exists in the ports tree
79:debug:main zlib 1.2.5_0  is the latest installed
80:debug:main zlib 1.2.5_0  is active
81:debug:main Merging existing variants '' into variants
82:debug:main new fully merged portvariants:
83:debug:main Changing to port directory: /opt/local/var/macports/sources/rsync.macports.org/release/ports/archivers/zlib
84:debug:main OS darwin/10.4.0 (Mac OS X 10.6) arch i386
85:debug:main org.macports.load registered provides 'load', a pre-existing procedure. Target override will not be provided
86:debug:main org.macports.unload registered provides 'unload', a pre-existing procedure. Target override will not be provided
87:debug:main org.macports.distfiles registered provides 'distfiles', a pre-existing procedure. Target override will not be provided
88:debug:main Using group file /opt/local/var/macports/sources/rsync.macports.org/release/ports/_resources/port1.0/group/xcodeversion-1.0.tcl
89:debug:main adding the default universal variant
90:debug:main Reading variant descriptions from /opt/local/var/macports/sources/rsync.macports.org/release/ports/_resources/port1.0/variant_descriptions.conf
91:debug:main No need to upgrade! zlib 1.2.5_0 >= zlib 1.2.5_0
92:debug:main epoch: in tree: 0 installed: 0
93:debug:main jasper 1.900.1_7 exists in the ports tree
94:debug:main jasper 1.900.1_7  is the latest installed
95:debug:main jasper 1.900.1_7  is active
96:debug:main Merging existing variants '' into variants
97:debug:main new fully merged portvariants:
98:debug:main Changing to port directory: /opt/local/var/macports/sources/rsync.macports.org/release/ports/graphics/jasper
99:debug:main OS darwin/10.4.0 (Mac OS X 10.6) arch i386
100:debug:main org.macports.load registered provides 'load', a pre-existing procedure. Target override will not be provided
101:debug:main org.macports.unload registered provides 'unload', a pre-existing procedure. Target override will not be provided
102:debug:main org.macports.distfiles registered provides 'distfiles', a pre-existing procedure. Target override will not be provided
103:debug:main adding the default universal variant
104:debug:main Reading variant descriptions from /opt/local/var/macports/sources/rsync.macports.org/release/ports/_resources/port1.0/variant_descriptions.conf
105:debug:main No need to upgrade! jasper 1.900.1_7 >= jasper 1.900.1_7
106:debug:main epoch: in tree: 0 installed: 0
107:debug:main atk 1.30.0_0 exists in the ports tree
108:debug:main atk 1.30.0_0  is the latest installed
109:debug:main atk 1.30.0_0  is active
110:debug:main Merging existing variants '' into variants
111:debug:main new fully merged portvariants:
112:debug:main Changing to port directory: /opt/local/var/macports/sources/rsync.macports.org/release/ports/devel/atk
113:debug:main OS darwin/10.4.0 (Mac OS X 10.6) arch i386
114:debug:main org.macports.load registered provides 'load', a pre-existing procedure. Target override will not be provided
115:debug:main org.macports.unload registered provides 'unload', a pre-existing procedure. Target override will not be provided
116:debug:main org.macports.distfiles registered provides 'distfiles', a pre-existing procedure. Target override will not be provided
117:debug:main Using group file /opt/local/var/macports/sources/rsync.macports.org/release/ports/_resources/port1.0/group/archcheck-1.0.tcl
118:debug:main Using group file /opt/local/var/macports/sources/rsync.macports.org/release/ports/_resources/port1.0/group/muniversal-1.0.tcl
119:debug:main Reading variant descriptions from /opt/local/var/macports/sources/rsync.macports.org/release/ports/_resources/port1.0/variant_descriptions.conf
120:debug:main universal variant already exists, so not adding the default one
121:debug:main No need to upgrade! atk 1.30.0_0 >= atk 1.30.0_0
122:debug:main epoch: in tree: 0 installed: 0
123:debug:main glib2 2.24.2_0 exists in the ports tree
124:debug:main glib2 2.24.2_0  is the latest installed
125:debug:main glib2 2.24.2_0  is active
126:debug:main Merging existing variants '' into variants
127:debug:main new fully merged portvariants:
128:debug:main Changing to port directory: /opt/local/var/macports/sources/rsync.macports.org/release/ports/devel/glib2
129:debug:main OS darwin/10.4.0 (Mac OS X 10.6) arch i386
130:debug:main org.macports.load registered provides 'load', a pre-existing procedure. Target override will not be provided
131:debug:main org.macports.unload registered provides 'unload', a pre-existing procedure. Target override will not be provided
132:debug:main org.macports.distfiles registered provides 'distfiles', a pre-existing procedure. Target override will not be provided
133:debug:main Using group file /opt/local/var/macports/sources/rsync.macports.org/release/ports/_resources/port1.0/group/archcheck-1.0.tcl
134:debug:main adding the default universal variant
135:debug:main Reading variant descriptions from /opt/local/var/macports/sources/rsync.macports.org/release/ports/_resources/port1.0/variant_descriptions.conf
136:debug:main No need to upgrade! glib2 2.24.2_0 >= glib2 2.24.2_0
137:debug:main epoch: in tree: 0 installed: 0
138:debug:main gettext 0.18.1.1_2 exists in the ports tree
139:debug:main gettext 0.18.1.1_2  is the latest installed
140:debug:main gettext 0.18.1.1_2  is active
141:debug:main Merging existing variants '' into variants
142:debug:main new fully merged portvariants:
143:debug:main Changing to port directory: /opt/local/var/macports/sources/rsync.macports.org/release/ports/devel/gettext
144:debug:main OS darwin/10.4.0 (Mac OS X 10.6) arch i386
145:debug:main org.macports.load registered provides 'load', a pre-existing procedure. Target override will not be provided
146:debug:main org.macports.unload registered provides 'unload', a pre-existing procedure. Target override will not be provided
147:debug:main org.macports.distfiles registered provides 'distfiles', a pre-existing procedure. Target override will not be provided
148:debug:main Using group file /opt/local/var/macports/sources/rsync.macports.org/release/ports/_resources/port1.0/group/muniversal-1.0.tcl
149:debug:main Reading variant descriptions from /opt/local/var/macports/sources/rsync.macports.org/release/ports/_resources/port1.0/variant_descriptions.conf
150:debug:main Using group file /opt/local/var/macports/sources/rsync.macports.org/release/ports/_resources/port1.0/group/archcheck-1.0.tcl
151:debug:main universal variant already exists, so not adding the default one
152:debug:main No need to upgrade! gettext 0.18.1.1_2 >= gettext 0.18.1.1_2
153:debug:main epoch: in tree: 0 installed: 0
154:debug:main libiconv 1.13.1_0 exists in the ports tree
155:debug:main libiconv 1.13.1_0  is the latest installed
156:debug:main libiconv 1.13.1_0  is active
157:debug:main Merging existing variants '' into variants
158:debug:main new fully merged portvariants:
159:debug:main Changing to port directory: /opt/local/var/macports/sources/rsync.macports.org/release/ports/textproc/libiconv
160:debug:main OS darwin/10.4.0 (Mac OS X 10.6) arch i386
161:debug:main org.macports.load registered provides 'load', a pre-existing procedure. Target override will not be provided
162:debug:main org.macports.unload registered provides 'unload', a pre-existing procedure. Target override will not be provided
163:debug:main org.macports.distfiles registered provides 'distfiles', a pre-existing procedure. Target override will not be provided
164:debug:main Using group file /opt/local/var/macports/sources/rsync.macports.org/release/ports/_resources/port1.0/group/muniversal-1.0.tcl
165:debug:main Reading variant descriptions from /opt/local/var/macports/sources/rsync.macports.org/release/ports/_resources/port1.0/variant_descriptions.conf
166:debug:main universal variant already exists, so not adding the default one
167:debug:main No need to upgrade! libiconv 1.13.1_0 >= libiconv 1.13.1_0
168:debug:main epoch: in tree: 0 installed: 0
169:debug:main ncurses 5.7_0 exists in the ports tree
170:debug:main ncurses 5.7_0  is the latest installed
171:debug:main ncurses 5.7_0  is active
172:debug:main Merging existing variants '' into variants
173:debug:main new fully merged portvariants:
174:debug:main Changing to port directory: /opt/local/var/macports/sources/rsync.macports.org/release/ports/devel/ncurses
175:debug:main OS darwin/10.4.0 (Mac OS X 10.6) arch i386
176:debug:main org.macports.load registered provides 'load', a pre-existing procedure. Target override will not be provided
177:debug:main org.macports.unload registered provides 'unload', a pre-existing procedure. Target override will not be provided
178:debug:main org.macports.distfiles registered provides 'distfiles', a pre-existing procedure. Target override will not be provided
179:debug:main Using group file /opt/local/var/macports/sources/rsync.macports.org/release/ports/_resources/port1.0/group/muniversal-1.0.tcl
180:debug:main Reading variant descriptions from /opt/local/var/macports/sources/rsync.macports.org/release/ports/_resources/port1.0/variant_descriptions.conf
181:debug:main universal variant already exists, so not adding the default one
182:debug:main No need to upgrade! ncurses 5.7_0 >= ncurses 5.7_0
183:debug:main epoch: in tree: 0 installed: 0
184:debug:main ncursesw 5.7_0 exists in the ports tree
185:debug:main ncursesw 5.7_0  is the latest installed
186:debug:main ncursesw 5.7_0  is active
187:debug:main Merging existing variants '' into variants
188:debug:main new fully merged portvariants:
189:debug:main Changing to port directory: /opt/local/var/macports/sources/rsync.macports.org/release/ports/devel/ncursesw
190:debug:main OS darwin/10.4.0 (Mac OS X 10.6) arch i386
191:debug:main org.macports.load registered provides 'load', a pre-existing procedure. Target override will not be provided
192:debug:main org.macports.unload registered provides 'unload', a pre-existing procedure. Target override will not be provided
193:debug:main org.macports.distfiles registered provides 'distfiles', a pre-existing procedure. Target override will not be provided
194:debug:main Using group file /opt/local/var/macports/sources/rsync.macports.org/release/ports/_resources/port1.0/group/muniversal-1.0.tcl
195:debug:main Reading variant descriptions from /opt/local/var/macports/sources/rsync.macports.org/release/ports/_resources/port1.0/variant_descriptions.conf
196:debug:main universal variant already exists, so not adding the default one
197:debug:main No need to upgrade! ncursesw 5.7_0 >= ncursesw 5.7_0
198:debug:main epoch: in tree: 0 installed: 0
199:debug:main expat 2.0.1_0 exists in the ports tree
200:debug:main expat 2.0.1_0  is the latest installed
201:debug:main expat 2.0.1_0  is active
202:debug:main Merging existing variants '' into variants
203:debug:main new fully merged portvariants:
204:debug:main Changing to port directory: /opt/local/var/macports/sources/rsync.macports.org/release/ports/textproc/expat
205:debug:main OS darwin/10.4.0 (Mac OS X 10.6) arch i386
206:debug:main org.macports.load registered provides 'load', a pre-existing procedure. Target override will not be provided
207:debug:main org.macports.unload registered provides 'unload', a pre-existing procedure. Target override will not be provided
208:debug:main org.macports.distfiles registered provides 'distfiles', a pre-existing procedure. Target override will not be provided
209:debug:main adding the default universal variant
210:debug:main Reading variant descriptions from /opt/local/var/macports/sources/rsync.macports.org/release/ports/_resources/port1.0/variant_descriptions.conf
211:debug:main No need to upgrade! expat 2.0.1_0 >= expat 2.0.1_0
212:debug:main epoch: in tree: 0 installed: 0
213:debug:main perl5 5.8.9_0 exists in the ports tree
214:debug:main perl5 5.8.9_0  is the latest installed
215:debug:main perl5 5.8.9_0  is active
216:debug:main Merging existing variants '' into variants
217:debug:main new fully merged portvariants:
218:debug:main Changing to port directory: /opt/local/var/macports/sources/rsync.macports.org/release/ports/lang/perl5
219:debug:main OS darwin/10.4.0 (Mac OS X 10.6) arch i386
220:debug:main org.macports.load registered provides 'load', a pre-existing procedure. Target override will not be provided
221:debug:main org.macports.unload registered provides 'unload', a pre-existing procedure. Target override will not be provided
222:debug:main org.macports.distfiles registered provides 'distfiles', a pre-existing procedure. Target override will not be provided
223:debug:main universal_variant is false, so not adding the default universal variant
224:debug:main No need to upgrade! perl5 5.8.9_0 >= perl5 5.8.9_0
225:debug:main epoch: in tree: 0 installed: 0
226:debug:main perl5.8 5.8.9_3 exists in the ports tree
227:debug:main perl5.8 5.8.9_3  is the latest installed
228:debug:main perl5.8 5.8.9_3  is active
229:debug:main Merging existing variants '' into variants
230:debug:main new fully merged portvariants:
231:debug:main Changing to port directory: /opt/local/var/macports/sources/rsync.macports.org/release/ports/lang/perl5.8
232:debug:main OS darwin/10.4.0 (Mac OS X 10.6) arch i386
233:debug:main org.macports.load registered provides 'load', a pre-existing procedure. Target override will not be provided
234:debug:main org.macports.unload registered provides 'unload', a pre-existing procedure. Target override will not be provided
235:debug:main org.macports.distfiles registered provides 'distfiles', a pre-existing procedure. Target override will not be provided
236:debug:main adding the default universal variant
237:debug:main Reading variant descriptions from /opt/local/var/macports/sources/rsync.macports.org/release/ports/_resources/port1.0/variant_descriptions.conf
238:debug:main No need to upgrade! perl5.8 5.8.9_3 >= perl5.8 5.8.9_3
239:debug:main epoch: in tree: 0 installed: 0
240:debug:main python_select 0.3_0 exists in the ports tree
241:debug:main python_select 0.3_0  is the latest installed
242:debug:main python_select 0.3_0  is active
243:debug:main Merging existing variants '' into variants
244:debug:main new fully merged portvariants:
245:debug:main Changing to port directory: /opt/local/var/macports/sources/rsync.macports.org/release/ports/sysutils/python_select
246:debug:main OS darwin/10.4.0 (Mac OS X 10.6) arch i386
247:debug:main org.macports.load registered provides 'load', a pre-existing procedure. Target override will not be provided
248:debug:main org.macports.unload registered provides 'unload', a pre-existing procedure. Target override will not be provided
249:debug:main org.macports.distfiles registered provides 'distfiles', a pre-existing procedure. Target override will not be provided
250:debug:main Using group file /opt/local/var/macports/sources/rsync.macports.org/release/ports/_resources/port1.0/group/select-1.0.tcl
251:debug:main only one arch supported, so not adding the default universal variant
252:debug:main No need to upgrade! python_select 0.3_0 >= python_select 0.3_0
253:debug:main epoch: in tree: 1 installed: 1
254:debug:main pango 1.24.5_0 exists in the ports tree
255:debug:main pango 1.24.5_0  is the latest installed
256:debug:main pango 1.24.5_0  is active
257:debug:main Merging existing variants '' into variants
258:debug:main new fully merged portvariants:
259:debug:main Changing to port directory: /opt/local/var/macports/sources/rsync.macports.org/release/ports/x11/pango
260:debug:main OS darwin/10.4.0 (Mac OS X 10.6) arch i386
261:debug:main org.macports.load registered provides 'load', a pre-existing procedure. Target override will not be provided
262:debug:main org.macports.unload registered provides 'unload', a pre-existing procedure. Target override will not be provided
263:debug:main org.macports.distfiles registered provides 'distfiles', a pre-existing procedure. Target override will not be provided
264:debug:main Using group file /opt/local/var/macports/sources/rsync.macports.org/release/ports/_resources/port1.0/group/muniversal-1.0.tcl
265:debug:main Reading variant descriptions from /opt/local/var/macports/sources/rsync.macports.org/release/ports/_resources/port1.0/variant_descriptions.conf
266:debug:main Using group file /opt/local/var/macports/sources/rsync.macports.org/release/ports/_resources/port1.0/group/archcheck-1.0.tcl
267:debug:main universal variant already exists, so not adding the default one
268:debug:main No need to upgrade! pango 1.24.5_0 >= pango 1.24.5_0
269:debug:main epoch: in tree: 0 installed: 0
270:debug:main Xft2 2.1.14_0 exists in the ports tree
271:debug:main Xft2 2.1.14_0  is the latest installed
272:debug:main Xft2 2.1.14_0  is active
273:debug:main Merging existing variants '' into variants
274:debug:main new fully merged portvariants:
275:debug:main Changing to port directory: /opt/local/var/macports/sources/rsync.macports.org/release/ports/x11/Xft2
276:debug:main OS darwin/10.4.0 (Mac OS X 10.6) arch i386
277:debug:main org.macports.load registered provides 'load', a pre-existing procedure. Target override will not be provided
278:debug:main org.macports.unload registered provides 'unload', a pre-existing procedure. Target override will not be provided
279:debug:main org.macports.distfiles registered provides 'distfiles', a pre-existing procedure. Target override will not be provided
280:debug:main adding the default universal variant
281:debug:main Reading variant descriptions from /opt/local/var/macports/sources/rsync.macports.org/release/ports/_resources/port1.0/variant_descriptions.conf
282:debug:main No need to upgrade! Xft2 2.1.14_0 >= Xft2 2.1.14_0
283:debug:main epoch: in tree: 0 installed: 0
284:debug:main xrender 0.9.6_0 exists in the ports tree
285:debug:main xrender 0.9.6_0  is the latest installed
286:debug:main xrender 0.9.6_0  is active
287:debug:main Merging existing variants '' into variants
288:debug:main new fully merged portvariants:
289:debug:main Changing to port directory: /opt/local/var/macports/sources/rsync.macports.org/release/ports/x11/xrender
290:debug:main OS darwin/10.4.0 (Mac OS X 10.6) arch i386
291:debug:main org.macports.load registered provides 'load', a pre-existing procedure. Target override will not be provided
292:debug:main org.macports.unload registered provides 'unload', a pre-existing procedure. Target override will not be provided
293:debug:main org.macports.distfiles registered provides 'distfiles', a pre-existing procedure. Target override will not be provided
294:debug:main adding the default universal variant
295:debug:main Reading variant descriptions from /opt/local/var/macports/sources/rsync.macports.org/release/ports/_resources/port1.0/variant_descriptions.conf
296:debug:main No need to upgrade! xrender 0.9.6_0 >= xrender 0.9.6_0
297:debug:main epoch: in tree: 0 installed: 0
298:debug:main xorg-libX11 1.3.4_0 exists in the ports tree
299:debug:main xorg-libX11 1.3.4_0  is the latest installed
300:debug:main xorg-libX11 1.3.4_0  is active
301:debug:main Merging existing variants '' into variants
302:debug:main new fully merged portvariants:
303:debug:main Changing to port directory: /opt/local/var/macports/sources/rsync.macports.org/release/ports/x11/xorg-libX11
304:debug:main OS darwin/10.4.0 (Mac OS X 10.6) arch i386
305:debug:main org.macports.load registered provides 'load', a pre-existing procedure. Target override will not be provided
306:debug:main org.macports.unload registered provides 'unload', a pre-existing procedure. Target override will not be provided
307:debug:main org.macports.distfiles registered provides 'distfiles', a pre-existing procedure. Target override will not be provided
308:debug:main Using group file /opt/local/var/macports/sources/rsync.macports.org/release/ports/_resources/port1.0/group/archcheck-1.0.tcl
309:debug:main adding the default universal variant
310:debug:main Reading variant descriptions from /opt/local/var/macports/sources/rsync.macports.org/release/ports/_resources/port1.0/variant_descriptions.conf
311:debug:main No need to upgrade! xorg-libX11 1.3.4_0 >= xorg-libX11 1.3.4_0
312:debug:main epoch: in tree: 0 installed: 0
313:debug:main xorg-libXdmcp 1.0.3_0 exists in the ports tree
314:debug:main xorg-libXdmcp 1.0.3_0  is the latest installed
315:debug:main xorg-libXdmcp 1.0.3_0  is active
316:debug:main Merging existing variants '' into variants
317:debug:main new fully merged portvariants:
318:debug:main Changing to port directory: /opt/local/var/macports/sources/rsync.macports.org/release/ports/x11/xorg-libXdmcp
319:debug:main OS darwin/10.4.0 (Mac OS X 10.6) arch i386
320:debug:main org.macports.load registered provides 'load', a pre-existing procedure. Target override will not be provided
321:debug:main org.macports.unload registered provides 'unload', a pre-existing procedure. Target override will not be provided
322:debug:main org.macports.distfiles registered provides 'distfiles', a pre-existing procedure. Target override will not be provided
323:debug:main adding the default universal variant
324:debug:main Reading variant descriptions from /opt/local/var/macports/sources/rsync.macports.org/release/ports/_resources/port1.0/variant_descriptions.conf
325:debug:main No need to upgrade! xorg-libXdmcp 1.0.3_0 >= xorg-libXdmcp 1.0.3_0
326:debug:main epoch: in tree: 0 installed: 0
327:debug:main xorg-libXau 1.0.6_0 exists in the ports tree
328:debug:main xorg-libXau 1.0.6_0  is the latest installed
329:debug:main xorg-libXau 1.0.6_0  is active
330:debug:main Merging existing variants '' into variants
331:debug:main new fully merged portvariants:
332:debug:main Changing to port directory: /opt/local/var/macports/sources/rsync.macports.org/release/ports/x11/xorg-libXau
333:debug:main OS darwin/10.4.0 (Mac OS X 10.6) arch i386
334:debug:main org.macports.load registered provides 'load', a pre-existing procedure. Target override will not be provided
335:debug:main org.macports.unload registered provides 'unload', a pre-existing procedure. Target override will not be provided
336:debug:main org.macports.distfiles registered provides 'distfiles', a pre-existing procedure. Target override will not be provided
337:debug:main adding the default universal variant
338:debug:main Reading variant descriptions from /opt/local/var/macports/sources/rsync.macports.org/release/ports/_resources/port1.0/variant_descriptions.conf
339:debug:main No need to upgrade! xorg-libXau 1.0.6_0 >= xorg-libXau 1.0.6_0
340:debug:main epoch: in tree: 0 installed: 0
341:debug:main xorg-xproto 7.0.17_0 exists in the ports tree
342:debug:main xorg-xproto 7.0.17_0  is the latest installed
343:debug:main xorg-xproto 7.0.17_0  is active
344:debug:main Merging existing variants '' into variants
345:debug:main new fully merged portvariants:
346:debug:main Changing to port directory: /opt/local/var/macports/sources/rsync.macports.org/release/ports/x11/xorg-xproto
347:debug:main OS darwin/10.4.0 (Mac OS X 10.6) arch i386
348:debug:main org.macports.load registered provides 'load', a pre-existing procedure. Target override will not be provided
349:debug:main org.macports.unload registered provides 'unload', a pre-existing procedure. Target override will not be provided
350:debug:main org.macports.distfiles registered provides 'distfiles', a pre-existing procedure. Target override will not be provided
351:debug:main only one arch supported, so not adding the default universal variant
352:debug:main No need to upgrade! xorg-xproto 7.0.17_0 >= xorg-xproto 7.0.17_0
353:debug:main epoch: in tree: 0 installed: 0
354:debug:main xorg-kbproto 1.0.4_0 exists in the ports tree
355:debug:main xorg-kbproto 1.0.4_0  is the latest installed
356:debug:main xorg-kbproto 1.0.4_0  is active
357:debug:main Merging existing variants '' into variants
358:debug:main new fully merged portvariants:
359:debug:main Changing to port directory: /opt/local/var/macports/sources/rsync.macports.org/release/ports/x11/xorg-kbproto
360:debug:main OS darwin/10.4.0 (Mac OS X 10.6) arch i386
361:debug:main org.macports.load registered provides 'load', a pre-existing procedure. Target override will not be provided
362:debug:main org.macports.unload registered provides 'unload', a pre-existing procedure. Target override will not be provided
363:debug:main org.macports.distfiles registered provides 'distfiles', a pre-existing procedure. Target override will not be provided
364:debug:main only one arch supported, so not adding the default universal variant
365:debug:main No need to upgrade! xorg-kbproto 1.0.4_0 >= xorg-kbproto 1.0.4_0
366:debug:main epoch: in tree: 0 installed: 0
367:debug:main xorg-renderproto 0.11_0 exists in the ports tree
368:debug:main xorg-renderproto 0.11_0  is the latest installed
369:debug:main xorg-renderproto 0.11_0  is active
370:debug:main Merging existing variants '' into variants
371:debug:main new fully merged portvariants:
372:debug:main Changing to port directory: /opt/local/var/macports/sources/rsync.macports.org/release/ports/x11/xorg-renderproto
373:debug:main OS darwin/10.4.0 (Mac OS X 10.6) arch i386
374:debug:main org.macports.load registered provides 'load', a pre-existing procedure. Target override will not be provided
375:debug:main org.macports.unload registered provides 'unload', a pre-existing procedure. Target override will not be provided
376:debug:main org.macports.distfiles registered provides 'distfiles', a pre-existing procedure. Target override will not be provided
377:debug:main only one arch supported, so not adding the default universal variant
378:debug:main No need to upgrade! xorg-renderproto 0.11_0 >= xorg-renderproto 0.11_0
379:debug:main epoch: in tree: 0 installed: 0
380:debug:main freetype 2.4.2_0 exists in the ports tree
381:debug:main freetype 2.4.2_0  is the latest installed
382:debug:main freetype 2.4.2_0  is active
383:debug:main Merging existing variants '' into variants
384:debug:main new fully merged portvariants:
385:debug:main Changing to port directory: /opt/local/var/macports/sources/rsync.macports.org/release/ports/print/freetype
386:debug:main OS darwin/10.4.0 (Mac OS X 10.6) arch i386
387:debug:main org.macports.load registered provides 'load', a pre-existing procedure. Target override will not be provided
388:debug:main org.macports.unload registered provides 'unload', a pre-existing procedure. Target override will not be provided
389:debug:main org.macports.distfiles registered provides 'distfiles', a pre-existing procedure. Target override will not be provided
390:debug:main Using group file /opt/local/var/macports/sources/rsync.macports.org/release/ports/_resources/port1.0/group/muniversal-1.0.tcl
391:debug:main Reading variant descriptions from /opt/local/var/macports/sources/rsync.macports.org/release/ports/_resources/port1.0/variant_descriptions.conf
392:debug:main Using group file /opt/local/var/macports/sources/rsync.macports.org/release/ports/_resources/port1.0/group/archcheck-1.0.tcl
393:debug:main universal variant already exists, so not adding the default one
394:debug:main No need to upgrade! freetype 2.4.2_0 >= freetype 2.4.2_0
395:debug:main epoch: in tree: 0 installed: 0
396:debug:main fontconfig 2.8.0_0 exists in the ports tree
397:debug:main fontconfig 2.8.0_0  is the latest installed
398:debug:main fontconfig 2.8.0_0  is active
399:debug:main Merging existing variants '' into variants
400:debug:main new fully merged portvariants:
401:debug:main Changing to port directory: /opt/local/var/macports/sources/rsync.macports.org/release/ports/graphics/fontconfig
402:debug:main OS darwin/10.4.0 (Mac OS X 10.6) arch i386
403:debug:main org.macports.load registered provides 'load', a pre-existing procedure. Target override will not be provided
404:debug:main org.macports.unload registered provides 'unload', a pre-existing procedure. Target override will not be provided
405:debug:main org.macports.distfiles registered provides 'distfiles', a pre-existing procedure. Target override will not be provided
406:debug:main Using group file /opt/local/var/macports/sources/rsync.macports.org/release/ports/_resources/port1.0/group/muniversal-1.0.tcl
407:debug:main Reading variant descriptions from /opt/local/var/macports/sources/rsync.macports.org/release/ports/_resources/port1.0/variant_descriptions.conf
408:debug:main Using group file /opt/local/var/macports/sources/rsync.macports.org/release/ports/_resources/port1.0/group/archcheck-1.0.tcl
409:debug:main universal variant already exists, so not adding the default one
410:debug:main No need to upgrade! fontconfig 2.8.0_0 >= fontconfig 2.8.0_0
411:debug:main epoch: in tree: 0 installed: 0
412:debug:main cairo 1.8.10_0 exists in the ports tree
413:debug:main cairo 1.8.10_0  is the latest installed
414:debug:main cairo 1.8.10_0  is active
415:debug:main Merging existing variants '' into variants
416:debug:main new fully merged portvariants:
417:debug:main Changing to port directory: /opt/local/var/macports/sources/rsync.macports.org/release/ports/graphics/cairo
418:debug:main OS darwin/10.4.0 (Mac OS X 10.6) arch i386
419:debug:main org.macports.load registered provides 'load', a pre-existing procedure. Target override will not be provided
420:debug:main org.macports.unload registered provides 'unload', a pre-existing procedure. Target override will not be provided
421:debug:main org.macports.distfiles registered provides 'distfiles', a pre-existing procedure. Target override will not be provided
422:debug:main Using group file /opt/local/var/macports/sources/rsync.macports.org/release/ports/_resources/port1.0/group/muniversal-1.0.tcl
423:debug:main Reading variant descriptions from /opt/local/var/macports/sources/rsync.macports.org/release/ports/_resources/port1.0/variant_descriptions.conf
424:debug:main Using group file /opt/local/var/macports/sources/rsync.macports.org/release/ports/_resources/port1.0/group/archcheck-1.0.tcl
425:debug:main Using group file /opt/local/var/macports/sources/rsync.macports.org/release/ports/_resources/port1.0/group/xcodeversion-1.0.tcl
426:debug:main universal variant already exists, so not adding the default one
427:debug:main No need to upgrade! cairo 1.8.10_0 >= cairo 1.8.10_0
428:debug:main epoch: in tree: 0 installed: 0
429:debug:main libpixman 0.18.2_0 exists in the ports tree
430:debug:main libpixman 0.18.2_0  is the latest installed
431:debug:main libpixman 0.18.2_0  is active
432:debug:main Merging existing variants '' into variants
433:debug:main new fully merged portvariants:
434:debug:main Changing to port directory: /opt/local/var/macports/sources/rsync.macports.org/release/ports/graphics/libpixman
435:debug:main OS darwin/10.4.0 (Mac OS X 10.6) arch i386
436:debug:main org.macports.load registered provides 'load', a pre-existing procedure. Target override will not be provided
437:debug:main org.macports.unload registered provides 'unload', a pre-existing procedure. Target override will not be provided
438:debug:main org.macports.distfiles registered provides 'distfiles', a pre-existing procedure. Target override will not be provided
439:debug:main Using group file /opt/local/var/macports/sources/rsync.macports.org/release/ports/_resources/port1.0/group/muniversal-1.0.tcl
440:debug:main Reading variant descriptions from /opt/local/var/macports/sources/rsync.macports.org/release/ports/_resources/port1.0/variant_descriptions.conf
441:debug:main universal variant already exists, so not adding the default one
442:debug:main No need to upgrade! libpixman 0.18.2_0 >= libpixman 0.18.2_0
443:debug:main epoch: in tree: 0 installed: 0
444:debug:main libpng 1.2.44_0 exists in the ports tree
445:debug:main libpng 1.2.44_0  is the latest installed
446:debug:main libpng 1.2.44_0  is active
447:debug:main Merging existing variants '' into variants
448:debug:main new fully merged portvariants:
449:debug:main Changing to port directory: /opt/local/var/macports/sources/rsync.macports.org/release/ports/graphics/libpng
450:debug:main OS darwin/10.4.0 (Mac OS X 10.6) arch i386
451:debug:main org.macports.load registered provides 'load', a pre-existing procedure. Target override will not be provided
452:debug:main org.macports.unload registered provides 'unload', a pre-existing procedure. Target override will not be provided
453:debug:main org.macports.distfiles registered provides 'distfiles', a pre-existing procedure. Target override will not be provided
454:debug:main Using group file /opt/local/var/macports/sources/rsync.macports.org/release/ports/_resources/port1.0/group/muniversal-1.0.tcl
455:debug:main Reading variant descriptions from /opt/local/var/macports/sources/rsync.macports.org/release/ports/_resources/port1.0/variant_descriptions.conf
456:debug:main Using group file /opt/local/var/macports/sources/rsync.macports.org/release/ports/_resources/port1.0/group/archcheck-1.0.tcl
457:debug:main universal variant already exists, so not adding the default one
458:debug:main No need to upgrade! libpng 1.2.44_0 >= libpng 1.2.44_0
459:debug:main epoch: in tree: 0 installed: 0
460:debug:main xorg-libXi 1.3.2_0 exists in the ports tree
461:debug:main xorg-libXi 1.3.2_0  is the latest installed
462:debug:main xorg-libXi 1.3.2_0  is active
463:debug:main Merging existing variants '' into variants
464:debug:main new fully merged portvariants:
465:debug:main Changing to port directory: /opt/local/var/macports/sources/rsync.macports.org/release/ports/x11/xorg-libXi
466:debug:main OS darwin/10.4.0 (Mac OS X 10.6) arch i386
467:debug:main org.macports.load registered provides 'load', a pre-existing procedure. Target override will not be provided
468:debug:main org.macports.unload registered provides 'unload', a pre-existing procedure. Target override will not be provided
469:debug:main org.macports.distfiles registered provides 'distfiles', a pre-existing procedure. Target override will not be provided
470:debug:main adding the default universal variant
471:debug:main Reading variant descriptions from /opt/local/var/macports/sources/rsync.macports.org/release/ports/_resources/port1.0/variant_descriptions.conf
472:debug:main No need to upgrade! xorg-libXi 1.3.2_0 >= xorg-libXi 1.3.2_0
473:debug:main epoch: in tree: 0 installed: 0
474:debug:main xorg-libXext 1.1.2_0 exists in the ports tree
475:debug:main xorg-libXext 1.1.2_0  is the latest installed
476:debug:main xorg-libXext 1.1.2_0  is active
477:debug:main Merging existing variants '' into variants
478:debug:main new fully merged portvariants:
479:debug:main Changing to port directory: /opt/local/var/macports/sources/rsync.macports.org/release/ports/x11/xorg-libXext
480:debug:main OS darwin/10.4.0 (Mac OS X 10.6) arch i386
481:debug:main org.macports.load registered provides 'load', a pre-existing procedure. Target override will not be provided
482:debug:main org.macports.unload registered provides 'unload', a pre-existing procedure. Target override will not be provided
483:debug:main org.macports.distfiles registered provides 'distfiles', a pre-existing procedure. Target override will not be provided
484:debug:main adding the default universal variant
485:debug:main Reading variant descriptions from /opt/local/var/macports/sources/rsync.macports.org/release/ports/_resources/port1.0/variant_descriptions.conf
486:debug:main No need to upgrade! xorg-libXext 1.1.2_0 >= xorg-libXext 1.1.2_0
487:debug:main epoch: in tree: 0 installed: 0
488:debug:main xorg-xextproto 7.1.1_0 exists in the ports tree
489:debug:main xorg-xextproto 7.1.1_0  is the latest installed
490:debug:main xorg-xextproto 7.1.1_0  is active
491:debug:main Merging existing variants '' into variants
492:debug:main new fully merged portvariants:
493:debug:main Changing to port directory: /opt/local/var/macports/sources/rsync.macports.org/release/ports/x11/xorg-xextproto
494:debug:main OS darwin/10.4.0 (Mac OS X 10.6) arch i386
495:debug:main org.macports.load registered provides 'load', a pre-existing procedure. Target override will not be provided
496:debug:main org.macports.unload registered provides 'unload', a pre-existing procedure. Target override will not be provided
497:debug:main org.macports.distfiles registered provides 'distfiles', a pre-existing procedure. Target override will not be provided
498:debug:main only one arch supported, so not adding the default universal variant
499:debug:main No need to upgrade! xorg-xextproto 7.1.1_0 >= xorg-xextproto 7.1.1_0
500:debug:main epoch: in tree: 0 installed: 0
501:debug:main xorg-inputproto 2.0_0 exists in the ports tree
502:debug:main xorg-inputproto 2.0_0  is the latest installed
503:debug:main xorg-inputproto 2.0_0  is active
504:debug:main Merging existing variants '' into variants
505:debug:main new fully merged portvariants:
506:debug:main Changing to port directory: /opt/local/var/macports/sources/rsync.macports.org/release/ports/x11/xorg-inputproto
507:debug:main OS darwin/10.4.0 (Mac OS X 10.6) arch i386
508:debug:main org.macports.load registered provides 'load', a pre-existing procedure. Target override will not be provided
509:debug:main org.macports.unload registered provides 'unload', a pre-existing procedure. Target override will not be provided
510:debug:main org.macports.distfiles registered provides 'distfiles', a pre-existing procedure. Target override will not be provided
511:debug:main only one arch supported, so not adding the default universal variant
512:debug:main No need to upgrade! xorg-inputproto 2.0_0 >= xorg-inputproto 2.0_0
513:debug:main epoch: in tree: 0 installed: 0
514:debug:main xorg-libXrandr 1.3.0_1 exists in the ports tree
515:debug:main xorg-libXrandr 1.3.0_1  is the latest installed
516:debug:main xorg-libXrandr 1.3.0_1  is active
517:debug:main Merging existing variants '' into variants
518:debug:main new fully merged portvariants:
519:debug:main Changing to port directory: /opt/local/var/macports/sources/rsync.macports.org/release/ports/x11/xorg-libXrandr
520:debug:main OS darwin/10.4.0 (Mac OS X 10.6) arch i386
521:debug:main org.macports.load registered provides 'load', a pre-existing procedure. Target override will not be provided
522:debug:main org.macports.unload registered provides 'unload', a pre-existing procedure. Target override will not be provided
523:debug:main org.macports.distfiles registered provides 'distfiles', a pre-existing procedure. Target override will not be provided
524:debug:main adding the default universal variant
525:debug:main Reading variant descriptions from /opt/local/var/macports/sources/rsync.macports.org/release/ports/_resources/port1.0/variant_descriptions.conf
526:debug:main No need to upgrade! xorg-libXrandr 1.3.0_1 >= xorg-libXrandr 1.3.0_1
527:debug:main epoch: in tree: 0 installed: 0
528:debug:main xorg-randrproto 1.3.1_0 exists in the ports tree
529:debug:main xorg-randrproto 1.3.1_0  is the latest installed
530:debug:main xorg-randrproto 1.3.1_0  is active
531:debug:main Merging existing variants '' into variants
532:debug:main new fully merged portvariants:
533:debug:main Changing to port directory: /opt/local/var/macports/sources/rsync.macports.org/release/ports/x11/xorg-randrproto
534:debug:main OS darwin/10.4.0 (Mac OS X 10.6) arch i386
535:debug:main org.macports.load registered provides 'load', a pre-existing procedure. Target override will not be provided
536:debug:main org.macports.unload registered provides 'unload', a pre-existing procedure. Target override will not be provided
537:debug:main org.macports.distfiles registered provides 'distfiles', a pre-existing procedure. Target override will not be provided
538:debug:main only one arch supported, so not adding the default universal variant
539:debug:main No need to upgrade! xorg-randrproto 1.3.1_0 >= xorg-randrproto 1.3.1_0
540:debug:main epoch: in tree: 0 installed: 0
541:debug:main xorg-libXcursor 1.1.10_0 exists in the ports tree
542:debug:main xorg-libXcursor 1.1.10_0  is the latest installed
543:debug:main xorg-libXcursor 1.1.10_0  is active
544:debug:main Merging existing variants '' into variants
545:debug:main new fully merged portvariants:
546:debug:main Changing to port directory: /opt/local/var/macports/sources/rsync.macports.org/release/ports/x11/xorg-libXcursor
547:debug:main OS darwin/10.4.0 (Mac OS X 10.6) arch i386
548:debug:main org.macports.load registered provides 'load', a pre-existing procedure. Target override will not be provided
549:debug:main org.macports.unload registered provides 'unload', a pre-existing procedure. Target override will not be provided
550:debug:main org.macports.distfiles registered provides 'distfiles', a pre-existing procedure. Target override will not be provided
551:debug:main adding the default universal variant
552:debug:main Reading variant descriptions from /opt/local/var/macports/sources/rsync.macports.org/release/ports/_resources/port1.0/variant_descriptions.conf
553:debug:main No need to upgrade! xorg-libXcursor 1.1.10_0 >= xorg-libXcursor 1.1.10_0
554:debug:main epoch: in tree: 0 installed: 0
555:debug:main xorg-libXfixes 4.0.5_0 exists in the ports tree
556:debug:main xorg-libXfixes 4.0.5_0  is the latest installed
557:debug:main xorg-libXfixes 4.0.5_0  is active
558:debug:main Merging existing variants '' into variants
559:debug:main new fully merged portvariants:
560:debug:main Changing to port directory: /opt/local/var/macports/sources/rsync.macports.org/release/ports/x11/xorg-libXfixes
561:debug:main OS darwin/10.4.0 (Mac OS X 10.6) arch i386
562:debug:main org.macports.load registered provides 'load', a pre-existing procedure. Target override will not be provided
563:debug:main org.macports.unload registered provides 'unload', a pre-existing procedure. Target override will not be provided
564:debug:main org.macports.distfiles registered provides 'distfiles', a pre-existing procedure. Target override will not be provided
565:debug:main adding the default universal variant
566:debug:main Reading variant descriptions from /opt/local/var/macports/sources/rsync.macports.org/release/ports/_resources/port1.0/variant_descriptions.conf
567:debug:main No need to upgrade! xorg-libXfixes 4.0.5_0 >= xorg-libXfixes 4.0.5_0
568:debug:main epoch: in tree: 0 installed: 0
569:debug:main xorg-fixesproto 4.1.1_0 exists in the ports tree
570:debug:main xorg-fixesproto 4.1.1_0  is the latest installed
571:debug:main xorg-fixesproto 4.1.1_0  is active
572:debug:main Merging existing variants '' into variants
573:debug:main new fully merged portvariants:
574:debug:main Changing to port directory: /opt/local/var/macports/sources/rsync.macports.org/release/ports/x11/xorg-fixesproto
575:debug:main OS darwin/10.4.0 (Mac OS X 10.6) arch i386
576:debug:main org.macports.load registered provides 'load', a pre-existing procedure. Target override will not be provided
577:debug:main org.macports.unload registered provides 'unload', a pre-existing procedure. Target override will not be provided
578:debug:main org.macports.distfiles registered provides 'distfiles', a pre-existing procedure. Target override will not be provided
579:debug:main only one arch supported, so not adding the default universal variant
580:debug:main No need to upgrade! xorg-fixesproto 4.1.1_0 >= xorg-fixesproto 4.1.1_0
581:debug:main epoch: in tree: 0 installed: 0
582:debug:main xorg-libXinerama 1.1_0 exists in the ports tree
583:debug:main xorg-libXinerama 1.1_0  is the latest installed
584:debug:main xorg-libXinerama 1.1_0  is active
585:debug:main Merging existing variants '' into variants
586:debug:main new fully merged portvariants:
587:debug:main Changing to port directory: /opt/local/var/macports/sources/rsync.macports.org/release/ports/x11/xorg-libXinerama
588:debug:main OS darwin/10.4.0 (Mac OS X 10.6) arch i386
589:debug:main org.macports.load registered provides 'load', a pre-existing procedure. Target override will not be provided
590:debug:main org.macports.unload registered provides 'unload', a pre-existing procedure. Target override will not be provided
591:debug:main org.macports.distfiles registered provides 'distfiles', a pre-existing procedure. Target override will not be provided
592:debug:main adding the default universal variant
593:debug:main Reading variant descriptions from /opt/local/var/macports/sources/rsync.macports.org/release/ports/_resources/port1.0/variant_descriptions.conf
594:debug:main No need to upgrade! xorg-libXinerama 1.1_0 >= xorg-libXinerama 1.1_0
595:debug:main epoch: in tree: 0 installed: 0
596:debug:main xorg-xineramaproto 1.2_0 exists in the ports tree
597:debug:main xorg-xineramaproto 1.2_0  is the latest installed
598:debug:main xorg-xineramaproto 1.2_0  is active
599:debug:main Merging existing variants '' into variants
600:debug:main new fully merged portvariants:
601:debug:main Changing to port directory: /opt/local/var/macports/sources/rsync.macports.org/release/ports/x11/xorg-xineramaproto
602:debug:main OS darwin/10.4.0 (Mac OS X 10.6) arch i386
603:debug:main org.macports.load registered provides 'load', a pre-existing procedure. Target override will not be provided
604:debug:main org.macports.unload registered provides 'unload', a pre-existing procedure. Target override will not be provided
605:debug:main org.macports.distfiles registered provides 'distfiles', a pre-existing procedure. Target override will not be provided
606:debug:main only one arch supported, so not adding the default universal variant
607:debug:main No need to upgrade! xorg-xineramaproto 1.2_0 >= xorg-xineramaproto 1.2_0
608:debug:main epoch: in tree: 0 installed: 0
609:debug:main xorg-libXdamage 1.1.3_0 exists in the ports tree
610:debug:main xorg-libXdamage 1.1.3_0  is the latest installed
611:debug:main xorg-libXdamage 1.1.3_0  is active
612:debug:main Merging existing variants '' into variants
613:debug:main new fully merged portvariants:
614:debug:main Changing to port directory: /opt/local/var/macports/sources/rsync.macports.org/release/ports/x11/xorg-libXdamage
615:debug:main OS darwin/10.4.0 (Mac OS X 10.6) arch i386
616:debug:main org.macports.load registered provides 'load', a pre-existing procedure. Target override will not be provided
617:debug:main org.macports.unload registered provides 'unload', a pre-existing procedure. Target override will not be provided
618:debug:main org.macports.distfiles registered provides 'distfiles', a pre-existing procedure. Target override will not be provided
619:debug:main adding the default universal variant
620:debug:main Reading variant descriptions from /opt/local/var/macports/sources/rsync.macports.org/release/ports/_resources/port1.0/variant_descriptions.conf
621:debug:main No need to upgrade! xorg-libXdamage 1.1.3_0 >= xorg-libXdamage 1.1.3_0
622:debug:main epoch: in tree: 0 installed: 0
623:debug:main xorg-damageproto 1.2.0_0 exists in the ports tree
624:debug:main xorg-damageproto 1.2.0_0  is the latest installed
625:debug:main xorg-damageproto 1.2.0_0  is active
626:debug:main Merging existing variants '' into variants
627:debug:main new fully merged portvariants:
628:debug:main Changing to port directory: /opt/local/var/macports/sources/rsync.macports.org/release/ports/x11/xorg-damageproto
629:debug:main OS darwin/10.4.0 (Mac OS X 10.6) arch i386
630:debug:main org.macports.load registered provides 'load', a pre-existing procedure. Target override will not be provided
631:debug:main org.macports.unload registered provides 'unload', a pre-existing procedure. Target override will not be provided
632:debug:main org.macports.distfiles registered provides 'distfiles', a pre-existing procedure. Target override will not be provided
633:debug:main only one arch supported, so not adding the default universal variant
634:debug:main No need to upgrade! xorg-damageproto 1.2.0_0 >= xorg-damageproto 1.2.0_0
635:debug:main epoch: in tree: 0 installed: 0
636:debug:main xorg-libXcomposite 0.4.2_0 exists in the ports tree
637:debug:main xorg-libXcomposite 0.4.2_0  is the latest installed
638:debug:main xorg-libXcomposite 0.4.2_0  is active
639:debug:main Merging existing variants '' into variants
640:debug:main new fully merged portvariants:
641:debug:main Changing to port directory: /opt/local/var/macports/sources/rsync.macports.org/release/ports/x11/xorg-libXcomposite
642:debug:main OS darwin/10.4.0 (Mac OS X 10.6) arch i386
643:debug:main org.macports.load registered provides 'load', a pre-existing procedure. Target override will not be provided
644:debug:main org.macports.unload registered provides 'unload', a pre-existing procedure. Target override will not be provided
645:debug:main org.macports.distfiles registered provides 'distfiles', a pre-existing procedure. Target override will not be provided
646:debug:main adding the default universal variant
647:debug:main Reading variant descriptions from /opt/local/var/macports/sources/rsync.macports.org/release/ports/_resources/port1.0/variant_descriptions.conf
648:debug:main No need to upgrade! xorg-libXcomposite 0.4.2_0 >= xorg-libXcomposite 0.4.2_0
649:debug:main epoch: in tree: 0 installed: 0
650:debug:main xorg-compositeproto 0.4.1_0 exists in the ports tree
651:debug:main xorg-compositeproto 0.4.1_0  is the latest installed
652:debug:main xorg-compositeproto 0.4.1_0  is active
653:debug:main Merging existing variants '' into variants
654:debug:main new fully merged portvariants:
655:debug:main Changing to port directory: /opt/local/var/macports/sources/rsync.macports.org/release/ports/x11/xorg-compositeproto
656:debug:main OS darwin/10.4.0 (Mac OS X 10.6) arch i386
657:debug:main org.macports.load registered provides 'load', a pre-existing procedure. Target override will not be provided
658:debug:main org.macports.unload registered provides 'unload', a pre-existing procedure. Target override will not be provided
659:debug:main org.macports.distfiles registered provides 'distfiles', a pre-existing procedure. Target override will not be provided
660:debug:main only one arch supported, so not adding the default universal variant
661:debug:main No need to upgrade! xorg-compositeproto 0.4.1_0 >= xorg-compositeproto 0.4.1_0
662:debug:main epoch: in tree: 0 installed: 0
663:debug:main shared-mime-info 0.71_0 exists in the ports tree
664:debug:main shared-mime-info 0.71_0  is the latest installed
665:debug:main shared-mime-info 0.71_0  is active
666:debug:main Merging existing variants '' into variants
667:debug:main new fully merged portvariants:
668:debug:main Changing to port directory: /opt/local/var/macports/sources/rsync.macports.org/release/ports/devel/shared-mime-info
669:debug:main OS darwin/10.4.0 (Mac OS X 10.6) arch i386
670:debug:main org.macports.load registered provides 'load', a pre-existing procedure. Target override will not be provided
671:debug:main org.macports.unload registered provides 'unload', a pre-existing procedure. Target override will not be provided
672:debug:main org.macports.distfiles registered provides 'distfiles', a pre-existing procedure. Target override will not be provided
673:debug:main adding the default universal variant
674:debug:main Reading variant descriptions from /opt/local/var/macports/sources/rsync.macports.org/release/ports/_resources/port1.0/variant_descriptions.conf
675:debug:main No need to upgrade! shared-mime-info 0.71_0 >= shared-mime-info 0.71_0
676:debug:main epoch: in tree: 0 installed: 0
677:debug:main libxml2 2.7.7_0 exists in the ports tree
678:debug:main libxml2 2.7.7_0  is the latest installed
679:debug:main libxml2 2.7.7_0  is active
680:debug:main Merging existing variants '' into variants
681:debug:main new fully merged portvariants:
682:debug:main Changing to port directory: /opt/local/var/macports/sources/rsync.macports.org/release/ports/textproc/libxml2
683:debug:main OS darwin/10.4.0 (Mac OS X 10.6) arch i386
684:debug:main org.macports.load registered provides 'load', a pre-existing procedure. Target override will not be provided
685:debug:main org.macports.unload registered provides 'unload', a pre-existing procedure. Target override will not be provided
686:debug:main org.macports.distfiles registered provides 'distfiles', a pre-existing procedure. Target override will not be provided
687:debug:main Using group file /opt/local/var/macports/sources/rsync.macports.org/release/ports/_resources/port1.0/group/archcheck-1.0.tcl
688:debug:main adding the default universal variant
689:debug:main Reading variant descriptions from /opt/local/var/macports/sources/rsync.macports.org/release/ports/_resources/port1.0/variant_descriptions.conf
690:debug:main No need to upgrade! libxml2 2.7.7_0 >= libxml2 2.7.7_0
691:debug:main epoch: in tree: 0 installed: 0
692:debug:main boost 1.43.0_0 exists in the ports tree
693:debug:main boost 1.43.0_0  is the latest installed
694:debug:main boost 1.43.0_0  is active
695:debug:main Merging existing variants '' into variants
696:debug:main new fully merged portvariants:
697:debug:main Changing to port directory: /opt/local/var/macports/sources/rsync.macports.org/release/ports/devel/boost
698:debug:main OS darwin/10.4.0 (Mac OS X 10.6) arch i386
699:debug:main org.macports.load registered provides 'load', a pre-existing procedure. Target override will not be provided
700:debug:main org.macports.unload registered provides 'unload', a pre-existing procedure. Target override will not be provided
701:debug:main org.macports.distfiles registered provides 'distfiles', a pre-existing procedure. Target override will not be provided
702:debug:main Reading variant descriptions from /opt/local/var/macports/sources/rsync.macports.org/release/ports/_resources/port1.0/variant_descriptions.conf
703:debug:main universal variant already exists, so not adding the default one
704:debug:main No need to upgrade! boost 1.43.0_0 >= boost 1.43.0_0
705:debug:main epoch: in tree: 0 installed: 0
706:debug:main bzip2 1.0.5_3 exists in the ports tree
707:debug:main bzip2 1.0.5_3  is the latest installed
708:debug:main bzip2 1.0.5_3  is active
709:debug:main Merging existing variants '' into variants
710:debug:main new fully merged portvariants:
711:debug:main Changing to port directory: /opt/local/var/macports/sources/rsync.macports.org/release/ports/archivers/bzip2
712:debug:main OS darwin/10.4.0 (Mac OS X 10.6) arch i386
713:debug:main org.macports.load registered provides 'load', a pre-existing procedure. Target override will not be provided
714:debug:main org.macports.unload registered provides 'unload', a pre-existing procedure. Target override will not be provided
715:debug:main org.macports.distfiles registered provides 'distfiles', a pre-existing procedure. Target override will not be provided
716:debug:main Reading variant descriptions from /opt/local/var/macports/sources/rsync.macports.org/release/ports/_resources/port1.0/variant_descriptions.conf
717:debug:main universal variant already exists, so not adding the default one
718:debug:main No need to upgrade! bzip2 1.0.5_3 >= bzip2 1.0.5_3
719:debug:main epoch: in tree: 0 installed: 0
720:debug:main gsl 1.14_0 exists in the ports tree
721:debug:main gsl 1.14_0  is the latest installed
722:debug:main gsl 1.14_0  is active
723:debug:main Merging existing variants '' into variants
724:debug:main new fully merged portvariants:
725:debug:main Changing to port directory: /opt/local/var/macports/sources/rsync.macports.org/release/ports/math/gsl
726:debug:main OS darwin/10.4.0 (Mac OS X 10.6) arch i386
727:debug:main org.macports.load registered provides 'load', a pre-existing procedure. Target override will not be provided
728:debug:main org.macports.unload registered provides 'unload', a pre-existing procedure. Target override will not be provided
729:debug:main org.macports.distfiles registered provides 'distfiles', a pre-existing procedure. Target override will not be provided
730:debug:main adding the default universal variant
731:debug:main Reading variant descriptions from /opt/local/var/macports/sources/rsync.macports.org/release/ports/_resources/port1.0/variant_descriptions.conf
732:debug:main No need to upgrade! gsl 1.14_0 >= gsl 1.14_0
733:debug:main epoch: in tree: 0 installed: 0
734:debug:main python26 2.6.5_3 exists in the ports tree
735:debug:main python26 2.6.5_3  is the latest installed
736:debug:main python26 2.6.5_3  is active
737:debug:main Merging existing variants '' into variants
738:debug:main new fully merged portvariants:
739:debug:main Changing to port directory: /opt/local/var/macports/sources/rsync.macports.org/release/ports/lang/python26
740:debug:main OS darwin/10.4.0 (Mac OS X 10.6) arch i386
741:debug:main org.macports.load registered provides 'load', a pre-existing procedure. Target override will not be provided
742:debug:main org.macports.unload registered provides 'unload', a pre-existing procedure. Target override will not be provided
743:debug:main org.macports.distfiles registered provides 'distfiles', a pre-existing procedure. Target override will not be provided
744:debug:main Using group file /opt/local/var/macports/sources/rsync.macports.org/release/ports/_resources/port1.0/group/select-1.0.tcl
745:debug:main Reading variant descriptions from /opt/local/var/macports/sources/rsync.macports.org/release/ports/_resources/port1.0/variant_descriptions.conf
746:debug:main universal variant already exists, so not adding the default one
747:debug:main No need to upgrade! python26 2.6.5_3 >= python26 2.6.5_3
748:debug:main epoch: in tree: 1 installed: 1
749:debug:main openssl 1.0.0a_0 exists in the ports tree
750:debug:main openssl 1.0.0a_0  is the latest installed
751:debug:main openssl 1.0.0a_0  is active
752:debug:main Merging existing variants '' into variants
753:debug:main new fully merged portvariants:
754:debug:main Changing to port directory: /opt/local/var/macports/sources/rsync.macports.org/release/ports/devel/openssl
755:debug:main OS darwin/10.4.0 (Mac OS X 10.6) arch i386
756:debug:main org.macports.load registered provides 'load', a pre-existing procedure. Target override will not be provided
757:debug:main org.macports.unload registered provides 'unload', a pre-existing procedure. Target override will not be provided
758:debug:main org.macports.distfiles registered provides 'distfiles', a pre-existing procedure. Target override will not be provided
759:debug:main Using group file /opt/local/var/macports/sources/rsync.macports.org/release/ports/_resources/port1.0/group/muniversal-1.0.tcl
760:debug:main Reading variant descriptions from /opt/local/var/macports/sources/rsync.macports.org/release/ports/_resources/port1.0/variant_descriptions.conf
761:debug:main universal variant already exists, so not adding the default one
762:debug:main No need to upgrade! openssl 1.0.0a_0 >= openssl 1.0.0a_0
763:debug:main epoch: in tree: 0 installed: 0
764:debug:main tk 8.5.8_0 exists in the ports tree
765:debug:main tk 8.5.8_0  is the latest installed
766:debug:main tk 8.5.8_0  is active
767:debug:main Merging existing variants '' into variants
768:debug:main new fully merged portvariants:
769:debug:main Changing to port directory: /opt/local/var/macports/sources/rsync.macports.org/release/ports/x11/tk
770:debug:main OS darwin/10.4.0 (Mac OS X 10.6) arch i386
771:debug:main org.macports.load registered provides 'load', a pre-existing procedure. Target override will not be provided
772:debug:main org.macports.unload registered provides 'unload', a pre-existing procedure. Target override will not be provided
773:debug:main org.macports.distfiles registered provides 'distfiles', a pre-existing procedure. Target override will not be provided
774:debug:main Reading variant descriptions from /opt/local/var/macports/sources/rsync.macports.org/release/ports/_resources/port1.0/variant_descriptions.conf
775:debug:main adding the default universal variant
776:debug:main No need to upgrade! tk 8.5.8_0 >= tk 8.5.8_0
777:debug:main epoch: in tree: 0 installed: 0
778:debug:main tcl 8.5.8_0 exists in the ports tree
779:debug:main tcl 8.5.8_0  is the latest installed
780:debug:main tcl 8.5.8_0  is active
781:debug:main Merging existing variants '' into variants
782:debug:main new fully merged portvariants:
783:debug:main Changing to port directory: /opt/local/var/macports/sources/rsync.macports.org/release/ports/lang/tcl
784:debug:main OS darwin/10.4.0 (Mac OS X 10.6) arch i386
785:debug:main org.macports.load registered provides 'load', a pre-existing procedure. Target override will not be provided
786:debug:main org.macports.unload registered provides 'unload', a pre-existing procedure. Target override will not be provided
787:debug:main org.macports.distfiles registered provides 'distfiles', a pre-existing procedure. Target override will not be provided
788:debug:main adding the default universal variant
789:debug:main Reading variant descriptions from /opt/local/var/macports/sources/rsync.macports.org/release/ports/_resources/port1.0/variant_descriptions.conf
790:debug:main No need to upgrade! tcl 8.5.8_0 >= tcl 8.5.8_0
791:debug:main epoch: in tree: 0 installed: 0
792:debug:main xorg-libXScrnSaver 1.2.0_0 exists in the ports tree
793:debug:main xorg-libXScrnSaver 1.2.0_0  is the latest installed
794:debug:main xorg-libXScrnSaver 1.2.0_0  is active
795:debug:main Merging existing variants '' into variants
796:debug:main new fully merged portvariants:
797:debug:main Changing to port directory: /opt/local/var/macports/sources/rsync.macports.org/release/ports/x11/xorg-libXScrnSaver
798:debug:main OS darwin/10.4.0 (Mac OS X 10.6) arch i386
799:debug:main org.macports.load registered provides 'load', a pre-existing procedure. Target override will not be provided
800:debug:main org.macports.unload registered provides 'unload', a pre-existing procedure. Target override will not be provided
801:debug:main org.macports.distfiles registered provides 'distfiles', a pre-existing procedure. Target override will not be provided
802:debug:main adding the default universal variant
803:debug:main Reading variant descriptions from /opt/local/var/macports/sources/rsync.macports.org/release/ports/_resources/port1.0/variant_descriptions.conf
804:debug:main No need to upgrade! xorg-libXScrnSaver 1.2.0_0 >= xorg-libXScrnSaver 1.2.0_0
805:debug:main epoch: in tree: 0 installed: 0
806:debug:main xorg-scrnsaverproto 1.2.0_0 exists in the ports tree
807:debug:main xorg-scrnsaverproto 1.2.0_0  is the latest installed
808:debug:main xorg-scrnsaverproto 1.2.0_0  is active
809:debug:main Merging existing variants '' into variants
810:debug:main new fully merged portvariants:
811:debug:main Changing to port directory: /opt/local/var/macports/sources/rsync.macports.org/release/ports/x11/xorg-scrnsaverproto
812:debug:main OS darwin/10.4.0 (Mac OS X 10.6) arch i386
813:debug:main org.macports.load registered provides 'load', a pre-existing procedure. Target override will not be provided
814:debug:main org.macports.unload registered provides 'unload', a pre-existing procedure. Target override will not be provided
815:debug:main org.macports.distfiles registered provides 'distfiles', a pre-existing procedure. Target override will not be provided
816:debug:main only one arch supported, so not adding the default universal variant
817:debug:main No need to upgrade! xorg-scrnsaverproto 1.2.0_0 >= xorg-scrnsaverproto 1.2.0_0
818:debug:main epoch: in tree: 0 installed: 0
819:debug:main sqlite3 3.6.23.1_0 exists in the ports tree
820:debug:main sqlite3 3.6.23.1_0  is the latest installed
821:debug:main sqlite3 3.6.23.1_0  is active
822:debug:main Merging existing variants '' into variants
823:debug:main new fully merged portvariants:
824:debug:main Changing to port directory: /opt/local/var/macports/sources/rsync.macports.org/release/ports/databases/sqlite3
825:debug:main OS darwin/10.4.0 (Mac OS X 10.6) arch i386
826:debug:main org.macports.load registered provides 'load', a pre-existing procedure. Target override will not be provided
827:debug:main org.macports.unload registered provides 'unload', a pre-existing procedure. Target override will not be provided
828:debug:main org.macports.distfiles registered provides 'distfiles', a pre-existing procedure. Target override will not be provided
829:debug:main adding the default universal variant
830:debug:main Reading variant descriptions from /opt/local/var/macports/sources/rsync.macports.org/release/ports/_resources/port1.0/variant_descriptions.conf
831:debug:main No need to upgrade! sqlite3 3.6.23.1_0 >= sqlite3 3.6.23.1_0
832:debug:main epoch: in tree: 0 installed: 0
833:debug:main readline 6.1.000_1 exists in the ports tree
834:debug:main readline 6.1.000_1  is the latest installed
835:debug:main readline 6.1.000_1  is active
836:debug:main Merging existing variants '' into variants
837:debug:main new fully merged portvariants:
838:debug:main Changing to port directory: /opt/local/var/macports/sources/rsync.macports.org/release/ports/devel/readline
839:debug:main OS darwin/10.4.0 (Mac OS X 10.6) arch i386
840:debug:main org.macports.load registered provides 'load', a pre-existing procedure. Target override will not be provided
841:debug:main org.macports.unload registered provides 'unload', a pre-existing procedure. Target override will not be provided
842:debug:main org.macports.distfiles registered provides 'distfiles', a pre-existing procedure. Target override will not be provided
843:debug:main Using group file /opt/local/var/macports/sources/rsync.macports.org/release/ports/_resources/port1.0/group/muniversal-1.0.tcl
844:debug:main Reading variant descriptions from /opt/local/var/macports/sources/rsync.macports.org/release/ports/_resources/port1.0/variant_descriptions.conf
845:debug:main universal variant already exists, so not adding the default one
846:debug:main No need to upgrade! readline 6.1.000_1 >= readline 6.1.000_1
847:debug:main epoch: in tree: 0 installed: 0
848:debug:main db46 4.6.21_6 exists in the ports tree
849:debug:main db46 4.6.21_6  is the latest installed
850:debug:main db46 4.6.21_6  is active
851:debug:main Merging existing variants '' into variants
852:debug:main new fully merged portvariants:
853:debug:main Changing to port directory: /opt/local/var/macports/sources/rsync.macports.org/release/ports/databases/db46
854:debug:main OS darwin/10.4.0 (Mac OS X 10.6) arch i386
855:debug:main org.macports.load registered provides 'load', a pre-existing procedure. Target override will not be provided
856:debug:main org.macports.unload registered provides 'unload', a pre-existing procedure. Target override will not be provided
857:debug:main org.macports.distfiles registered provides 'distfiles', a pre-existing procedure. Target override will not be provided
858:debug:main Using group file /opt/local/var/macports/sources/rsync.macports.org/release/ports/_resources/port1.0/group/muniversal-1.0.tcl
859:debug:main Reading variant descriptions from /opt/local/var/macports/sources/rsync.macports.org/release/ports/_resources/port1.0/variant_descriptions.conf
860:debug:main universal variant already exists, so not adding the default one
861:debug:main No need to upgrade! db46 4.6.21_6 >= db46 4.6.21_6
862:debug:main epoch: in tree: 0 installed: 0
863:debug:main gdbm 1.8.3_2 exists in the ports tree
864:debug:main gdbm 1.8.3_2  is the latest installed
865:debug:main gdbm 1.8.3_2  is active
866:debug:main Merging existing variants '' into variants
867:debug:main new fully merged portvariants:
868:debug:main Changing to port directory: /opt/local/var/macports/sources/rsync.macports.org/release/ports/databases/gdbm
869:debug:main OS darwin/10.4.0 (Mac OS X 10.6) arch i386
870:debug:main org.macports.load registered provides 'load', a pre-existing procedure. Target override will not be provided
871:debug:main org.macports.unload registered provides 'unload', a pre-existing procedure. Target override will not be provided
872:debug:main org.macports.distfiles registered provides 'distfiles', a pre-existing procedure. Target override will not be provided
873:debug:main Using group file /opt/local/var/macports/sources/rsync.macports.org/release/ports/_resources/port1.0/group/muniversal-1.0.tcl
874:debug:main Reading variant descriptions from /opt/local/var/macports/sources/rsync.macports.org/release/ports/_resources/port1.0/variant_descriptions.conf
875:debug:main universal variant already exists, so not adding the default one
876:debug:main No need to upgrade! gdbm 1.8.3_2 >= gdbm 1.8.3_2
877:debug:main epoch: in tree: 0 installed: 0
878:debug:main swig-python 2.0.0_0 exists in the ports tree
879:debug:main swig-python 2.0.0_0  is the latest installed
880:debug:main swig-python 2.0.0_0  is active
881:debug:main Merging existing variants '' into variants
882:debug:main new fully merged portvariants:
883:debug:main Changing to port directory: /opt/local/var/macports/sources/rsync.macports.org/release/ports/devel/swig-python
884:debug:main OS darwin/10.4.0 (Mac OS X 10.6) arch i386
885:debug:main org.macports.load registered provides 'load', a pre-existing procedure. Target override will not be provided
886:debug:main org.macports.unload registered provides 'unload', a pre-existing procedure. Target override will not be provided
887:debug:main org.macports.distfiles registered provides 'distfiles', a pre-existing procedure. Target override will not be provided
888:debug:main Using group file /opt/local/var/macports/sources/rsync.macports.org/release/ports/_resources/port1.0/group/swigbinding-1.0.tcl
889:debug:main Re-registering default for distname
890:debug:main only one arch supported, so not adding the default universal variant
891:debug:main No need to upgrade! swig-python 2.0.0_0 >= swig-python 2.0.0_0
892:debug:main epoch: in tree: 0 installed: 0
893:debug:main swig 2.0.0_0 exists in the ports tree
894:debug:main swig 2.0.0_0  is the latest installed
895:debug:main swig 2.0.0_0  is active
896:debug:main Merging existing variants '' into variants
897:debug:main new fully merged portvariants:
898:debug:main Changing to port directory: /opt/local/var/macports/sources/rsync.macports.org/release/ports/devel/swig
899:debug:main OS darwin/10.4.0 (Mac OS X 10.6) arch i386
900:debug:main org.macports.load registered provides 'load', a pre-existing procedure. Target override will not be provided
901:debug:main org.macports.unload registered provides 'unload', a pre-existing procedure. Target override will not be provided
902:debug:main org.macports.distfiles registered provides 'distfiles', a pre-existing procedure. Target override will not be provided
903:debug:main adding the default universal variant
904:debug:main Reading variant descriptions from /opt/local/var/macports/sources/rsync.macports.org/release/ports/_resources/port1.0/variant_descriptions.conf
905:debug:main No need to upgrade! swig 2.0.0_0 >= swig 2.0.0_0
906:debug:main epoch: in tree: 0 installed: 0
907:debug:main swig-ruby 2.0.0_0 exists in the ports tree
908:debug:main swig-ruby 2.0.0_0  is the latest installed
909:debug:main swig-ruby 2.0.0_0  is active
910:debug:main Merging existing variants '' into variants
911:debug:main new fully merged portvariants:
912:debug:main Changing to port directory: /opt/local/var/macports/sources/rsync.macports.org/release/ports/devel/swig-ruby
913:debug:main OS darwin/10.4.0 (Mac OS X 10.6) arch i386
914:debug:main org.macports.load registered provides 'load', a pre-existing procedure. Target override will not be provided
915:debug:main org.macports.unload registered provides 'unload', a pre-existing procedure. Target override will not be provided
916:debug:main org.macports.distfiles registered provides 'distfiles', a pre-existing procedure. Target override will not be provided
917:debug:main Using group file /opt/local/var/macports/sources/rsync.macports.org/release/ports/_resources/port1.0/group/swigbinding-1.0.tcl
918:debug:main Re-registering default for distname
919:debug:main only one arch supported, so not adding the default universal variant
920:debug:main No need to upgrade! swig-ruby 2.0.0_0 >= swig-ruby 2.0.0_0
921:debug:main epoch: in tree: 0 installed: 0
922:debug:main ruby 1.8.7-p299_1 exists in the ports tree
923:debug:main ruby 1.8.7-p299_1 +thread_hooks is the latest installed
924:debug:main ruby 1.8.7-p299_1 +thread_hooks is active
925:debug:main Merging existing variants '+thread_hooks' into variants
926:debug:main new fully merged portvariants: thread_hooks +
927:debug:main Changing to port directory: /opt/local/var/macports/sources/rsync.macports.org/release/ports/lang/ruby
928:debug:main OS darwin/10.4.0 (Mac OS X 10.6) arch i386
929:debug:main org.macports.load registered provides 'load', a pre-existing procedure. Target override will not be provided
930:debug:main org.macports.unload registered provides 'unload', a pre-existing procedure. Target override will not be provided
931:debug:main org.macports.distfiles registered provides 'distfiles', a pre-existing procedure. Target override will not be provided
932:debug:main Using group file /opt/local/var/macports/sources/rsync.macports.org/release/ports/_resources/port1.0/group/muniversal-1.0.tcl
933:debug:main Reading variant descriptions from /opt/local/var/macports/sources/rsync.macports.org/release/ports/_resources/port1.0/variant_descriptions.conf
934:debug:main universal variant already exists, so not adding the default one
935:debug:main Executing variant thread_hooks provides thread_hooks
936:debug:main No need to upgrade! ruby 1.8.7-p299_1 >= ruby 1.8.7-p299_1
937:msg:main --->  Computing dependencies for playerstage-player:info:main .:debug:main Searching for dependency: libtool
938:debug:main Found Dependency: receipt exists for libtool
939:debug:main Searching for dependency: pkgconfig
940:debug:main Found Dependency: receipt exists for pkgconfig
941:debug:main Searching for dependency: gtk2
942:debug:main Found Dependency: receipt exists for gtk2
943:debug:main Searching for dependency: libpng
944:debug:main Found Dependency: receipt exists for libpng
945:debug:main Searching for dependency: glib2
946:debug:main Found Dependency: receipt exists for glib2
947:debug:main Searching for dependency: boost
948:debug:main Found Dependency: receipt exists for boost
949:debug:main Searching for dependency: gsl
950:debug:main Found Dependency: receipt exists for gsl
951:debug:main Searching for dependency: python26
952:debug:main Found Dependency: receipt exists for python26
953:debug:main Searching for dependency: swig-python
954:debug:main Found Dependency: receipt exists for swig-python
955:debug:main Searching for dependency: swig-ruby
956:debug:main Found Dependency: receipt exists for swig-ruby
957:msg:main
958:debug:main Executing org.macports.main (playerstage-player)
959:debug:main Skipping completed org.macports.fetch (playerstage-player)
960:debug:main Skipping completed org.macports.checksum (playerstage-player)
961:debug:main Skipping completed org.macports.extract (playerstage-player)
962:debug:main Skipping completed org.macports.patch (playerstage-player)
963:debug:main Skipping completed org.macports.configure (playerstage-player)
964:msg:main --->  Building playerstage-player
965:debug:build build phase started at Thu Aug 12 13:05:36 WEST 2010
966:debug:build Executing org.macports.build (playerstage-player)
967:debug:build Environment: CPATH='/opt/local/include' CC_PRINT_OPTIONS_FILE='/opt/local/var/macports/build/_opt_local_var_macports_sources_rsync.macports.org_release_ports_science_playerstage-player/work/.CC_PRINT_OPTIONS' LIBRARY_PATH='/opt/local/lib' CC_PRINT_OPTIONS='YES' MACOSX_DEPLOYMENT_TARGET='10.6'
968:debug:build Assembled command: 'cd "/opt/local/var/macports/build/_opt_local_var_macports_sources_rsync.macports.org_release_ports_science_playerstage-player/work/player-3.0.0" && /usr/bin/make -j2 all'
969:info:build /opt/local/bin/cmake -H/opt/local/var/macports/build/_opt_local_var_macports_sources_rsync.macports.org_release_ports_science_playerstage-player/work/player-3.0.0 -B/opt/local/var/macports/build/_opt_local_var_macports_sources_rsync.macports.org_release_ports_science_playerstage-player/work/player-3.0.0 --check-build-system CMakeFiles/Makefile.cmake 0
970:info:build /opt/local/bin/cmake -E cmake_progress_start /opt/local/var/macports/build/_opt_local_var_macports_sources_rsync.macports.org_release_ports_science_playerstage-player/work/player-3.0.0/CMakeFiles /opt/local/var/macports/build/_opt_local_var_macports_sources_rsync.macports.org_release_ports_science_playerstage-player/work/player-3.0.0/CMakeFiles/progress.marks
971:info:build /usr/bin/make -f CMakeFiles/Makefile2 all
972:info:build /usr/bin/make -f libplayercommon/CMakeFiles/playercommon.dir/build.make libplayercommon/CMakeFiles/playercommon.dir/depend
973:info:build /usr/bin/make -f libplayerinterface/CMakeFiles/functiontable_gen.dir/build.make libplayerinterface/CMakeFiles/functiontable_gen.dir/depend
974:info:build cd /opt/local/var/macports/build/_opt_local_var_macports_sources_rsync.macports.org_release_ports_science_playerstage-player/work/player-3.0.0 && /opt/local/bin/cmake -E cmake_depends "Unix Makefiles" /opt/local/var/macports/build/_opt_local_var_macports_sources_rsync.macports.org_release_ports_science_playerstage-player/work/player-3.0.0 /opt/local/var/macports/build/_opt_local_var_macports_sources_rsync.macports.org_release_ports_science_playerstage-player/work/player-3.0.0/libplayercommon /opt/local/var/macports/build/_opt_local_var_macports_sources_rsync.macports.org_release_ports_science_playerstage-player/work/player-3.0.0 /opt/local/var/macports/build/_opt_local_var_macports_sources_rsync.macports.org_release_ports_science_playerstage-player/work/player-3.0.0/libplayercommon /opt/local/var/macports/build/_opt_local_var_macports_sources_rsync.macports.org_release_ports_science_playerstage-player/work/player-3.0.0/libplayercommon/CMakeFiles/playercommon.dir/DependInfo.cmake --color=
975:info:build cd /opt/local/var/macports/build/_opt_local_var_macports_sources_rsync.macports.org_release_ports_science_playerstage-player/work/player-3.0.0 && /opt/local/bin/cmake -E cmake_depends "Unix Makefiles" /opt/local/var/macports/build/_opt_local_var_macports_sources_rsync.macports.org_release_ports_science_playerstage-player/work/player-3.0.0 /opt/local/var/macports/build/_opt_local_var_macports_sources_rsync.macports.org_release_ports_science_playerstage-player/work/player-3.0.0/libplayerinterface /opt/local/var/macports/build/_opt_local_var_macports_sources_rsync.macports.org_release_ports_science_playerstage-player/work/player-3.0.0 /opt/local/var/macports/build/_opt_local_var_macports_sources_rsync.macports.org_release_ports_science_playerstage-player/work/player-3.0.0/libplayerinterface /opt/local/var/macports/build/_opt_local_var_macports_sources_rsync.macports.org_release_ports_science_playerstage-player/work/player-3.0.0/libplayerinterface/CMakeFiles/functiontable_gen.dir/DependInfo.cmake --color=
976:info:build /usr/bin/make -f libplayerinterface/CMakeFiles/functiontable_gen.dir/build.make libplayerinterface/CMakeFiles/functiontable_gen.dir/build
977:info:build /usr/bin/make -f libplayercommon/CMakeFiles/playercommon.dir/build.make libplayercommon/CMakeFiles/playercommon.dir/build
978:info:build make[2]: Nothing to be done for `libplayercommon/CMakeFiles/playercommon.dir/build'.
979:info:build /opt/local/bin/cmake -E cmake_progress_report /opt/local/var/macports/build/_opt_local_var_macports_sources_rsync.macports.org_release_ports_science_playerstage-player/work/player-3.0.0/CMakeFiles
980:info:build /opt/local/bin/cmake -E cmake_progress_report /opt/local/var/macports/build/_opt_local_var_macports_sources_rsync.macports.org_release_ports_science_playerstage-player/work/player-3.0.0/CMakeFiles
981:info:build [  0%] [  0%] Built target playercommon
982:info:build /usr/bin/make -f libplayerinterface/CMakeFiles/interface_table.dir/build.make libplayerinterface/CMakeFiles/interface_table.dir/depend
983:info:build cd /opt/local/var/macports/build/_opt_local_var_macports_sources_rsync.macports.org_release_ports_science_playerstage-player/work/player-3.0.0 && /opt/local/bin/cmake -E cmake_depends "Unix Makefiles" /opt/local/var/macports/build/_opt_local_var_macports_sources_rsync.macports.org_release_ports_science_playerstage-player/work/player-3.0.0 /opt/local/var/macports/build/_opt_local_var_macports_sources_rsync.macports.org_release_ports_science_playerstage-player/work/player-3.0.0/libplayerinterface /opt/local/var/macports/build/_opt_local_var_macports_sources_rsync.macports.org_release_ports_science_playerstage-player/work/player-3.0.0 /opt/local/var/macports/build/_opt_local_var_macports_sources_rsync.macports.org_release_ports_science_playerstage-player/work/player-3.0.0/libplayerinterface /opt/local/var/macports/build/_opt_local_var_macports_sources_rsync.macports.org_release_ports_science_playerstage-player/work/player-3.0.0/libplayerinterface/CMakeFiles/interface_table.dir/DependInfo.cmake --color=
984:info:build Generating functiontable_gen.h
985:info:build /opt/local/bin/cmake -E cmake_progress_report /opt/local/var/macports/build/_opt_local_var_macports_sources_rsync.macports.org_release_ports_science_playerstage-player/work/player-3.0.0/CMakeFiles
986:info:build [  0%] /usr/bin/make -f libplayerinterface/CMakeFiles/interface_table.dir/build.make libplayerinterface/CMakeFiles/interface_table.dir/build
987:info:build Built target functiontable_gen
988:info:build /usr/bin/make -f libplayerinterface/CMakeFiles/player_interfaces.dir/build.make libplayerinterface/CMakeFiles/player_interfaces.dir/depend
989:info:build /opt/local/bin/cmake -E cmake_progress_report /opt/local/var/macports/build/_opt_local_var_macports_sources_rsync.macports.org_release_ports_science_playerstage-player/work/player-3.0.0/CMakeFiles
990:info:build cd /opt/local/var/macports/build/_opt_local_var_macports_sources_rsync.macports.org_release_ports_science_playerstage-player/work/player-3.0.0 && /opt/local/bin/cmake -E cmake_depends "Unix Makefiles" /opt/local/var/macports/build/_opt_local_var_macports_sources_rsync.macports.org_release_ports_science_playerstage-player/work/player-3.0.0 /opt/local/var/macports/build/_opt_local_var_macports_sources_rsync.macports.org_release_ports_science_playerstage-player/work/player-3.0.0/libplayerinterface /opt/local/var/macports/build/_opt_local_var_macports_sources_rsync.macports.org_release_ports_science_playerstage-player/work/player-3.0.0 /opt/local/var/macports/build/_opt_local_var_macports_sources_rsync.macports.org_release_ports_science_playerstage-player/work/player-3.0.0/libplayerinterface /opt/local/var/macports/build/_opt_local_var_macports_sources_rsync.macports.org_release_ports_science_playerstage-player/work/player-3.0.0/libplayerinterface/CMakeFiles/player_interfaces.dir/DependInfo.cmake --color=
991:info:build [  0%] /usr/bin/make -f libplayerinterface/CMakeFiles/player_interfaces.dir/build.make libplayerinterface/CMakeFiles/player_interfaces.dir/build
992:info:build Generating interface_table.h
993:info:build /opt/local/bin/cmake -E cmake_progress_report /opt/local/var/macports/build/_opt_local_var_macports_sources_rsync.macports.org_release_ports_science_playerstage-player/work/player-3.0.0/CMakeFiles
994:info:build /opt/local/bin/cmake -E cmake_progress_report /opt/local/var/macports/build/_opt_local_var_macports_sources_rsync.macports.org_release_ports_science_playerstage-player/work/player-3.0.0/CMakeFiles
995:info:build [  0%] [  0%] Built target interface_table
996:info:build /usr/bin/make -f libplayerinterface/CMakeFiles/playerinterface.dir/build.make libplayerinterface/CMakeFiles/playerinterface.dir/depend
997:info:build cd /opt/local/var/macports/build/_opt_local_var_macports_sources_rsync.macports.org_release_ports_science_playerstage-player/work/player-3.0.0 && /opt/local/bin/cmake -E cmake_depends "Unix Makefiles" /opt/local/var/macports/build/_opt_local_var_macports_sources_rsync.macports.org_release_ports_science_playerstage-player/work/player-3.0.0 /opt/local/var/macports/build/_opt_local_var_macports_sources_rsync.macports.org_release_ports_science_playerstage-player/work/player-3.0.0/libplayerinterface /opt/local/var/macports/build/_opt_local_var_macports_sources_rsync.macports.org_release_ports_science_playerstage-player/work/player-3.0.0 /opt/local/var/macports/build/_opt_local_var_macports_sources_rsync.macports.org_release_ports_science_playerstage-player/work/player-3.0.0/libplayerinterface /opt/local/var/macports/build/_opt_local_var_macports_sources_rsync.macports.org_release_ports_science_playerstage-player/work/player-3.0.0/libplayerinterface/CMakeFiles/playerinterface.dir/DependInfo.cmake --color=
998:info:build Generating player_interfaces.h
999:info:build /opt/local/bin/cmake -E cmake_progress_report /opt/local/var/macports/build/_opt_local_var_macports_sources_rsync.macports.org_release_ports_science_playerstage-player/work/player-3.0.0/CMakeFiles  10
1000:info:build [  1%] Built target player_interfaces
1001:info:build /usr/bin/make -f libplayerinterface/CMakeFiles/playerinterface.dir/build.make libplayerinterface/CMakeFiles/playerinterface.dir/build
1002:info:build /usr/bin/make -f libplayerinterface/CMakeFiles/playerxdr_src.dir/build.make libplayerinterface/CMakeFiles/playerxdr_src.dir/depend
1003:info:build cd /opt/local/var/macports/build/_opt_local_var_macports_sources_rsync.macports.org_release_ports_science_playerstage-player/work/player-3.0.0 && /opt/local/bin/cmake -E cmake_depends "Unix Makefiles" /opt/local/var/macports/build/_opt_local_var_macports_sources_rsync.macports.org_release_ports_science_playerstage-player/work/player-3.0.0 /opt/local/var/macports/build/_opt_local_var_macports_sources_rsync.macports.org_release_ports_science_playerstage-player/work/player-3.0.0/libplayerinterface /opt/local/var/macports/build/_opt_local_var_macports_sources_rsync.macports.org_release_ports_science_playerstage-player/work/player-3.0.0 /opt/local/var/macports/build/_opt_local_var_macports_sources_rsync.macports.org_release_ports_science_playerstage-player/work/player-3.0.0/libplayerinterface /opt/local/var/macports/build/_opt_local_var_macports_sources_rsync.macports.org_release_ports_science_playerstage-player/work/player-3.0.0/libplayerinterface/CMakeFiles/playerxdr_src.dir/DependInfo.cmake --color=
1004:info:build make[2]: Nothing to be done for `libplayerinterface/CMakeFiles/playerinterface.dir/build'.
1005:info:build /opt/local/bin/cmake -E cmake_progress_report /opt/local/var/macports/build/_opt_local_var_macports_sources_rsync.macports.org_release_ports_science_playerstage-player/work/player-3.0.0/CMakeFiles  81 82
1006:info:build [  3%] Built target playerinterface
1007:info:build /usr/bin/make -f libplayerwkb/CMakeFiles/playerwkb.dir/build.make libplayerwkb/CMakeFiles/playerwkb.dir/depend
1008:info:build cd /opt/local/var/macports/build/_opt_local_var_macports_sources_rsync.macports.org_release_ports_science_playerstage-player/work/player-3.0.0 && /opt/local/bin/cmake -E cmake_depends "Unix Makefiles" /opt/local/var/macports/build/_opt_local_var_macports_sources_rsync.macports.org_release_ports_science_playerstage-player/work/player-3.0.0 /opt/local/var/macports/build/_opt_local_var_macports_sources_rsync.macports.org_release_ports_science_playerstage-player/work/player-3.0.0/libplayerwkb /opt/local/var/macports/build/_opt_local_var_macports_sources_rsync.macports.org_release_ports_science_playerstage-player/work/player-3.0.0 /opt/local/var/macports/build/_opt_local_var_macports_sources_rsync.macports.org_release_ports_science_playerstage-player/work/player-3.0.0/libplayerwkb /opt/local/var/macports/build/_opt_local_var_macports_sources_rsync.macports.org_release_ports_science_playerstage-player/work/player-3.0.0/libplayerwkb/CMakeFiles/playerwkb.dir/DependInfo.cmake --color=
1009:info:build /usr/bin/make -f libplayerinterface/CMakeFiles/playerxdr_src.dir/build.make libplayerinterface/CMakeFiles/playerxdr_src.dir/build
1010:info:build /opt/local/bin/cmake -E cmake_progress_report /opt/local/var/macports/build/_opt_local_var_macports_sources_rsync.macports.org_release_ports_science_playerstage-player/work/player-3.0.0/CMakeFiles
1011:info:build [  3%] /usr/bin/make -f libplayerwkb/CMakeFiles/playerwkb.dir/build.make libplayerwkb/CMakeFiles/playerwkb.dir/build
1012:info:build make[2]: Nothing to be done for `libplayerwkb/CMakeFiles/playerwkb.dir/build'.
1013:info:build /opt/local/bin/cmake -E cmake_progress_report /opt/local/var/macports/build/_opt_local_var_macports_sources_rsync.macports.org_release_ports_science_playerstage-player/work/player-3.0.0/CMakeFiles
1014:info:build Generating playerxdr.?
1015:info:build /opt/local/bin/cmake -E cmake_progress_report /opt/local/var/macports/build/_opt_local_var_macports_sources_rsync.macports.org_release_ports_science_playerstage-player/work/player-3.0.0/CMakeFiles  92
1016:info:build [  3%] Built target playerwkb
1017:info:build /usr/bin/make -f libplayerjpeg/CMakeFiles/playerjpeg.dir/build.make libplayerjpeg/CMakeFiles/playerjpeg.dir/depend
1018:info:build [  4%] cd /opt/local/var/macports/build/_opt_local_var_macports_sources_rsync.macports.org_release_ports_science_playerstage-player/work/player-3.0.0 && /opt/local/bin/cmake -E cmake_depends "Unix Makefiles" /opt/local/var/macports/build/_opt_local_var_macports_sources_rsync.macports.org_release_ports_science_playerstage-player/work/player-3.0.0 /opt/local/var/macports/build/_opt_local_var_macports_sources_rsync.macports.org_release_ports_science_playerstage-player/work/player-3.0.0/libplayerjpeg /opt/local/var/macports/build/_opt_local_var_macports_sources_rsync.macports.org_release_ports_science_playerstage-player/work/player-3.0.0 /opt/local/var/macports/build/_opt_local_var_macports_sources_rsync.macports.org_release_ports_science_playerstage-player/work/player-3.0.0/libplayerjpeg /opt/local/var/macports/build/_opt_local_var_macports_sources_rsync.macports.org_release_ports_science_playerstage-player/work/player-3.0.0/libplayerjpeg/CMakeFiles/playerjpeg.dir/DependInfo.cmake --color=
1019:info:build Built target playerxdr_src
1020:info:build /usr/bin/make -f client_libs/libplayerc/bindings/python/CMakeFiles/playerc_wrap_i_target.dir/build.make client_libs/libplayerc/bindings/python/CMakeFiles/playerc_wrap_i_target.dir/depend
1021:info:build cd /opt/local/var/macports/build/_opt_local_var_macports_sources_rsync.macports.org_release_ports_science_playerstage-player/work/player-3.0.0 && /opt/local/bin/cmake -E cmake_depends "Unix Makefiles" /opt/local/var/macports/build/_opt_local_var_macports_sources_rsync.macports.org_release_ports_science_playerstage-player/work/player-3.0.0 /opt/local/var/macports/build/_opt_local_var_macports_sources_rsync.macports.org_release_ports_science_playerstage-player/work/player-3.0.0/client_libs/libplayerc/bindings/python /opt/local/var/macports/build/_opt_local_var_macports_sources_rsync.macports.org_release_ports_science_playerstage-player/work/player-3.0.0 /opt/local/var/macports/build/_opt_local_var_macports_sources_rsync.macports.org_release_ports_science_playerstage-player/work/player-3.0.0/client_libs/libplayerc/bindings/python /opt/local/var/macports/build/_opt_local_var_macports_sources_rsync.macports.org_release_ports_science_playerstage-player/work/player-3.0.0/client_libs/libplayerc/bindings/python/CMakeFiles/playerc_wrap_i_target.dir/DependInfo.cmake --color=
1022:info:build /usr/bin/make -f libplayerjpeg/CMakeFiles/playerjpeg.dir/build.make libplayerjpeg/CMakeFiles/playerjpeg.dir/build
1023:info:build /usr/bin/make -f client_libs/libplayerc/bindings/python/CMakeFiles/playerc_wrap_i_target.dir/build.make client_libs/libplayerc/bindings/python/CMakeFiles/playerc_wrap_i_target.dir/build
1024:info:build make[2]: Nothing to be done for `libplayerjpeg/CMakeFiles/playerjpeg.dir/build'.
1025:info:build /opt/local/bin/cmake -E cmake_progress_report /opt/local/var/macports/build/_opt_local_var_macports_sources_rsync.macports.org_release_ports_science_playerstage-player/work/player-3.0.0/CMakeFiles  83
1026:info:build make[2]: Nothing to be done for `client_libs/libplayerc/bindings/python/CMakeFiles/playerc_wrap_i_target.dir/build'.
1027:info:build /opt/local/bin/cmake -E cmake_progress_report /opt/local/var/macports/build/_opt_local_var_macports_sources_rsync.macports.org_release_ports_science_playerstage-player/work/player-3.0.0/CMakeFiles  34
1028:info:build [  5%] [  6%] Built target playerjpeg
1029:info:build /usr/bin/make -f client_libs/libplayerc/bindings/ruby/CMakeFiles/playerc_wrap_ri_target.dir/build.make client_libs/libplayerc/bindings/ruby/CMakeFiles/playerc_wrap_ri_target.dir/depend
1030:info:build cd /opt/local/var/macports/build/_opt_local_var_macports_sources_rsync.macports.org_release_ports_science_playerstage-player/work/player-3.0.0 && /opt/local/bin/cmake -E cmake_depends "Unix Makefiles" /opt/local/var/macports/build/_opt_local_var_macports_sources_rsync.macports.org_release_ports_science_playerstage-player/work/player-3.0.0 /opt/local/var/macports/build/_opt_local_var_macports_sources_rsync.macports.org_release_ports_science_playerstage-player/work/player-3.0.0/client_libs/libplayerc/bindings/ruby /opt/local/var/macports/build/_opt_local_var_macports_sources_rsync.macports.org_release_ports_science_playerstage-player/work/player-3.0.0 /opt/local/var/macports/build/_opt_local_var_macports_sources_rsync.macports.org_release_ports_science_playerstage-player/work/player-3.0.0/client_libs/libplayerc/bindings/ruby /opt/local/var/macports/build/_opt_local_var_macports_sources_rsync.macports.org_release_ports_science_playerstage-player/work/player-3.0.0/client_libs/libplayerc/bindings/ruby/CMakeFiles/playerc_wrap_ri_target.dir/DependInfo.cmake --color=
1031:info:build Built target playerc_wrap_i_target
1032:info:build /usr/bin/make -f replace/CMakeFiles/playerreplace.dir/build.make replace/CMakeFiles/playerreplace.dir/depend
1033:info:build cd /opt/local/var/macports/build/_opt_local_var_macports_sources_rsync.macports.org_release_ports_science_playerstage-player/work/player-3.0.0 && /opt/local/bin/cmake -E cmake_depends "Unix Makefiles" /opt/local/var/macports/build/_opt_local_var_macports_sources_rsync.macports.org_release_ports_science_playerstage-player/work/player-3.0.0 /opt/local/var/macports/build/_opt_local_var_macports_sources_rsync.macports.org_release_ports_science_playerstage-player/work/player-3.0.0/replace /opt/local/var/macports/build/_opt_local_var_macports_sources_rsync.macports.org_release_ports_science_playerstage-player/work/player-3.0.0 /opt/local/var/macports/build/_opt_local_var_macports_sources_rsync.macports.org_release_ports_science_playerstage-player/work/player-3.0.0/replace /opt/local/var/macports/build/_opt_local_var_macports_sources_rsync.macports.org_release_ports_science_playerstage-player/work/player-3.0.0/replace/CMakeFiles/playerreplace.dir/DependInfo.cmake --color=
1034:info:build /usr/bin/make -f client_libs/libplayerc/bindings/ruby/CMakeFiles/playerc_wrap_ri_target.dir/build.make client_libs/libplayerc/bindings/ruby/CMakeFiles/playerc_wrap_ri_target.dir/build
1035:info:build /usr/bin/make -f replace/CMakeFiles/playerreplace.dir/build.make replace/CMakeFiles/playerreplace.dir/build
1036:info:build make[2]: Nothing to be done for `client_libs/libplayerc/bindings/ruby/CMakeFiles/playerc_wrap_ri_target.dir/build'.
1037:info:build /opt/local/bin/cmake -E cmake_progress_report /opt/local/var/macports/build/_opt_local_var_macports_sources_rsync.macports.org_release_ports_science_playerstage-player/work/player-3.0.0/CMakeFiles
1038:info:build make[2]: Nothing to be done for `replace/CMakeFiles/playerreplace.dir/build'.
1039:info:build /opt/local/bin/cmake -E cmake_progress_report /opt/local/var/macports/build/_opt_local_var_macports_sources_rsync.macports.org_release_ports_science_playerstage-player/work/player-3.0.0/CMakeFiles  84
1040:info:build [  6%] [  7%] Built target playerc_wrap_ri_target
1041:info:build /usr/bin/make -f rtk2/CMakeFiles/rtk.dir/build.make rtk2/CMakeFiles/rtk.dir/depend
1042:info:build Built target playerreplace
1043:info:build /usr/bin/make -f server/drivers/planner/wavefront/CMakeFiles/wavefront_standalone.dir/build.make server/drivers/planner/wavefront/CMakeFiles/wavefront_standalone.dir/depend
1044:info:build cd /opt/local/var/macports/build/_opt_local_var_macports_sources_rsync.macports.org_release_ports_science_playerstage-player/work/player-3.0.0 && /opt/local/bin/cmake -E cmake_depends "Unix Makefiles" /opt/local/var/macports/build/_opt_local_var_macports_sources_rsync.macports.org_release_ports_science_playerstage-player/work/player-3.0.0 /opt/local/var/macports/build/_opt_local_var_macports_sources_rsync.macports.org_release_ports_science_playerstage-player/work/player-3.0.0/server/drivers/planner/wavefront /opt/local/var/macports/build/_opt_local_var_macports_sources_rsync.macports.org_release_ports_science_playerstage-player/work/player-3.0.0 /opt/local/var/macports/build/_opt_local_var_macports_sources_rsync.macports.org_release_ports_science_playerstage-player/work/player-3.0.0/server/drivers/planner/wavefront /opt/local/var/macports/build/_opt_local_var_macports_sources_rsync.macports.org_release_ports_science_playerstage-player/work/player-3.0.0/server/drivers/planner/wavefront/CMakeFiles/wavefront_standalone.dir/DependInfo.cmake --color=
1045:info:build cd /opt/local/var/macports/build/_opt_local_var_macports_sources_rsync.macports.org_release_ports_science_playerstage-player/work/player-3.0.0 && /opt/local/bin/cmake -E cmake_depends "Unix Makefiles" /opt/local/var/macports/build/_opt_local_var_macports_sources_rsync.macports.org_release_ports_science_playerstage-player/work/player-3.0.0 /opt/local/var/macports/build/_opt_local_var_macports_sources_rsync.macports.org_release_ports_science_playerstage-player/work/player-3.0.0/rtk2 /opt/local/var/macports/build/_opt_local_var_macports_sources_rsync.macports.org_release_ports_science_playerstage-player/work/player-3.0.0 /opt/local/var/macports/build/_opt_local_var_macports_sources_rsync.macports.org_release_ports_science_playerstage-player/work/player-3.0.0/rtk2 /opt/local/var/macports/build/_opt_local_var_macports_sources_rsync.macports.org_release_ports_science_playerstage-player/work/player-3.0.0/rtk2/CMakeFiles/rtk.dir/DependInfo.cmake --color=
1046:info:build /usr/bin/make -f server/drivers/planner/wavefront/CMakeFiles/wavefront_standalone.dir/build.make server/drivers/planner/wavefront/CMakeFiles/wavefront_standalone.dir/build
1047:info:build make[2]: Nothing to be done for `server/drivers/planner/wavefront/CMakeFiles/wavefront_standalone.dir/build'.
1048:info:build /opt/local/bin/cmake -E cmake_progress_report /opt/local/var/macports/build/_opt_local_var_macports_sources_rsync.macports.org_release_ports_science_playerstage-player/work/player-3.0.0/CMakeFiles  99 100
1049:info:build [  9%] Built target wavefront_standalone
1050:info:build /usr/bin/make -f utils/logsplitter/CMakeFiles/playerlogsplitter.dir/build.make utils/logsplitter/CMakeFiles/playerlogsplitter.dir/depend
1051:info:build cd /opt/local/var/macports/build/_opt_local_var_macports_sources_rsync.macports.org_release_ports_science_playerstage-player/work/player-3.0.0 && /opt/local/bin/cmake -E cmake_depends "Unix Makefiles" /opt/local/var/macports/build/_opt_local_var_macports_sources_rsync.macports.org_release_ports_science_playerstage-player/work/player-3.0.0 /opt/local/var/macports/build/_opt_local_var_macports_sources_rsync.macports.org_release_ports_science_playerstage-player/work/player-3.0.0/utils/logsplitter /opt/local/var/macports/build/_opt_local_var_macports_sources_rsync.macports.org_release_ports_science_playerstage-player/work/player-3.0.0 /opt/local/var/macports/build/_opt_local_var_macports_sources_rsync.macports.org_release_ports_science_playerstage-player/work/player-3.0.0/utils/logsplitter /opt/local/var/macports/build/_opt_local_var_macports_sources_rsync.macports.org_release_ports_science_playerstage-player/work/player-3.0.0/utils/logsplitter/CMakeFiles/playerlogsplitter.dir/DependInfo.cmake --color=
1052:info:build /usr/bin/make -f utils/logsplitter/CMakeFiles/playerlogsplitter.dir/build.make utils/logsplitter/CMakeFiles/playerlogsplitter.dir/build
1053:info:build make[2]: Nothing to be done for `utils/logsplitter/CMakeFiles/playerlogsplitter.dir/build'.
1054:info:build /opt/local/bin/cmake -E cmake_progress_report /opt/local/var/macports/build/_opt_local_var_macports_sources_rsync.macports.org_release_ports_science_playerstage-player/work/player-3.0.0/CMakeFiles
1055:info:build [  9%] Built target playerlogsplitter
1056:info:build /usr/bin/make -f utils/pmap/CMakeFiles/pmap.dir/build.make utils/pmap/CMakeFiles/pmap.dir/depend
1057:info:build cd /opt/local/var/macports/build/_opt_local_var_macports_sources_rsync.macports.org_release_ports_science_playerstage-player/work/player-3.0.0 && /opt/local/bin/cmake -E cmake_depends "Unix Makefiles" /opt/local/var/macports/build/_opt_local_var_macports_sources_rsync.macports.org_release_ports_science_playerstage-player/work/player-3.0.0 /opt/local/var/macports/build/_opt_local_var_macports_sources_rsync.macports.org_release_ports_science_playerstage-player/work/player-3.0.0/utils/pmap /opt/local/var/macports/build/_opt_local_var_macports_sources_rsync.macports.org_release_ports_science_playerstage-player/work/player-3.0.0 /opt/local/var/macports/build/_opt_local_var_macports_sources_rsync.macports.org_release_ports_science_playerstage-player/work/player-3.0.0/utils/pmap /opt/local/var/macports/build/_opt_local_var_macports_sources_rsync.macports.org_release_ports_science_playerstage-player/work/player-3.0.0/utils/pmap/CMakeFiles/pmap.dir/DependInfo.cmake --color=
1058:info:build /usr/bin/make -f utils/pmap/CMakeFiles/pmap.dir/build.make utils/pmap/CMakeFiles/pmap.dir/build
1059:info:build /usr/bin/make -f rtk2/CMakeFiles/rtk.dir/build.make rtk2/CMakeFiles/rtk.dir/build
1060:info:build make[2]: Nothing to be done for `utils/pmap/CMakeFiles/pmap.dir/build'.
1061:info:build /opt/local/bin/cmake -E cmake_progress_report /opt/local/var/macports/build/_opt_local_var_macports_sources_rsync.macports.org_release_ports_science_playerstage-player/work/player-3.0.0/CMakeFiles  93 94
1062:info:build [ 11%] Built target pmap
1063:info:build /usr/bin/make -f client_libs/libplayerc/CMakeFiles/playerc.dir/build.make client_libs/libplayerc/CMakeFiles/playerc.dir/depend
1064:info:build cd /opt/local/var/macports/build/_opt_local_var_macports_sources_rsync.macports.org_release_ports_science_playerstage-player/work/player-3.0.0 && /opt/local/bin/cmake -E cmake_depends "Unix Makefiles" /opt/local/var/macports/build/_opt_local_var_macports_sources_rsync.macports.org_release_ports_science_playerstage-player/work/player-3.0.0 /opt/local/var/macports/build/_opt_local_var_macports_sources_rsync.macports.org_release_ports_science_playerstage-player/work/player-3.0.0/client_libs/libplayerc /opt/local/var/macports/build/_opt_local_var_macports_sources_rsync.macports.org_release_ports_science_playerstage-player/work/player-3.0.0 /opt/local/var/macports/build/_opt_local_var_macports_sources_rsync.macports.org_release_ports_science_playerstage-player/work/player-3.0.0/client_libs/libplayerc /opt/local/var/macports/build/_opt_local_var_macports_sources_rsync.macports.org_release_ports_science_playerstage-player/work/player-3.0.0/client_libs/libplayerc/CMakeFiles/playerc.dir/DependInfo.cmake --color=
1065:info:build /usr/bin/make -f client_libs/libplayerc/CMakeFiles/playerc.dir/build.make client_libs/libplayerc/CMakeFiles/playerc.dir/build
1066:info:build make[2]: Nothing to be done for `rtk2/CMakeFiles/rtk.dir/build'.
1067:info:build /opt/local/bin/cmake -E cmake_progress_report /opt/local/var/macports/build/_opt_local_var_macports_sources_rsync.macports.org_release_ports_science_playerstage-player/work/player-3.0.0/CMakeFiles  96
1068:info:build make[2]: Nothing to be done for `client_libs/libplayerc/CMakeFiles/playerc.dir/build'.
1069:info:build [ 12%] /opt/local/bin/cmake -E cmake_progress_report /opt/local/var/macports/build/_opt_local_var_macports_sources_rsync.macports.org_release_ports_science_playerstage-player/work/player-3.0.0/CMakeFiles  11 12 13 14 15 16 17 18 19 20 21 22
1070:info:build Built target rtk
1071:info:build /usr/bin/make -f libplayercore/CMakeFiles/playercore.dir/build.make libplayercore/CMakeFiles/playercore.dir/depend
1072:info:build cd /opt/local/var/macports/build/_opt_local_var_macports_sources_rsync.macports.org_release_ports_science_playerstage-player/work/player-3.0.0 && /opt/local/bin/cmake -E cmake_depends "Unix Makefiles" /opt/local/var/macports/build/_opt_local_var_macports_sources_rsync.macports.org_release_ports_science_playerstage-player/work/player-3.0.0 /opt/local/var/macports/build/_opt_local_var_macports_sources_rsync.macports.org_release_ports_science_playerstage-player/work/player-3.0.0/libplayercore /opt/local/var/macports/build/_opt_local_var_macports_sources_rsync.macports.org_release_ports_science_playerstage-player/work/player-3.0.0 /opt/local/var/macports/build/_opt_local_var_macports_sources_rsync.macports.org_release_ports_science_playerstage-player/work/player-3.0.0/libplayercore /opt/local/var/macports/build/_opt_local_var_macports_sources_rsync.macports.org_release_ports_science_playerstage-player/work/player-3.0.0/libplayercore/CMakeFiles/playercore.dir/DependInfo.cmake --color=
1073:info:build [ 24%] Built target playerc
1074:info:build /usr/bin/make -f client_libs/libplayerc/bindings/python/CMakeFiles/_playerc.dir/build.make client_libs/libplayerc/bindings/python/CMakeFiles/_playerc.dir/depend
1075:info:build cd /opt/local/var/macports/build/_opt_local_var_macports_sources_rsync.macports.org_release_ports_science_playerstage-player/work/player-3.0.0 && /opt/local/bin/cmake -E cmake_depends "Unix Makefiles" /opt/local/var/macports/build/_opt_local_var_macports_sources_rsync.macports.org_release_ports_science_playerstage-player/work/player-3.0.0 /opt/local/var/macports/build/_opt_local_var_macports_sources_rsync.macports.org_release_ports_science_playerstage-player/work/player-3.0.0/client_libs/libplayerc/bindings/python /opt/local/var/macports/build/_opt_local_var_macports_sources_rsync.macports.org_release_ports_science_playerstage-player/work/player-3.0.0 /opt/local/var/macports/build/_opt_local_var_macports_sources_rsync.macports.org_release_ports_science_playerstage-player/work/player-3.0.0/client_libs/libplayerc/bindings/python /opt/local/var/macports/build/_opt_local_var_macports_sources_rsync.macports.org_release_ports_science_playerstage-player/work/player-3.0.0/client_libs/libplayerc/bindings/python/CMakeFiles/_playerc.dir/DependInfo.cmake --color=
1076:info:build /usr/bin/make -f libplayercore/CMakeFiles/playercore.dir/build.make libplayercore/CMakeFiles/playercore.dir/build
1077:info:build make[2]: Nothing to be done for `libplayercore/CMakeFiles/playercore.dir/build'.
1078:info:build /opt/local/bin/cmake -E cmake_progress_report /opt/local/var/macports/build/_opt_local_var_macports_sources_rsync.macports.org_release_ports_science_playerstage-player/work/player-3.0.0/CMakeFiles  36 37 38
1079:info:build [ 27%] /usr/bin/make -f client_libs/libplayerc/bindings/python/CMakeFiles/_playerc.dir/build.make client_libs/libplayerc/bindings/python/CMakeFiles/_playerc.dir/build
1080:info:build Built target playercore
1081:info:build /usr/bin/make -f client_libs/libplayerc/bindings/ruby/CMakeFiles/playercr.dir/build.make client_libs/libplayerc/bindings/ruby/CMakeFiles/playercr.dir/depend
1082:info:build make[2]: Nothing to be done for `client_libs/libplayerc/bindings/python/CMakeFiles/_playerc.dir/build'.
1083:info:build /opt/local/bin/cmake -E cmake_progress_report /opt/local/var/macports/build/_opt_local_var_macports_sources_rsync.macports.org_release_ports_science_playerstage-player/work/player-3.0.0/CMakeFiles
1084:info:build cd /opt/local/var/macports/build/_opt_local_var_macports_sources_rsync.macports.org_release_ports_science_playerstage-player/work/player-3.0.0 && /opt/local/bin/cmake -E cmake_depends "Unix Makefiles" /opt/local/var/macports/build/_opt_local_var_macports_sources_rsync.macports.org_release_ports_science_playerstage-player/work/player-3.0.0 /opt/local/var/macports/build/_opt_local_var_macports_sources_rsync.macports.org_release_ports_science_playerstage-player/work/player-3.0.0/client_libs/libplayerc/bindings/ruby /opt/local/var/macports/build/_opt_local_var_macports_sources_rsync.macports.org_release_ports_science_playerstage-player/work/player-3.0.0 /opt/local/var/macports/build/_opt_local_var_macports_sources_rsync.macports.org_release_ports_science_playerstage-player/work/player-3.0.0/client_libs/libplayerc/bindings/ruby /opt/local/var/macports/build/_opt_local_var_macports_sources_rsync.macports.org_release_ports_science_playerstage-player/work/player-3.0.0/client_libs/libplayerc/bindings/ruby/CMakeFiles/playercr.dir/DependInfo.cmake --color=
1085:info:build [ 27%] Built target _playerc
1086:info:build /usr/bin/make -f client_libs/libplayerc++/CMakeFiles/playerc++.dir/build.make client_libs/libplayerc++/CMakeFiles/playerc++.dir/depend
1087:info:build /usr/bin/make -f client_libs/libplayerc/bindings/ruby/CMakeFiles/playercr.dir/build.make client_libs/libplayerc/bindings/ruby/CMakeFiles/playercr.dir/build
1088:info:build make[2]: Nothing to be done for `client_libs/libplayerc/bindings/ruby/CMakeFiles/playercr.dir/build'.
1089:info:build /opt/local/bin/cmake -E cmake_progress_report /opt/local/var/macports/build/_opt_local_var_macports_sources_rsync.macports.org_release_ports_science_playerstage-player/work/player-3.0.0/CMakeFiles  39
1090:info:build [ 28%] Built target playercr
1091:info:build /usr/bin/make -f libplayertcp/CMakeFiles/playertcp.dir/build.make libplayertcp/CMakeFiles/playertcp.dir/depend
1092:info:build cd /opt/local/var/macports/build/_opt_local_var_macports_sources_rsync.macports.org_release_ports_science_playerstage-player/work/player-3.0.0 && /opt/local/bin/cmake -E cmake_depends "Unix Makefiles" /opt/local/var/macports/build/_opt_local_var_macports_sources_rsync.macports.org_release_ports_science_playerstage-player/work/player-3.0.0 /opt/local/var/macports/build/_opt_local_var_macports_sources_rsync.macports.org_release_ports_science_playerstage-player/work/player-3.0.0/libplayertcp /opt/local/var/macports/build/_opt_local_var_macports_sources_rsync.macports.org_release_ports_science_playerstage-player/work/player-3.0.0 /opt/local/var/macports/build/_opt_local_var_macports_sources_rsync.macports.org_release_ports_science_playerstage-player/work/player-3.0.0/libplayertcp /opt/local/var/macports/build/_opt_local_var_macports_sources_rsync.macports.org_release_ports_science_playerstage-player/work/player-3.0.0/libplayertcp/CMakeFiles/playertcp.dir/DependInfo.cmake --color=
1093:info:build /usr/bin/make -f libplayertcp/CMakeFiles/playertcp.dir/build.make libplayertcp/CMakeFiles/playertcp.dir/build
1094:info:build make[2]: Nothing to be done for `libplayertcp/CMakeFiles/playertcp.dir/build'.
1095:info:build /opt/local/bin/cmake -E cmake_progress_report /opt/local/var/macports/build/_opt_local_var_macports_sources_rsync.macports.org_release_ports_science_playerstage-player/work/player-3.0.0/CMakeFiles  85
1096:info:build [ 29%] Built target playertcp
1097:info:build /usr/bin/make -f libplayertcp/CMakeFiles/playerudp.dir/build.make libplayertcp/CMakeFiles/playerudp.dir/depend
1098:info:build cd /opt/local/var/macports/build/_opt_local_var_macports_sources_rsync.macports.org_release_ports_science_playerstage-player/work/player-3.0.0 && /opt/local/bin/cmake -E cmake_depends "Unix Makefiles" /opt/local/var/macports/build/_opt_local_var_macports_sources_rsync.macports.org_release_ports_science_playerstage-player/work/player-3.0.0 /opt/local/var/macports/build/_opt_local_var_macports_sources_rsync.macports.org_release_ports_science_playerstage-player/work/player-3.0.0/libplayertcp /opt/local/var/macports/build/_opt_local_var_macports_sources_rsync.macports.org_release_ports_science_playerstage-player/work/player-3.0.0 /opt/local/var/macports/build/_opt_local_var_macports_sources_rsync.macports.org_release_ports_science_playerstage-player/work/player-3.0.0/libplayertcp /opt/local/var/macports/build/_opt_local_var_macports_sources_rsync.macports.org_release_ports_science_playerstage-player/work/player-3.0.0/libplayertcp/CMakeFiles/playerudp.dir/DependInfo.cmake --color=
1099:info:build /usr/bin/make -f libplayertcp/CMakeFiles/playerudp.dir/build.make libplayertcp/CMakeFiles/playerudp.dir/build
1100:info:build make[2]: Nothing to be done for `libplayertcp/CMakeFiles/playerudp.dir/build'.
1101:info:build /opt/local/bin/cmake -E cmake_progress_report /opt/local/var/macports/build/_opt_local_var_macports_sources_rsync.macports.org_release_ports_science_playerstage-player/work/player-3.0.0/CMakeFiles
1102:info:build [ 29%] Built target playerudp
1103:info:build /usr/bin/make -f server/libplayerdrivers/CMakeFiles/playerdrivers.dir/build.make server/libplayerdrivers/CMakeFiles/playerdrivers.dir/depend
1104:info:build cd /opt/local/var/macports/build/_opt_local_var_macports_sources_rsync.macports.org_release_ports_science_playerstage-player/work/player-3.0.0 && /opt/local/bin/cmake -E cmake_depends "Unix Makefiles" /opt/local/var/macports/build/_opt_local_var_macports_sources_rsync.macports.org_release_ports_science_playerstage-player/work/player-3.0.0 /opt/local/var/macports/build/_opt_local_var_macports_sources_rsync.macports.org_release_ports_science_playerstage-player/work/player-3.0.0/server/libplayerdrivers /opt/local/var/macports/build/_opt_local_var_macports_sources_rsync.macports.org_release_ports_science_playerstage-player/work/player-3.0.0 /opt/local/var/macports/build/_opt_local_var_macports_sources_rsync.macports.org_release_ports_science_playerstage-player/work/player-3.0.0/server/libplayerdrivers /opt/local/var/macports/build/_opt_local_var_macports_sources_rsync.macports.org_release_ports_science_playerstage-player/work/player-3.0.0/server/libplayerdrivers/CMakeFiles/playerdrivers.dir/DependInfo.cmake --color=
1105:info:build /usr/bin/make -f server/libplayerdrivers/CMakeFiles/playerdrivers.dir/build.make server/libplayerdrivers/CMakeFiles/playerdrivers.dir/build
1106:info:build /opt/local/bin/cmake -E cmake_progress_report /opt/local/var/macports/build/_opt_local_var_macports_sources_rsync.macports.org_release_ports_science_playerstage-player/work/player-3.0.0/CMakeFiles
1107:info:build [ 29%] Building CXX object server/libplayerdrivers/CMakeFiles/playerdrivers.dir/__/drivers/camera/1394/camera1394.o
1108:info:build cd /opt/local/var/macports/build/_opt_local_var_macports_sources_rsync.macports.org_release_ports_science_playerstage-player/work/player-3.0.0/server/libplayerdrivers && /usr/bin/g++-4.2   -Dplayerdrivers_EXPORTS -pipe -O2 -arch x86_64  -Wall -O3 -DNDEBUG -arch x86_64 -isysroot /Developer/SDKs/MacOSX10.6.sdk -mmacosx-version-min=10.6 -fPIC -I/opt/local/var/macports/build/_opt_local_var_macports_sources_rsync.macports.org_release_ports_science_playerstage-player/work/player-3.0.0 -I/opt/local/var/macports/build/_opt_local_var_macports_sources_rsync.macports.org_release_ports_science_playerstage-player/work/player-3.0.0/libplayercore -I/opt/local/var/macports/build/_opt_local_var_macports_sources_rsync.macports.org_release_ports_science_playerstage-player/work/player-3.0.0/server/libplayerdrivers -I/opt/local/include/opencv -I/opt/local/var/macports/build/_opt_local_var_macports_sources_rsync.macports.org_release_ports_science_playerstage-player/work/player-3.0.0/server/drivers/laser -I/opt/local/include/gtk-2.0 -I/opt/local/include/glib-2.0 -I/opt/local/lib/glib-2.0/include -I/opt/local/include -I/opt/local/lib/gtk-2.0/include -I/opt/local/include/atk-1.0 -I/opt/local/include/cairo -I/opt/local/include/pango-1.0 -I/opt/local/include/gio-unix-2.0 -I/opt/local/include/pixman-1 -I/opt/local/include/freetype2 -I/opt/local/include/libpng12    -I/opt/local/var/macports/build/_opt_local_var_macports_sources_rsync.macports.org_release_ports_science_playerstage-player/work/player-3.0.0/server/drivers/blobfinder/cmvision -I/opt/local/var/macports/build/_opt_local_var_macports_sources_rsync.macports.org_release_ports_science_playerstage-player/work/player-3.0.0/server/drivers/camera/1394 -I/opt/local/var/macports/build/_opt_local_var_macports_sources_rsync.macports.org_release_ports_science_playerstage-player/work/player-3.0.0/server/drivers/blobfinder/cmvision -o CMakeFiles/playerdrivers.dir/__/drivers/camera/1394/camera1394.o -c /opt/local/var/macports/build/_opt_local_var_macports_sources_rsync.macports.org_release_ports_science_playerstage-player/work/player-3.0.0/server/drivers/camera/1394/camera1394.cc
1109:info:build /opt/local/var/macports/build/_opt_local_var_macports_sources_rsync.macports.org_release_ports_science_playerstage-player/work/player-3.0.0/server/drivers/camera/1394/camera1394.cc:182:32: error: libraw1394/raw1394.h: No such file or directory
1110:info:build cd /opt/local/var/macports/build/_opt_local_var_macports_sources_rsync.macports.org_release_ports_science_playerstage-player/work/player-3.0.0 && /opt/local/bin/cmake -E cmake_depends "Unix Makefiles" /opt/local/var/macports/build/_opt_local_var_macports_sources_rsync.macports.org_release_ports_science_playerstage-player/work/player-3.0.0 /opt/local/var/macports/build/_opt_local_var_macports_sources_rsync.macports.org_release_ports_science_playerstage-player/work/player-3.0.0/client_libs/libplayerc++ /opt/local/var/macports/build/_opt_local_var_macports_sources_rsync.macports.org_release_ports_science_playerstage-player/work/player-3.0.0 /opt/local/var/macports/build/_opt_local_var_macports_sources_rsync.macports.org_release_ports_science_playerstage-player/work/player-3.0.0/client_libs/libplayerc++ /opt/local/var/macports/build/_opt_local_var_macports_sources_rsync.macports.org_release_ports_science_playerstage-player/work/player-3.0.0/client_libs/libplayerc++/CMakeFiles/playerc++.dir/DependInfo.cmake --color=
1111:info:build /opt/local/var/macports/build/_opt_local_var_macports_sources_rsync.macports.org_release_ports_science_playerstage-player/work/player-3.0.0/server/drivers/camera/1394/camera1394.cc:357: error: 'raw1394handle_t' does not name a type
1112:info:build /opt/local/var/macports/build/_opt_local_var_macports_sources_rsync.macports.org_release_ports_science_playerstage-player/work/player-3.0.0/server/drivers/camera/1394/camera1394.cc: In constructor 'Camera1394::Camera1394(ConfigFile*, int)':
1113:info:build /opt/local/var/macports/build/_opt_local_var_macports_sources_rsync.macports.org_release_ports_science_playerstage-player/work/player-3.0.0/server/drivers/camera/1394/camera1394.cc:478: error: 'class Camera1394' has no member named 'handle'
1114:info:build /opt/local/var/macports/build/_opt_local_var_macports_sources_rsync.macports.org_release_ports_science_playerstage-player/work/player-3.0.0/server/drivers/camera/1394/camera1394.cc: In member function 'virtual int Camera1394::MainSetup()':
1115:info:build /opt/local/var/macports/build/_opt_local_var_macports_sources_rsync.macports.org_release_ports_science_playerstage-player/work/player-3.0.0/server/drivers/camera/1394/camera1394.cc:1056: error: 'quadlet_t' was not declared in this scope
1116:info:build /opt/local/var/macports/build/_opt_local_var_macports_sources_rsync.macports.org_release_ports_science_playerstage-player/work/player-3.0.0/server/drivers/camera/1394/camera1394.cc:1056: error: expected `;' before 'value'
1117:info:build /opt/local/var/macports/build/_opt_local_var_macports_sources_rsync.macports.org_release_ports_science_playerstage-player/work/player-3.0.0/server/drivers/camera/1394/camera1394.cc:1058: error: 'value' was not declared in this scope
1118:info:build make[2]: *** [server/libplayerdrivers/CMakeFiles/playerdrivers.dir/__/drivers/camera/1394/camera1394.o] Error 1
1119:info:build make[1]: *** [server/libplayerdrivers/CMakeFiles/playerdrivers.dir/all] Error 2
1120:info:build make[1]: *** Waiting for unfinished jobs....
1121:info:build /usr/bin/make -f client_libs/libplayerc++/CMakeFiles/playerc++.dir/build.make client_libs/libplayerc++/CMakeFiles/playerc++.dir/build
1122:info:build make[2]: Nothing to be done for `client_libs/libplayerc++/CMakeFiles/playerc++.dir/build'.
1123:info:build /opt/local/bin/cmake -E cmake_progress_report /opt/local/var/macports/build/_opt_local_var_macports_sources_rsync.macports.org_release_ports_science_playerstage-player/work/player-3.0.0/CMakeFiles  23 24 25 26 27 28 29 30 31 32 33
1124:info:build [ 40%] Built target playerc++
1125:info:build make: *** [all] Error 2
1126:info:build shell command " cd "/opt/local/var/macports/build/_opt_local_var_macports_sources_rsync.macports.org_release_ports_science_playerstage-player/work/player-3.0.0" && /usr/bin/make -j2 all " returned error 2
1127:error:build Target org.macports.build returned: shell command failed
1128:debug:build Backtrace: shell command failed
1129    while executing
1130"command_exec build"
1131    (procedure "portbuild::build_main" line 8)
1132    invoked from within
1133"$procedure $targetname"
1134:info:build Warning: the following items did not execute (for playerstage-player): org.macports.activate org.macports.build org.macports.destroot org.macports.install
1135:notice:build Log for playerstage-player is at: /opt/local/var/macports/logs/_opt_local_var_macports_sources_rsync.macports.org_release_ports_science_playerstage-player/main.log