Ticket #27263: main2.log

File main2.log, 9.6 KB (added by de5ton56@…, 9 years ago)
Line 
1version:1
2:msg:main --->  Computing dependencies for texlive-bin:info:main .:debug:main Searching for dependency: xz
3:debug:main Found Dependency: receipt exists for xz
4:debug:main Searching for dependency: perl5
5:debug:main Found Dependency: receipt exists for perl5
6:debug:main Searching for dependency: pkgconfig
7:debug:main Found Dependency: receipt exists for pkgconfig
8:debug:main Searching for dependency: fontconfig
9:debug:main Found Dependency: receipt exists for fontconfig
10:debug:main Searching for dependency: freetype
11:debug:main Found Dependency: receipt exists for freetype
12:debug:main Searching for dependency: gd2
13:debug:main Found Dependency: receipt exists for gd2
14:debug:main Searching for dependency: libpng
15:debug:main Found Dependency: receipt exists for libpng
16:debug:main Searching for dependency: ncurses
17:debug:main Found Dependency: receipt exists for ncurses
18:debug:main Searching for dependency: zlib
19:debug:main Found Dependency: receipt exists for zlib
20:debug:main Searching for dependency: libzzip
21:debug:main Found Dependency: receipt exists for libzzip
22:debug:main Searching for dependency: t1lib
23:debug:main Found Dependency: receipt exists for t1lib
24:debug:main Searching for dependency: poppler
25:debug:main Found Dependency: receipt exists for poppler
26:debug:main Searching for dependency: xorg-libXp
27:debug:main Found Dependency: receipt exists for xorg-libXp
28:debug:main Searching for dependency: texlive-common
29:debug:main Found Dependency: receipt exists for texlive-common
30:debug:main Searching for dependency: openmotif
31:debug:main Found Dependency: receipt exists for openmotif
32:debug:main Searching for dependency: ghostscript
33:debug:main Found Dependency: receipt exists for ghostscript
34:msg:main
35:debug:main Executing org.macports.main (texlive-bin)
36:debug:main Skipping completed org.macports.archivefetch (texlive-bin)
37:debug:main Skipping completed org.macports.unarchive (texlive-bin)
38:debug:main Skipping completed org.macports.fetch (texlive-bin)
39:debug:main Skipping completed org.macports.checksum (texlive-bin)
40:debug:main setting option extract.cmd to /opt/local/bin/xz
41:debug:main Skipping completed org.macports.extract (texlive-bin)
42:debug:main Skipping completed org.macports.patch (texlive-bin)
43:debug:main Skipping completed org.macports.configure (texlive-bin)
44:msg:main --->  Building texlive-bin
45:debug:build build phase started at Thu Nov 11 16:56:33 SGT 2010
46:debug:build Executing proc-pre-org.macports.build-build-0
47:debug:build Executing org.macports.build (texlive-bin)
48:debug:build Environment: CPATH='/opt/local/include' CC_PRINT_OPTIONS_FILE='/opt/local/var/macports/build/_opt_local_var_macports_sources_rsync.macports.org_release_ports_tex_texlive-bin/work/.CC_PRINT_OPTIONS' LIBRARY_PATH='/opt/local/lib' CC_PRINT_OPTIONS='YES' MACOSX_DEPLOYMENT_TARGET='10.6' OBJC='/usr/bin/gcc-4.2' OBJCFLAGS='-O2 -arch x86_64'
49:debug:build Assembled command: 'cd "/opt/local/var/macports/build/_opt_local_var_macports_sources_rsync.macports.org_release_ports_tex_texlive-bin/work/texlive-20100720-source" && /usr/bin/make -j13 all'
50:info:build Making all in .
51:info:build Making all in texk/kpathsea
52:info:build /usr/bin/make  all-recursive
53:info:build Making all in .
54:info:build make[3]: Nothing to be done for `all-am'.
55:info:build Making all in doc
56:info:build make[3]: Nothing to be done for `all'.
57:info:build Making all in man
58:info:build make[3]: Nothing to be done for `all'.
59:info:build Making all in texk/ptexenc
60:info:build make[1]: Nothing to be done for `all'.
61:info:build Making all in libs
62:info:build Making all in .
63:info:build Making all in obsdcompat
64:info:build make[2]: Nothing to be done for `all'.
65:info:build Making all in freetype
66:info:build make[2]: Nothing to be done for `all'.
67:info:build Making all in graphite
68:info:build Making all in include/graphite
69:info:build make[3]: Nothing to be done for `all-am'.
70:info:build Making all in teckit
71:info:build /usr/bin/make  all-recursive
72:info:build Making all in include/teckit
73:info:build make[4]: Nothing to be done for `all-am'.
74:info:build Making all in icu
75:info:build Making all in .
76:info:build cd icu-build && /usr/bin/make  all
77:info:build /usr/bin/make[4]: Making `all' in `stubdata'
78:info:build make[5]: Nothing to be done for `all'.
79:info:build /usr/bin/make[4]: Making `all' in `common'
80:info:build make[5]: Nothing to be done for `all'.
81:info:build /usr/bin/make[4]: Making `all' in `i18n'
82:info:build make[5]: Nothing to be done for `all'.
83:info:build /usr/bin/make[4]: Making `all' in `layout'
84:info:build make[5]: Nothing to be done for `all'.
85:info:build /usr/bin/make[4]: Making `all' in `layoutex'
86:info:build make[5]: Nothing to be done for `all'.
87:info:build /usr/bin/make[4]: Making `all' in `tools'
88:info:build /usr/bin/make[5]: Making `all' in `toolutil'
89:info:build make[6]: Nothing to be done for `all'.
90:info:build /usr/bin/make[5]: Making `all' in `ctestfw'
91:info:build make[6]: Nothing to be done for `all'.
92:info:build /usr/bin/make[5]: Making `all' in `makeconv'
93:info:build make[6]: Nothing to be done for `all'.
94:info:build /usr/bin/make[5]: Making `all' in `genrb'
95:info:build make[6]: Nothing to be done for `all'.
96:info:build /usr/bin/make[5]: Making `all' in `genuca'
97:info:build make[6]: Nothing to be done for `all'.
98:info:build /usr/bin/make[5]: Making `all' in `genbrk'
99:info:build make[6]: Nothing to be done for `all'.
100:info:build /usr/bin/make[5]: Making `all' in `genctd'
101:info:build make[6]: Nothing to be done for `all'.
102:info:build /usr/bin/make[5]: Making `all' in `gennames'
103:info:build make[6]: Nothing to be done for `all'.
104:info:build /usr/bin/make[5]: Making `all' in `genpname'
105:info:build make[6]: Nothing to be done for `all'.
106:info:build /usr/bin/make[5]: Making `all' in `gencnval'
107:info:build make[6]: Nothing to be done for `all'.
108:info:build /usr/bin/make[5]: Making `all' in `gensprep'
109:info:build make[6]: Nothing to be done for `all'.
110:info:build /usr/bin/make[5]: Making `all' in `icuinfo'
111:info:build ccache /usr/bin/g++-4.2   -I../../common  -I/opt/local/var/macports/build/_opt_local_var_macports_sources_rsync.macports.org_release_ports_tex_texlive-bin/work/texlive-20100720-source/libs/icu/icu-4.4/common -I/opt/local/var/macports/build/_opt_local_var_macports_sources_rsync.macports.org_release_ports_tex_texlive-bin/work/texlive-20100720-source/libs/icu/icu-4.4/tools/icuinfo/../toolutil -I/opt/local/var/macports/build/_opt_local_var_macports_sources_rsync.macports.org_release_ports_tex_texlive-bin/work/texlive-20100720-source/libs/icu/icu-4.4/tools/ctestfw  -I/opt/local/var/macports/build/_opt_local_var_macports_sources_rsync.macports.org_release_ports_tex_texlive-bin/work/texlive-20100720-source/libs/icu/icu-4.4/i18n -DU_PLATFORM=\"U_DARWIN\"  -DU_BUILD=\"x86_64-apple-darwin10.4.0\" -DU_HOST=\"x86_64-apple-darwin10.4.0\" -DU_CC=\"ccache /usr/bin/gcc-4.2\" -DU_CXX=\"ccache /usr/bin/g++-4.2\" -pipe -O2 -arch x86_64 -fno-common -c   -o icuinfo.o /opt/local/var/macports/build/_opt_local_var_macports_sources_rsync.macports.org_release_ports_tex_texlive-bin/work/texlive-20100720-source/libs/icu/icu-4.4/tools/icuinfo/icuinfo.cpp
112:info:build i686-apple-darwin10-g++-4.2.1: /usr/bin/gcc-4.2": No such file or directory
113:info:build i686-apple-darwin10-g++-4.2.1: /usr/bin/g++-4.2": No such file or directory
114:info:build <command-line>: warning: missing terminating " character
115:info:build <command-line>: warning: missing terminating " character
116:info:build /opt/local/var/macports/build/_opt_local_var_macports_sources_rsync.macports.org_release_ports_tex_texlive-bin/work/texlive-20100720-source/libs/icu/icu-4.4/tools/icuinfo/icuinfo.cpp:107: error: missing terminating " character
117:info:build /opt/local/var/macports/build/_opt_local_var_macports_sources_rsync.macports.org_release_ports_tex_texlive-bin/work/texlive-20100720-source/libs/icu/icu-4.4/tools/icuinfo/icuinfo.cpp:110: error: missing terminating " character
118:info:build /opt/local/var/macports/build/_opt_local_var_macports_sources_rsync.macports.org_release_ports_tex_texlive-bin/work/texlive-20100720-source/libs/icu/icu-4.4/tools/icuinfo/icuinfo.cpp: In function 'void cmd_version(UBool)':
119:info:build /opt/local/var/macports/build/_opt_local_var_macports_sources_rsync.macports.org_release_ports_tex_texlive-bin/work/texlive-20100720-source/libs/icu/icu-4.4/tools/icuinfo/icuinfo.cpp:107: error: expected primary-expression before ')' token
120:info:build /opt/local/var/macports/build/_opt_local_var_macports_sources_rsync.macports.org_release_ports_tex_texlive-bin/work/texlive-20100720-source/libs/icu/icu-4.4/tools/icuinfo/icuinfo.cpp:110: error: expected primary-expression before ')' token
121:info:build make[6]: *** [icuinfo.o] Error 1
122:info:build make[5]: *** [all-recursive] Error 2
123:info:build make[4]: *** [all-recursive] Error 2
124:info:build make[3]: *** [icubuild] Error 2
125:info:build make[2]: *** [all-recursive] Error 1
126:info:build make[1]: *** [all-recursive] Error 1
127:info:build make: *** [all-recursive] Error 1
128:info:build shell command " cd "/opt/local/var/macports/build/_opt_local_var_macports_sources_rsync.macports.org_release_ports_tex_texlive-bin/work/texlive-20100720-source" && /usr/bin/make -j13 all " returned error 2
129:error:build Target org.macports.build returned: shell command failed (see log for details)
130:debug:build Backtrace: shell command failed (see log for details)
131    while executing
132"command_exec build"
133    (procedure "portbuild::build_main" line 8)
134    invoked from within
135"$procedure $targetname"
136:info:build Warning: the following items did not execute (for texlive-bin): org.macports.archive org.macports.build org.macports.destroot
137:notice:build Log for texlive-bin is at: /opt/local/var/macports/logs/_opt_local_var_macports_sources_rsync.macports.org_release_ports_tex_texlive-bin/main.log