Ticket #27839: main.log

File main.log, 11.3 KB (added by david.hislop.1@…, 11 years ago)

gimp-app main.log

Line 
1version:1
2:msg:clean --->  Computing dependencies for gimp-app:info:clean .:debug:clean Searching for dependency: gimp2
3:debug:clean Found Dependency: receipt exists for gimp2
4:msg:clean
5:debug:main Executing org.macports.main (gimp-app)
6:debug:main Skipping completed org.macports.fetch (gimp-app)
7:debug:main Skipping completed org.macports.checksum (gimp-app)
8:debug:main Skipping completed org.macports.extract (gimp-app)
9:debug:main Skipping completed org.macports.patch (gimp-app)
10:debug:main Skipping completed org.macports.configure (gimp-app)
11:msg:main --->  Building gimp-app
12:debug:build build phase started at Sat Jan  1 23:04:02 EST 2011
13:debug:build Executing proc-pre-org.macports.build-build-0
14:info:build (NOTE: project ScriptExec was written by an older Xcode version (39) -- temporarily upgrading it (without modifying project file))
15:info:build
16:info:build
17:info:build === CLEAN NATIVE TARGET ScriptExec OF PROJECT ScriptExec WITH THE DEFAULT CONFIGURATION (Default) ===
18:info:build Check dependencies
19:info:build Clean.Remove clean build/Default/ScriptExec.app
20:info:build     /bin/rm -rf /opt/local/var/macports/build/_opt_local_var_macports_sources_rsync.macports.org_release_ports_aqua_gimp-app/work/ScriptExec/build/Default/ScriptExec.app
21:info:build
22:info:build Clean.Remove clean /var/folders/zz/zzzivhrRnAmviuee+++++++++++/-Caches-/com.apple.Xcode.0/SharedPrecompiledHeaders/ScriptExec_Prefix-eambjzimyyjxqdbnehsrhulsrtsw/ScriptExec_Prefix.pch.gch
23:info:build     /bin/rm -rf /var/folders/zz/zzzivhrRnAmviuee+++++++++++/-Caches-/com.apple.Xcode.0/SharedPrecompiledHeaders/ScriptExec_Prefix-eambjzimyyjxqdbnehsrhulsrtsw/ScriptExec_Prefix.pch.gch
24:info:build
25:info:build Clean.Remove clean build/ScriptExec.build/Default/ScriptExec.build
26:info:build     /bin/rm -rf /opt/local/var/macports/build/_opt_local_var_macports_sources_rsync.macports.org_release_ports_aqua_gimp-app/work/ScriptExec/build/ScriptExec.build/Default/ScriptExec.build
27:info:build
28:info:build ** CLEAN SUCCEEDED **
29:info:build
30:debug:build Executing org.macports.build (gimp-app)
31:debug:build Assembled command: 'cd "/opt/local/var/macports/build/_opt_local_var_macports_sources_rsync.macports.org_release_ports_aqua_gimp-app/work/ScriptExec" && /usr/bin/xcodebuild  -alltargets -configuration Deployment build OBJROOT=build/ SYMROOT=build/ MACOSX_DEPLOYMENT_TARGET=10.6 ARCHS=x86_64 SDKROOT="" '
32:info:build (NOTE: project ScriptExec was written by an older Xcode version (39) -- temporarily upgrading it (without modifying project file))
33:info:build
34:info:build Build settings from command line:
35:info:build     ARCHS = x86_64
36:info:build     MACOSX_DEPLOYMENT_TARGET = 10.6
37:info:build     OBJROOT = build/
38:info:build     SDKROOT =
39:info:build     SYMROOT = build/
40:info:build
41:info:build
42:info:build === BUILD NATIVE TARGET ScriptExec OF PROJECT ScriptExec WITH CONFIGURATION Deployment ===
43:info:build Check dependencies
44:info:build CompileC build/ScriptExec.build/Deployment/ScriptExec.build/Objects-normal/x86_64/main.o main.c normal x86_64 c com.apple.compilers.gcc.4_2
45:info:build     cd /opt/local/var/macports/build/_opt_local_var_macports_sources_rsync.macports.org_release_ports_aqua_gimp-app/work/ScriptExec
46:info:build     setenv LANG en_US.US-ASCII
47:info:build     /Developer/usr/bin/gcc-4.2 -x c -arch x86_64 -fmessage-length=0 -pipe -Wno-trigraphs -fpascal-strings -fasm-blocks -Os -mdynamic-no-pic -fvisibility=hidden -mmacosx-version-min=10.6 -I/opt/local/var/macports/build/_opt_local_var_macports_sources_rsync.macports.org_release_ports_aqua_gimp-app/work/ScriptExec/build/ScriptExec.build/Deployment/ScriptExec.build/ScriptExec.hmap -Wmost -Wno-four-char-constants -Wno-unknown-pragmas -F/opt/local/var/macports/build/_opt_local_var_macports_sources_rsync.macports.org_release_ports_aqua_gimp-app/work/ScriptExec/build/Deployment -I/opt/local/var/macports/build/_opt_local_var_macports_sources_rsync.macports.org_release_ports_aqua_gimp-app/work/ScriptExec/build/Deployment/include -I/opt/local/var/macports/build/_opt_local_var_macports_sources_rsync.macports.org_release_ports_aqua_gimp-app/work/ScriptExec/build/ScriptExec.build/Deployment/ScriptExec.build/DerivedSources/x86_64 -I/opt/local/var/macports/build/_opt_local_var_macports_sources_rsync.macports.org_release_ports_aqua_gimp-app/work/ScriptExec/build/ScriptExec.build/Deployment/ScriptExec.build/DerivedSources -include /var/folders/zz/zzzivhrRnAmviuee+++++++++++/-Caches-/com.apple.Xcode.0/SharedPrecompiledHeaders/ScriptExec_Prefix-fjqslffpxdgvupftqlldkqzqbvow/ScriptExec_Prefix.pch -c /opt/local/var/macports/build/_opt_local_var_macports_sources_rsync.macports.org_release_ports_aqua_gimp-app/work/ScriptExec/main.c -o /opt/local/var/macports/build/_opt_local_var_macports_sources_rsync.macports.org_release_ports_aqua_gimp-app/work/ScriptExec/build/ScriptExec.build/Deployment/ScriptExec.build/Objects-normal/x86_64/main.o
48:info:build
49:info:build cc1: error: /var/folders/zz/zzzivhrRnAmviuee+++++++++++/-Caches-/com.apple.Xcode.0/SharedPrecompiledHeaders/ScriptExec_Prefix-fjqslffpxdgvupftqlldkqzqbvow/ScriptExec_Prefix.pch: No such file or directory
50:info:build cc1: error: one or more PCH files were found, but they were invalid
51:info:build cc1: error: use -Winvalid-pch for more information
52:info:build /opt/local/var/macports/build/_opt_local_var_macports_sources_rsync.macports.org_release_ports_aqua_gimp-app/work/ScriptExec/main.c: In function 'main':
53:info:build /opt/local/var/macports/build/_opt_local_var_macports_sources_rsync.macports.org_release_ports_aqua_gimp-app/work/ScriptExec/main.c:120: warning: implicit declaration of function 'InitCursor'
54:info:build /opt/local/var/macports/build/_opt_local_var_macports_sources_rsync.macports.org_release_ports_aqua_gimp-app/work/ScriptExec/main.c:145: warning: implicit declaration of function 'RunApplicationEventLoop'
55:info:build /opt/local/var/macports/build/_opt_local_var_macports_sources_rsync.macports.org_release_ports_aqua_gimp-app/work/ScriptExec/main.c: In function 'GetParameters':
56:info:build /opt/local/var/macports/build/_opt_local_var_macports_sources_rsync.macports.org_release_ports_aqua_gimp-app/work/ScriptExec/main.c:218: warning: pointer targets in passing argument 2 of '__builtin___strcpy_chk' differ in signedness
57:info:build /opt/local/var/macports/build/_opt_local_var_macports_sources_rsync.macports.org_release_ports_aqua_gimp-app/work/ScriptExec/main.c:218: warning: pointer targets in passing argument 2 of '__inline_strcpy_chk' differ in signedness
58:info:build /opt/local/var/macports/build/_opt_local_var_macports_sources_rsync.macports.org_release_ports_aqua_gimp-app/work/ScriptExec/main.c:220: warning: pointer targets in assignment differ in signedness
59:info:build /opt/local/var/macports/build/_opt_local_var_macports_sources_rsync.macports.org_release_ports_aqua_gimp-app/work/ScriptExec/main.c:223: warning: pointer targets in passing argument 2 of '__builtin___strcpy_chk' differ in signedness
60:info:build /opt/local/var/macports/build/_opt_local_var_macports_sources_rsync.macports.org_release_ports_aqua_gimp-app/work/ScriptExec/main.c:223: warning: pointer targets in passing argument 2 of '__inline_strcpy_chk' differ in signedness
61:info:build /opt/local/var/macports/build/_opt_local_var_macports_sources_rsync.macports.org_release_ports_aqua_gimp-app/work/ScriptExec/main.c: In function 'GetScript':
62:info:build /opt/local/var/macports/build/_opt_local_var_macports_sources_rsync.macports.org_release_ports_aqua_gimp-app/work/ScriptExec/main.c:254: warning: pointer targets in passing argument 2 of 'FSRefMakePath' differ in signedness
63:info:build /opt/local/var/macports/build/_opt_local_var_macports_sources_rsync.macports.org_release_ports_aqua_gimp-app/work/ScriptExec/main.c:255: warning: pointer targets in passing argument 1 of 'DoesFileExist' differ in signedness
64:info:build /opt/local/var/macports/build/_opt_local_var_macports_sources_rsync.macports.org_release_ports_aqua_gimp-app/work/ScriptExec/main.c:257: warning: pointer targets in return differ in signedness
65:info:build /opt/local/var/macports/build/_opt_local_var_macports_sources_rsync.macports.org_release_ports_aqua_gimp-app/work/ScriptExec/main.c: In function 'GetOpenDoc':
66:info:build /opt/local/var/macports/build/_opt_local_var_macports_sources_rsync.macports.org_release_ports_aqua_gimp-app/work/ScriptExec/main.c:288: warning: pointer targets in passing argument 2 of 'FSRefMakePath' differ in signedness
67:info:build /opt/local/var/macports/build/_opt_local_var_macports_sources_rsync.macports.org_release_ports_aqua_gimp-app/work/ScriptExec/main.c:289: warning: pointer targets in passing argument 1 of 'DoesFileExist' differ in signedness
68:info:build /opt/local/var/macports/build/_opt_local_var_macports_sources_rsync.macports.org_release_ports_aqua_gimp-app/work/ScriptExec/main.c:291: warning: pointer targets in return differ in signedness
69:info:build /opt/local/var/macports/build/_opt_local_var_macports_sources_rsync.macports.org_release_ports_aqua_gimp-app/work/ScriptExec/main.c: In function 'LoadMenuBar':
70:info:build /opt/local/var/macports/build/_opt_local_var_macports_sources_rsync.macports.org_release_ports_aqua_gimp-app/work/ScriptExec/main.c:304: warning: implicit declaration of function 'CreateNibReference'
71:info:build /opt/local/var/macports/build/_opt_local_var_macports_sources_rsync.macports.org_release_ports_aqua_gimp-app/work/ScriptExec/main.c:305: warning: implicit declaration of function 'SetMenuBarFromNib'
72:info:build /opt/local/var/macports/build/_opt_local_var_macports_sources_rsync.macports.org_release_ports_aqua_gimp-app/work/ScriptExec/main.c:306: warning: implicit declaration of function 'DisposeNibReference'
73:info:build /opt/local/var/macports/build/_opt_local_var_macports_sources_rsync.macports.org_release_ports_aqua_gimp-app/work/ScriptExec/main.c: In function 'RedFatalAlert':
74:info:build /opt/local/var/macports/build/_opt_local_var_macports_sources_rsync.macports.org_release_ports_aqua_gimp-app/work/ScriptExec/main.c:321: warning: implicit declaration of function 'CreateStandardAlert'
75:info:build /opt/local/var/macports/build/_opt_local_var_macports_sources_rsync.macports.org_release_ports_aqua_gimp-app/work/ScriptExec/main.c:324: warning: implicit declaration of function 'RunStandardAlert'
76:info:build ** BUILD FAILED **
77:info:build
78:info:build
79:info:build The following build commands failed:
80:info:build ScriptExec:
81:info:build     CompileC build/ScriptExec.build/Deployment/ScriptExec.build/Objects-normal/x86_64/main.o /opt/local/var/macports/build/_opt_local_var_macports_sources_rsync.macports.org_release_ports_aqua_gimp-app/work/ScriptExec/main.c normal x86_64 c com.apple.compilers.gcc.4_2
82:info:build (1 failure)
83:info:build
84:info:build shell command "cd "/opt/local/var/macports/build/_opt_local_var_macports_sources_rsync.macports.org_release_ports_aqua_gimp-app/work/ScriptExec" && /usr/bin/xcodebuild  -alltargets -configuration Deployment build OBJROOT=build/ SYMROOT=build/ MACOSX_DEPLOYMENT_TARGET=10.6 ARCHS=x86_64 SDKROOT="" " returned error 1
85:error:build Target org.macports.build returned: shell command failed (see log for details)
86:debug:build Backtrace: shell command failed (see log for details)
87    while executing
88"$procedure $targetname"
89:info:build Warning: the following items did not execute (for gimp-app): org.macports.destroot org.macports.build
90:notice:build Log for gimp-app is at: /opt/local/var/macports/logs/_opt_local_var_macports_sources_rsync.macports.org_release_ports_aqua_gimp-app/main.log