New Ticket     Tickets     Wiki     Browse Source     Timeline     Roadmap     Ticket Reports     Search

Ticket #28871: main.log

File main.log, 5.0 KB (added by jf@…, 3 years ago)
Line 
1version:1
2:debug:main Executing org.macports.main (openssl)
3:debug:main Skipping completed org.macports.fetch (openssl)
4:debug:main Skipping completed org.macports.checksum (openssl)
5:debug:main Skipping completed org.macports.extract (openssl)
6:debug:main Skipping completed org.macports.patch (openssl)
7:debug:main Skipping completed org.macports.configure (openssl)
8:msg:main --->  Building openssl
9:debug:build build phase started at Tue Mar 22 22:51:31 CET 2011
10:debug:build Executing org.macports.build (openssl)
11:debug:build port disallows a parallel build
12:debug:build Environment: CPATH='/opt/local/include' CC_PRINT_OPTIONS_FILE='/opt/local/var/macports/build/_opt_local_var_macports_sources_rsync.macports.org_release_ports_devel_openssl/work/.CC_PRINT_OPTIONS' LIBRARY_PATH='/opt/local/lib' CC_PRINT_OPTIONS='YES' MACOSX_DEPLOYMENT_TARGET='10.4'
13:debug:build Assembled command: 'cd "/opt/local/var/macports/build/_opt_local_var_macports_sources_rsync.macports.org_release_ports_devel_openssl/work/openssl-1.0.0d" && /usr/bin/make all'
14:info:build making all in crypto...
15:info:build making all in crypto/objects...
16:info:build make[2]: Nothing to be done for `all'.
17:info:build making all in crypto/md4...
18:info:build make[2]: Nothing to be done for `all'.
19:info:build making all in crypto/md5...
20:info:build make[2]: Nothing to be done for `all'.
21:info:build making all in crypto/sha...
22:info:build make[2]: Nothing to be done for `all'.
23:info:build making all in crypto/mdc2...
24:info:build make[2]: Nothing to be done for `all'.
25:info:build making all in crypto/hmac...
26:info:build make[2]: Nothing to be done for `all'.
27:info:build making all in crypto/ripemd...
28:info:build make[2]: Nothing to be done for `all'.
29:info:build making all in crypto/whrlpool...
30:info:build make[2]: Nothing to be done for `all'.
31:info:build making all in crypto/des...
32:info:build make[2]: Nothing to be done for `all'.
33:info:build making all in crypto/aes...
34:info:build make[2]: Nothing to be done for `all'.
35:info:build making all in crypto/rc2...
36:info:build make[2]: Nothing to be done for `all'.
37:info:build making all in crypto/rc4...
38:info:build make[2]: Nothing to be done for `all'.
39:info:build making all in crypto/idea...
40:info:build make[2]: Nothing to be done for `all'.
41:info:build making all in crypto/bf...
42:info:build make[2]: Nothing to be done for `all'.
43:info:build making all in crypto/cast...
44:info:build make[2]: Nothing to be done for `all'.
45:info:build making all in crypto/camellia...
46:info:build make[2]: Nothing to be done for `all'.
47:info:build making all in crypto/seed...
48:info:build make[2]: Nothing to be done for `all'.
49:info:build making all in crypto/modes...
50:info:build make[2]: Nothing to be done for `all'.
51:info:build making all in crypto/bn...
52:info:build make[2]: Nothing to be done for `all'.
53:info:build making all in crypto/ec...
54:info:build make[2]: Nothing to be done for `all'.
55:info:build making all in crypto/rsa...
56:info:build make[2]: Nothing to be done for `all'.
57:info:build making all in crypto/dsa...
58:info:build make[2]: Nothing to be done for `all'.
59:info:build making all in crypto/ecdsa...
60:info:build make[2]: Nothing to be done for `all'.
61:info:build making all in crypto/dh...
62:info:build make[2]: Nothing to be done for `all'.
63:info:build making all in crypto/ecdh...
64:info:build make[2]: Nothing to be done for `all'.
65:info:build making all in crypto/dso...
66:info:build /usr/bin/gcc-4.0 -I.. -I../.. -I../asn1 -I../evp -I../../include  -fPIC -fno-common -DOPENSSL_PIC -DZLIB -DOPENSSL_THREADS -D_REENTRANT -DDSO_DLFCN -DHAVE_DLFCN_H -arch ppc -O3 -DB_ENDIAN -Wa,-force_cpusubtype_ALL   -c -o dso_dlfcn.o dso_dlfcn.c
67:info:build dso_dlfcn.c: In function 'dlfcn_pathbyaddr':
68:info:build dso_dlfcn.c:445: error: 'Dl_info' undeclared (first use in this function)
69:info:build dso_dlfcn.c:445: error: (Each undeclared identifier is reported only once
70:info:build dso_dlfcn.c:445: error: for each function it appears in.)
71:info:build dso_dlfcn.c:445: error: parse error before 'dli'
72:info:build dso_dlfcn.c:455: error: 'dli' undeclared (first use in this function)
73:info:build make[2]: *** [dso_dlfcn.o] Error 1
74:info:build make[1]: *** [subdirs] Error 1
75:info:build make: *** [build_crypto] Error 1
76:info:build shell command " cd "/opt/local/var/macports/build/_opt_local_var_macports_sources_rsync.macports.org_release_ports_devel_openssl/work/openssl-1.0.0d" && /usr/bin/make all " returned error 2
77:error:build Target org.macports.build returned: shell command failed (see log for details)
78:debug:build Backtrace: shell command failed (see log for details)
79    while executing
80"command_exec build"
81    (procedure "portbuild::build_main" line 8)
82    invoked from within
83"$procedure $targetname"
84:info:build Warning: the following items did not execute (for openssl): org.macports.activate org.macports.build org.macports.destroot org.macports.install
85:error:build Failed to install openssl
86:notice:build Log for openssl is at: /opt/local/var/macports/logs/_opt_local_var_macports_sources_rsync.macports.org_release_ports_devel_openssl/main.log