Ticket #29135: main.2.log

File main.2.log, 18.8 KB (added by bbarth@…, 10 years ago)
Line 
1version:1
2:debug:main epoch: in tree: 0 installed: 0
3:debug:main ncurses 5.9_0 exists in the ports tree
4:debug:main ncurses 5.9_0 +universal is the latest installed
5:debug:main ncurses 5.9_0 +universal is active
6:debug:main Merging existing variants '+universal' into variants
7:debug:main new fully merged portvariants: universal +
8:debug:main Changing to port directory: /opt/local/var/macports/sources/rsync.macports.org/release/ports/devel/ncurses
9:debug:main OS darwin/10.6.0 (Mac OS X 10.6) arch i386
10:debug:main org.macports.load registered provides 'load', a pre-existing procedure. Target override will not be provided
11:debug:main org.macports.unload registered provides 'unload', a pre-existing procedure. Target override will not be provided
12:debug:main org.macports.distfiles registered provides 'distfiles', a pre-existing procedure. Target override will not be provided
13:debug:main adding the default universal variant
14:debug:main Reading variant descriptions from /opt/local/var/macports/sources/rsync.macports.org/release/ports/_resources/port1.0/variant_descriptions.conf
15:debug:main Executing variant universal provides universal
16:debug:main No need to upgrade! ncurses 5.9_0 >= ncurses 5.9_0
17:msg:main --->  Computing dependencies for readline:info:main .:debug:main Searching for dependency: ncurses
18:debug:main Found Dependency: receipt exists for ncurses
19:msg:main
20:debug:main Executing org.macports.main (readline)
21:msg:main --->  Fetching readline
22:debug:fetch fetch phase started at Fri Apr 29 08:22:23 CDT 2011
23:debug:fetch Executing org.macports.fetch (readline)
24:msg:fetch --->  Verifying checksum(s) for readline
25:debug:checksum checksum phase started at Fri Apr 29 08:22:23 CDT 2011
26:debug:checksum Executing org.macports.checksum (readline)
27:info:checksum --->  Checksumming readline-6.2.tar.gz
28:debug:checksum Correct (md5) checksum for readline-6.2.tar.gz
29:debug:checksum Correct (sha1) checksum for readline-6.2.tar.gz
30:debug:checksum Correct (rmd160) checksum for readline-6.2.tar.gz
31:msg:checksum --->  Extracting readline
32:debug:extract extract phase started at Fri Apr 29 08:22:23 CDT 2011
33:debug:extract Executing org.macports.extract (readline)
34:info:extract --->  Extracting readline-6.2.tar.gz
35:debug:extract setting option extract.args to '/opt/local/var/macports/distfiles/readline/readline-6.2.tar.gz'
36:debug:extract Environment: CPATH='/opt/local/include' CC_PRINT_OPTIONS_FILE='/opt/local/var/macports/build/_opt_local_var_macports_sources_rsync.macports.org_release_ports_devel_readline/work/.CC_PRINT_OPTIONS' LIBRARY_PATH='/opt/local/lib' CC_PRINT_OPTIONS='YES' MACOSX_DEPLOYMENT_TARGET='10.6'
37:debug:extract Assembled command: 'cd "/opt/local/var/macports/build/_opt_local_var_macports_sources_rsync.macports.org_release_ports_devel_readline/work" && /usr/bin/gzip -dc '/opt/local/var/macports/distfiles/readline/readline-6.2.tar.gz' | /usr/bin/gnutar --no-same-owner -xf -'
38:debug:patch patch phase started at Fri Apr 29 08:22:24 CDT 2011
39:debug:patch Executing org.macports.patch (readline)
40:msg:patch --->  Applying patches to readline
41:info:patch --->  Applying /opt/local/var/macports/sources/rsync.macports.org/release/ports/devel/readline/files/patch-shobj-conf.diff
42:debug:patch Environment: CPATH='/opt/local/include' CC_PRINT_OPTIONS_FILE='/opt/local/var/macports/build/_opt_local_var_macports_sources_rsync.macports.org_release_ports_devel_readline/work/.CC_PRINT_OPTIONS' LIBRARY_PATH='/opt/local/lib' CC_PRINT_OPTIONS='YES' MACOSX_DEPLOYMENT_TARGET='10.6'
43:debug:patch Assembled command: 'cd "/opt/local/var/macports/build/_opt_local_var_macports_sources_rsync.macports.org_release_ports_devel_readline/work/readline-6.2" && /usr/bin/patch -p0'
44:info:patch patching file support/shobj-conf
45:debug:patch Executing proc-post-org.macports.patch-patch-0
46:msg:patch --->  Configuring readline
47:debug:patch Using compiler 'Mac OS X gcc 4.2'
48:debug:configure configure phase started at Fri Apr 29 08:22:24 CDT 2011
49:debug:configure Executing org.macports.configure (readline)
50:debug:configure Environment: CPATH='/opt/local/include' CFLAGS='-pipe -O2 -arch x86_64' CPPFLAGS='-I/opt/local/include' CXXFLAGS='-pipe -O2 -arch x86_64' LIBRARY_PATH='/opt/local/lib' MACOSX_DEPLOYMENT_TARGET='10.6' CXX='/usr/bin/g++-4.2' CC_PRINT_OPTIONS_FILE='/opt/local/var/macports/build/_opt_local_var_macports_sources_rsync.macports.org_release_ports_devel_readline/work/.CC_PRINT_OPTIONS' F90FLAGS='-pipe -O2 -m64' LDFLAGS='-L/opt/local/lib -arch x86_64' OBJC='/usr/bin/gcc-4.2' FCFLAGS='-pipe -O2 -m64' INSTALL='/usr/bin/install -c' OBJCFLAGS='-pipe -O2 -arch x86_64' FFLAGS='-pipe -O2 -m64' CC_PRINT_OPTIONS='YES' CC='/usr/bin/gcc-4.2'
51:debug:configure Assembled command: 'cd "/opt/local/var/macports/build/_opt_local_var_macports_sources_rsync.macports.org_release_ports_devel_readline/work/readline-6.2" && ./configure --prefix=/opt/local --with-curses'
52:info:configure checking build system type... i386-apple-darwin10.6.0
53:info:configure checking host system type... i386-apple-darwin10.6.0
54:info:configure
55:info:configure Beginning configuration for readline-6.2 for i386-apple-darwin10.6.0
56:info:configure
57:info:configure checking whether make sets $(MAKE)... yes
58:info:configure checking for gcc... /usr/bin/gcc-4.2
59:info:configure checking for C compiler default output file name... a.out
60:info:configure checking whether the C compiler works... yes
61:info:configure checking whether we are cross compiling... no
62:info:configure checking for suffix of executables...
63:info:configure checking for suffix of object files... o
64:info:configure checking whether we are using the GNU C compiler... yes
65:info:configure checking whether /usr/bin/gcc-4.2 accepts -g... yes
66:info:configure checking for /usr/bin/gcc-4.2 option to accept ISO C89... none needed
67:info:configure checking how to run the C preprocessor... /usr/bin/gcc-4.2 -E
68:info:configure checking for grep that handles long lines and -e... /usr/bin/grep
69:info:configure checking for egrep... /usr/bin/grep -E
70:info:configure checking for ANSI C header files... yes
71:info:configure checking for sys/types.h... yes
72:info:configure checking for sys/stat.h... yes
73:info:configure checking for stdlib.h... yes
74:info:configure checking for string.h... yes
75:info:configure checking for memory.h... yes
76:info:configure checking for strings.h... yes
77:info:configure checking for inttypes.h... yes
78:info:configure checking for stdint.h... yes
79:info:configure checking for unistd.h... yes
80:info:configure checking minix/config.h usability... no
81:info:configure checking minix/config.h presence... no
82:info:configure checking for minix/config.h... no
83:info:configure checking whether it is safe to define __EXTENSIONS__... yes
84:info:configure checking whether /usr/bin/gcc-4.2 needs -traditional... no
85:info:configure checking for a BSD-compatible install... /usr/bin/install -c
86:info:configure checking for ar... ar
87:info:configure checking for ranlib... ranlib
88:info:configure checking for an ANSI C-conforming const... yes
89:info:configure checking for function prototypes... yes
90:info:configure checking whether char is unsigned... no
91:info:configure checking for working volatile... yes
92:info:configure checking return type of signal handlers... void
93:info:configure checking for size_t... yes
94:info:configure checking for ssize_t... yes
95:info:configure checking for ANSI C header files... (cached) yes
96:info:configure checking whether stat file-mode macros are broken... no
97:info:configure checking for dirent.h that defines DIR... yes
98:info:configure checking for library containing opendir... none required
99:info:configure checking for fcntl... yes
100:info:configure checking for kill... yes
101:info:configure checking for lstat... yes
102:info:configure checking for memmove... yes
103:info:configure checking for putenv... yes
104:info:configure checking for select... yes
105:info:configure checking for setenv... yes
106:info:configure checking for setlocale... yes
107:info:configure checking for strcasecmp... yes
108:info:configure checking for strpbrk... yes
109:info:configure checking for tcgetattr... yes
110:info:configure checking for vsnprintf... yes
111:info:configure checking for isascii... yes
112:info:configure checking for isxdigit... yes
113:info:configure checking for getpwent... yes
114:info:configure checking for getpwnam... yes
115:info:configure checking for getpwuid... yes
116:info:configure checking for working strcoll... yes
117:info:configure checking fcntl.h usability... yes
118:info:configure checking fcntl.h presence... yes
119:info:configure checking for fcntl.h... yes
120:info:configure checking for unistd.h... (cached) yes
121:info:configure checking for stdlib.h... (cached) yes
122:info:configure checking varargs.h usability... no
123:info:configure checking varargs.h presence... no
124:info:configure checking for varargs.h... no
125:info:configure checking stdarg.h usability... yes
126:info:configure checking stdarg.h presence... yes
127:info:configure checking for stdarg.h... yes
128:info:configure checking for string.h... (cached) yes
129:info:configure checking for strings.h... (cached) yes
130:info:configure checking limits.h usability... yes
131:info:configure checking limits.h presence... yes
132:info:configure checking for limits.h... yes
133:info:configure checking locale.h usability... yes
134:info:configure checking locale.h presence... yes
135:info:configure checking for locale.h... yes
136:info:configure checking pwd.h usability... yes
137:info:configure checking pwd.h presence... yes
138:info:configure checking for pwd.h... yes
139:info:configure checking for memory.h... (cached) yes
140:info:configure checking termcap.h usability... yes
141:info:configure checking termcap.h presence... yes
142:info:configure checking for termcap.h... yes
143:info:configure checking termios.h usability... yes
144:info:configure checking termios.h presence... yes
145:info:configure checking for termios.h... yes
146:info:configure checking termio.h usability... no
147:info:configure checking termio.h presence... no
148:info:configure checking for termio.h... no
149:info:configure checking sys/pte.h usability... no
150:info:configure checking sys/pte.h presence... no
151:info:configure checking for sys/pte.h... no
152:info:configure checking sys/stream.h usability... no
153:info:configure checking sys/stream.h presence... no
154:info:configure checking for sys/stream.h... no
155:info:configure checking sys/select.h usability... yes
156:info:configure checking sys/select.h presence... yes
157:info:configure checking for sys/select.h... yes
158:info:configure checking sys/file.h usability... yes
159:info:configure checking sys/file.h presence... yes
160:info:configure checking for sys/file.h... yes
161:info:configure checking for sys/ptem.h... no
162:info:configure checking for special C compiler options needed for large files... no
163:info:configure checking for _FILE_OFFSET_BITS value needed for large files... no
164:info:configure checking for type of signal functions... posix
165:info:configure checking if signal handlers must be reinstalled when invoked... no
166:info:configure checking for presence of POSIX-style sigsetjmp/siglongjmp... present
167:info:configure checking for lstat... yes
168:info:configure checking whether or not strcoll and strcmp differ... no
169:info:configure checking whether the ctype macros accept non-ascii characters... yes
170:info:configure checking whether getpw functions are declared in pwd.h... yes
171:info:configure checking whether termios.h defines TIOCGWINSZ... yes
172:info:configure checking for sig_atomic_t in signal.h... yes
173:info:configure checking whether signal handlers are of type void... yes
174:info:configure checking for TIOCSTAT in sys/ioctl.h... yes
175:info:configure checking for FIONREAD in sys/ioctl.h... yes
176:info:configure checking for speed_t in sys/types.h... no
177:info:configure checking for struct winsize in sys/ioctl.h and termios.h... sys/ioctl.h
178:info:configure checking for struct dirent.d_ino... yes
179:info:configure checking for struct dirent.d_fileno... yes
180:info:configure checking for tgetent... no
181:info:configure checking for tgetent in -ltermcap... yes
182:info:configure checking which library has the termcap functions... using libtermcap
183:info:configure checking wctype.h usability... yes
184:info:configure checking wctype.h presence... yes
185:info:configure checking for wctype.h... yes
186:info:configure checking wchar.h usability... yes
187:info:configure checking wchar.h presence... yes
188:info:configure checking for wchar.h... yes
189:info:configure checking langinfo.h usability... yes
190:info:configure checking langinfo.h presence... yes
191:info:configure checking for langinfo.h... yes
192:info:configure checking for mbrlen... yes
193:info:configure checking for mbscasecmp... no
194:info:configure checking for mbscmp... no
195:info:configure checking for mbsnrtowcs... yes
196:info:configure checking for mbsrtowcs... yes
197:info:configure checking for mbschr... no
198:info:configure checking for wcrtomb... yes
199:info:configure checking for wcscoll... yes
200:info:configure checking for wcsdup... no
201:info:configure checking for wcwidth... yes
202:info:configure checking for wctype... yes
203:info:configure checking for wcswidth... yes
204:info:configure checking whether mbrtowc and mbstate_t are properly declared... yes
205:info:configure checking for iswlower... yes
206:info:configure checking for iswupper... yes
207:info:configure checking for towlower... yes
208:info:configure checking for towupper... yes
209:info:configure checking for iswctype... yes
210:info:configure checking for nl_langinfo and CODESET... yes
211:info:configure checking for wchar_t in wchar.h... yes
212:info:configure checking for wctype_t in wctype.h... yes
213:info:configure checking for wint_t in wctype.h... yes
214:info:configure checking configuration for building shared libraries... supported
215:info:configure configure: creating ./config.status
216:info:configure config.status: creating Makefile
217:info:configure config.status: creating doc/Makefile
218:info:configure config.status: creating examples/Makefile
219:info:configure config.status: creating shlib/Makefile
220:info:configure config.status: creating config.h
221:info:configure config.status: executing default commands
222:msg:configure --->  Building readline
223:debug:build build phase started at Fri Apr 29 08:22:39 CDT 2011
224:debug:build Executing org.macports.build (readline)
225:debug:build Environment: CPATH='/opt/local/include' CC_PRINT_OPTIONS_FILE='/opt/local/var/macports/build/_opt_local_var_macports_sources_rsync.macports.org_release_ports_devel_readline/work/.CC_PRINT_OPTIONS' LIBRARY_PATH='/opt/local/lib' CC_PRINT_OPTIONS='YES' MACOSX_DEPLOYMENT_TARGET='10.6'
226:debug:build Assembled command: 'cd "/opt/local/var/macports/build/_opt_local_var_macports_sources_rsync.macports.org_release_ports_devel_readline/work/readline-6.2" && /usr/bin/make -j4 all'
227:info:build rm -f readline.o
228:info:build rm -f vi_mode.o
229:info:build rm -f funmap.o
230:info:build rm -f keymaps.o
231:info:build /usr/bin/gcc-4.2 -c -DHAVE_CONFIG_H   -I/opt/local/include -I. -I. -DRL_LIBRARY_VERSION='"6.2"' -pipe -O2 -arch x86_64 readline.c
232:info:build /usr/bin/gcc-4.2 -c -DHAVE_CONFIG_H   -I/opt/local/include -I. -I. -DRL_LIBRARY_VERSION='"6.2"' -pipe -O2 -arch x86_64 vi_mode.c
233:info:build /usr/bin/gcc-4.2 -c -DHAVE_CONFIG_H   -I/opt/local/include -I. -I. -DRL_LIBRARY_VERSION='"6.2"' -pipe -O2 -arch x86_64 funmap.c
234:info:build /usr/bin/gcc-4.2 -c -DHAVE_CONFIG_H   -I/opt/local/include -I. -I. -DRL_LIBRARY_VERSION='"6.2"' -pipe -O2 -arch x86_64 keymaps.c
235:info:build rm -f parens.o
236:info:build /usr/bin/gcc-4.2 -c -DHAVE_CONFIG_H   -I/opt/local/include -I. -I. -DRL_LIBRARY_VERSION='"6.2"' -pipe -O2 -arch x86_64 parens.c
237:info:build rm -f search.o
238:info:build /usr/bin/gcc-4.2 -c -DHAVE_CONFIG_H   -I/opt/local/include -I. -I. -DRL_LIBRARY_VERSION='"6.2"' -pipe -O2 -arch x86_64 search.c
239:info:build rm -f rltty.o
240:info:build /usr/bin/gcc-4.2 -c -DHAVE_CONFIG_H   -I/opt/local/include -I. -I. -DRL_LIBRARY_VERSION='"6.2"' -pipe -O2 -arch x86_64 rltty.c
241:info:build rm -f complete.o
242:info:build /usr/bin/gcc-4.2 -c -DHAVE_CONFIG_H   -I/opt/local/include -I. -I. -DRL_LIBRARY_VERSION='"6.2"' -pipe -O2 -arch x86_64 complete.c
243:info:build rm -f bind.o
244:info:build /usr/bin/gcc-4.2 -c -DHAVE_CONFIG_H   -I/opt/local/include -I. -I. -DRL_LIBRARY_VERSION='"6.2"' -pipe -O2 -arch x86_64 bind.c
245:info:build rm -f isearch.o
246:info:build /usr/bin/gcc-4.2 -c -DHAVE_CONFIG_H   -I/opt/local/include -I. -I. -DRL_LIBRARY_VERSION='"6.2"' -pipe -O2 -arch x86_64 isearch.c
247:info:build complete.c: In function 'rl_username_completion_function':
248:info:build complete.c:2045: warning: assignment makes pointer from integer without a cast
249:info:build complete.c:2048: error: dereferencing pointer to incomplete type
250:info:build complete.c:2048: error: dereferencing pointer to incomplete type
251:info:build complete.c:2062: error: dereferencing pointer to incomplete type
252:info:build complete.c:2066: error: dereferencing pointer to incomplete type
253:info:build complete.c:2066: error: dereferencing pointer to incomplete type
254:info:build complete.c: In function 'rl_filename_completion_function':
255:info:build complete.c:2141: error: nested functions are disabled, use -fnested-functions to re-enable
256:info:build complete.c:2141: error: expected '=', ',', ';', 'asm' or '__attribute__' before '*' token
257:info:build complete.c:2141: error: 'directory' undeclared (first use in this function)
258:info:build complete.c:2141: error: (Each undeclared identifier is reported only once
259:info:build complete.c:2141: error: for each function it appears in.)
260:info:build complete.c:2141: error: 'DIR' undeclared (first use in this function)
261:info:build complete.c:2141: error: expected expression before ')' token
262:info:build complete.c:2158: error: expected expression before ')' token
263:info:build complete.c:2258: warning: assignment makes pointer from integer without a cast
264:info:build complete.c:2260: error: dereferencing pointer to incomplete type
265:info:build complete.c:2261: error: dereferencing pointer to incomplete type
266:info:build complete.c:2293: error: expected expression before ')' token
267:info:build complete.c:2321: error: dereferencing pointer to incomplete type
268:info:build complete.c:2334: error: dereferencing pointer to incomplete type
269:info:build bind.c: In function 'rl_function_of_keyseq':
270:info:build bind.c:710: warning: comparison is always true due to limited range of data type
271:info:build make: *** [complete.o] Error 1
272:info:build make: *** Waiting for unfinished jobs....
273:info:build shell command " cd "/opt/local/var/macports/build/_opt_local_var_macports_sources_rsync.macports.org_release_ports_devel_readline/work/readline-6.2" && /usr/bin/make -j4 all " returned error 2
274:error:build Target org.macports.build returned: shell command failed (see log for details)
275:debug:build Backtrace: shell command failed (see log for details)
276    while executing
277"command_exec build"
278    (procedure "portbuild::build_main" line 8)
279    invoked from within
280"$procedure $targetname"
281:info:build Warning: the following items did not execute (for readline): org.macports.activate org.macports.build org.macports.destroot org.macports.install
282:notice:build Log for readline is at: /opt/local/var/macports/logs/_opt_local_var_macports_sources_rsync.macports.org_release_ports_devel_readline/main.log