Ticket #29307: guile.log

File guile.log, 25.1 KB (added by JadeNB1729@…, 7 years ago)

Log attached to http://lists.gnu.org/archive/html/bug-guile/2014-07/msg00002.html

Line 
1/Applications/Xcode.app/Contents/Developer/usr/bin/make -C libguile scmconfig.h
2  GEN      gen-scmconfig.o
3  GEN      gen-scmconfig
4  GEN      scmconfig.h
5/Applications/Xcode.app/Contents/Developer/usr/bin/make  all-recursive
6Making all in lib
7  GEN      alloca.h
8  GEN      c++defs.h
9  GEN      warn-on-use.h
10  GEN      arg-nonnull.h
11  GEN      arpa/inet.h
12  GEN      byteswap.h
13  GEN      configmake.h
14  GEN      dirent.h
15  GEN      fcntl.h
16  GEN      iconv.h
17  GEN      langinfo.h
18  GEN      locale.h
19  GEN      math.h
20  GEN      netdb.h
21  GEN      poll.h
22  GEN      signal.h
23  GEN      unused-parameter.h
24  GEN      stdint.h
25  GEN      stdio.h
26  GEN      stdlib.h
27  GEN      string.h
28  GEN      sys/file.h
29  GEN      sys/select.h
30  GEN      sys/socket.h
31  GEN      sys/stat.h
32  GEN      sys/time.h
33  GEN      sys/times.h
34  GEN      sys/types.h
35  GEN      sys/uio.h
36  GEN      time.h
37  GEN      unistd.h
38  GEN      wchar.h
39  GEN      wctype.h
40/Applications/Xcode.app/Contents/Developer/usr/bin/make  all-recursive
41  CC       binary-io.lo
42  CC       c-ctype.lo
43  CC       c-strcasecmp.lo
44  CC       c-strncasecmp.lo
45  CC       dirname-lgpl.lo
46  CC       basename-lgpl.lo
47  CC       stripslash.lo
48  CC       fd-hook.lo
49  CC       full-read.lo
50  CC       full-write.lo
51  CC       localcharset.lo
52  CC       malloca.lo
53  CC       math.lo
54  CC       nproc.lo
55  CC       pipe2.lo
56  CC       safe-read.lo
57  CC       safe-write.lo
58  CC       sockets.lo
59  CC       stat-time.lo
60  CC       strftime.lo
61  CC       striconveh.lo
62  CC       sys_socket.lo
63  CC       tempname.lo
64  CC       unistd.lo
65  CC       unistr/u8-mbtouc.lo
66  CC       unistr/u8-mbtouc-aux.lo
67  CC       unistr/u8-mbtouc-unsafe.lo
68  CC       unistr/u8-mbtouc-unsafe-aux.lo
69  CC       wctype-h.lo
70  CC       xsize.lo
71  CC       asnprintf.lo
72  CC       canonicalize-lgpl.lo
73  CC       isfinite.lo
74  CC       isnand.lo
75  CC       isnanf.lo
76  CC       isnanl.lo
77  CC       link.lo
78  CC       lstat.lo
79  CC       open.lo
80  CC       poll.lo
81poll.c:337:11: warning: comparison of unsigned expression < 0 is always false
82      [-Wtautological-compare]
83  if (nfd < 0
84      ~~~ ^ ~
851 warning generated.
86  CC       printf-args.lo
87  CC       printf-parse.lo
88  CC       putenv.lo
89  CC       readlink.lo
90  CC       regex.lo
91In file included from regex.c:70:
92./regex_internal.c:1397:11: warning: comparison of unsigned expression < 0 is
93      always false [-Wtautological-compare]
94  if (idx < 0 || idx >= set->nelem)
95      ~~~ ^ ~
961 warning generated.
97  CC       rename.lo
98  CC       secure_getenv.lo
99  CC       setenv.lo
100  CC       stat.lo
101  CC       vasnprintf.lo
102  CCLD     libgnu.la
103/Applications/Xcode.app/Contents/Developer/Toolchains/XcodeDefault.xctoolchain/usr/bin/ranlib: file: .libs/libgnu.a(binary-io.o) has no symbols
104/Applications/Xcode.app/Contents/Developer/Toolchains/XcodeDefault.xctoolchain/usr/bin/ranlib: file: .libs/libgnu.a(fd-hook.o) has no symbols
105/Applications/Xcode.app/Contents/Developer/Toolchains/XcodeDefault.xctoolchain/usr/bin/ranlib: file: .libs/libgnu.a(math.o) has no symbols
106/Applications/Xcode.app/Contents/Developer/Toolchains/XcodeDefault.xctoolchain/usr/bin/ranlib: file: .libs/libgnu.a(stat-time.o) has no symbols
107/Applications/Xcode.app/Contents/Developer/Toolchains/XcodeDefault.xctoolchain/usr/bin/ranlib: file: .libs/libgnu.a(sys_socket.o) has no symbols
108/Applications/Xcode.app/Contents/Developer/Toolchains/XcodeDefault.xctoolchain/usr/bin/ranlib: file: .libs/libgnu.a(unistd.o) has no symbols
109/Applications/Xcode.app/Contents/Developer/Toolchains/XcodeDefault.xctoolchain/usr/bin/ranlib: file: .libs/libgnu.a(u8-mbtouc.o) has no symbols
110/Applications/Xcode.app/Contents/Developer/Toolchains/XcodeDefault.xctoolchain/usr/bin/ranlib: file: .libs/libgnu.a(u8-mbtouc-unsafe.o) has no symbols
111/Applications/Xcode.app/Contents/Developer/Toolchains/XcodeDefault.xctoolchain/usr/bin/ranlib: file: .libs/libgnu.a(wctype-h.o) has no symbols
112/Applications/Xcode.app/Contents/Developer/Toolchains/XcodeDefault.xctoolchain/usr/bin/ranlib: file: .libs/libgnu.a(xsize.o) has no symbols
113/Applications/Xcode.app/Contents/Developer/Toolchains/XcodeDefault.xctoolchain/usr/bin/ranlib: file: .libs/libgnu.a(binary-io.o) has no symbols
114/Applications/Xcode.app/Contents/Developer/Toolchains/XcodeDefault.xctoolchain/usr/bin/ranlib: file: .libs/libgnu.a(fd-hook.o) has no symbols
115/Applications/Xcode.app/Contents/Developer/Toolchains/XcodeDefault.xctoolchain/usr/bin/ranlib: file: .libs/libgnu.a(math.o) has no symbols
116/Applications/Xcode.app/Contents/Developer/Toolchains/XcodeDefault.xctoolchain/usr/bin/ranlib: file: .libs/libgnu.a(stat-time.o) has no symbols
117/Applications/Xcode.app/Contents/Developer/Toolchains/XcodeDefault.xctoolchain/usr/bin/ranlib: file: .libs/libgnu.a(sys_socket.o) has no symbols
118/Applications/Xcode.app/Contents/Developer/Toolchains/XcodeDefault.xctoolchain/usr/bin/ranlib: file: .libs/libgnu.a(unistd.o) has no symbols
119/Applications/Xcode.app/Contents/Developer/Toolchains/XcodeDefault.xctoolchain/usr/bin/ranlib: file: .libs/libgnu.a(u8-mbtouc.o) has no symbols
120/Applications/Xcode.app/Contents/Developer/Toolchains/XcodeDefault.xctoolchain/usr/bin/ranlib: file: .libs/libgnu.a(u8-mbtouc-unsafe.o) has no symbols
121/Applications/Xcode.app/Contents/Developer/Toolchains/XcodeDefault.xctoolchain/usr/bin/ranlib: file: .libs/libgnu.a(wctype-h.o) has no symbols
122/Applications/Xcode.app/Contents/Developer/Toolchains/XcodeDefault.xctoolchain/usr/bin/ranlib: file: .libs/libgnu.a(xsize.o) has no symbols
123  GEN      charset.alias
124  GEN      ref-add.sed
125  GEN      ref-del.sed
126Making all in meta
127guile="/Users/Shared/Applications/Programming/Lisp/guile/2.0.11/bin/`echo guile | /usr/bin/sed -e 's,x,x,'`" ;  \
128        cat ./guile-config.in                                           \
129        | /usr/bin/sed -e "s,@pkgconfigdir@,/Users/Shared/Applications/Programming/Lisp/guile/2.0.11/lib/pkgconfig,g"                   \
130                 -e "s,@""PKG_CONFIG@,/Users/Shared/Applications/MacPorts/base/bin/pkg-config,g"                                \
131                 -e "s,@installed_guile@,$guile,g"                              \
132        > guile-config.out
133mv guile-config.out guile-config
134chmod +x guile-config
135Making all in libguile
136  GEN      libpath.h
137  GEN      vm-i-system.i
138  GEN      vm-i-scheme.i
139  GEN      vm-i-loader.i
140  SNARF  alist.x
141  SNARF  arbiters.x
142  SNARF  array-handle.x
143  SNARF  array-map.x
144  SNARF  arrays.x
145  SNARF  async.x
146  SNARF  backtrace.x
147  SNARF  boolean.x
148  SNARF  bitvectors.x
149  SNARF  bytevectors.x
150  SNARF  chars.x
151  SNARF  control.x
152  SNARF  continuations.x
153  SNARF  debug.x
154  SNARF  deprecated.x
155  SNARF  deprecation.x
156  SNARF  dynl.x
157  SNARF  dynwind.x
158  SNARF  eq.x
159  SNARF  error.x
160  SNARF  eval.x
161  SNARF  evalext.x
162  SNARF  expand.x
163  SNARF  extensions.x
164  SNARF  feature.x
165  SNARF  filesys.x
166  SNARF  fluids.x
167  SNARF  foreign.x
168  SNARF  fports.x
169  SNARF  gc-malloc.x
170  SNARF  gc.x
171  SNARF  gettext.x
172  SNARF  generalized-arrays.x
173  SNARF  generalized-vectors.x
174  SNARF  goops.x
175  SNARF  gsubr.x
176  SNARF  guardians.x
177  SNARF  hash.x
178  SNARF  hashtab.x
179  SNARF  hooks.x
180  SNARF  i18n.x
181  SNARF  init.x
182  SNARF  ioext.x
183  SNARF  keywords.x
184  SNARF  list.x
185  SNARF  load.x
186  SNARF  macros.x
187  SNARF  mallocs.x
188  SNARF  memoize.x
189  SNARF  modules.x
190  SNARF  numbers.x
191  SNARF  objprop.x
192  SNARF  options.x
193  SNARF  pairs.x
194  SNARF  ports.x
195  SNARF  print.x
196  SNARF  procprop.x
197  SNARF  procs.x
198  SNARF  promises.x
199  SNARF  r6rs-ports.x
200  SNARF  random.x
201  SNARF  rdelim.x
202  SNARF  read.x
203  SNARF  root.x
204  SNARF  rw.x
205  SNARF  scmsigs.x
206  SNARF  script.x
207  SNARF  simpos.x
208  SNARF  smob.x
209  SNARF  sort.x
210  SNARF  srcprop.x
211  SNARF  srfi-1.x
212  SNARF  srfi-4.x
213  SNARF  srfi-13.x
214  SNARF  srfi-14.x
215  SNARF  srfi-60.x
216  SNARF  stackchk.x
217  SNARF  stacks.x
218  SNARF  stime.x
219  SNARF  strings.x
220  SNARF  strorder.x
221  SNARF  strports.x
222  SNARF  struct.x
223  SNARF  symbols.x
224  SNARF  threads.x
225  SNARF  throw.x
226  SNARF  trees.x
227  SNARF  uniform.x
228  SNARF  values.x
229  SNARF  variable.x
230  SNARF  vectors.x
231  SNARF  version.x
232  SNARF  vports.x
233  SNARF  weaks.x
234  SNARF  frames.x
235  SNARF  instructions.x
236  SNARF  objcodes.x
237  SNARF  programs.x
238  SNARF  vm.x
239  SNARF  posix.x
240  SNARF  net_db.x
241  SNARF  socket.x
242  SNARF  regex-posix.x
243/Applications/Xcode.app/Contents/Developer/usr/bin/make  all-am
244  CC       libguile_2.0_la-alist.lo
245  CC       libguile_2.0_la-arbiters.lo
246  CC       libguile_2.0_la-array-handle.lo
247array-handle.c:144:23: warning: comparison of unsigned enum expression < 0 is
248      always false [-Wtautological-compare]
249  if (h->element_type < 0 || h->element_type > SCM_ARRAY_ELEMENT_TYPE_LAST)
250      ~~~~~~~~~~~~~~~ ^ ~
2511 warning generated.
252  CC       libguile_2.0_la-array-map.lo
253  CC       libguile_2.0_la-arrays.lo
254  CC       libguile_2.0_la-async.lo
255  CC       libguile_2.0_la-backtrace.lo
256  CC       libguile_2.0_la-boolean.lo
257  CC       libguile_2.0_la-bitvectors.lo
258  CC       libguile_2.0_la-bytevectors.lo
259bytevectors.c:1836:1: warning: unused function 'utf8_strlen' [-Wunused-function]
260UTF_STRLEN_FUNCTION (8)
261^
262bytevectors.c:1821:28: note: expanded from macro 'UTF_STRLEN_FUNCTION'
263static inline size_t                                                    \
264                                                                        ^
265<scratch space>:71:1: note: expanded from here
266utf8_strlen
267^
2681 warning generated.
269  CC       libguile_2.0_la-chars.lo
270  CC       libguile_2.0_la-control.lo
271  CC       libguile_2.0_la-continuations.lo
272  CC       libguile_2.0_la-debug.lo
273  CC       libguile_2.0_la-deprecated.lo
274  CC       libguile_2.0_la-deprecation.lo
275  CC       libguile_2.0_la-dynwind.lo
276  CC       libguile_2.0_la-eq.lo
277  CC       libguile_2.0_la-error.lo
278  CC       libguile_2.0_la-eval.lo
279  CC       libguile_2.0_la-evalext.lo
280  CC       libguile_2.0_la-expand.lo
281expand.c:107:19: warning: unused variable 's_empty_combination'
282      [-Wunused-const-variable]
283static const char s_empty_combination[] = "Illegal empty combination";
284                  ^
285expand.c:108:19: warning: unused variable 's_missing_body_expression'
286      [-Wunused-const-variable]
287static const char s_missing_body_expression[] = "Missing body expression in";
288                  ^
289expand.c:109:19: warning: unused variable 's_mixed_body_forms'
290      [-Wunused-const-variable]
291static const char s_mixed_body_forms[] = "Mixed definitions and expressions in";
292                  ^
293expand.c:113:19: warning: unused variable 's_bad_case_clause'
294      [-Wunused-const-variable]
295static const char s_bad_case_clause[] = "Bad case clause";
296                  ^
297expand.c:114:19: warning: unused variable 's_bad_case_labels'
298      [-Wunused-const-variable]
299static const char s_bad_case_labels[] = "Bad case labels";
300                  ^
301expand.c:115:19: warning: unused variable 's_duplicate_case_label'
302      [-Wunused-const-variable]
303static const char s_duplicate_case_label[] = "Duplicate case label";
304                  ^
305expand.c:122:19: warning: unused variable 's_bad_exit_clause'
306      [-Wunused-const-variable]
307static const char s_bad_exit_clause[] = "Bad exit clause";
308                  ^
309expand.c:126:19: warning: unused variable 's_splicing' [-Wunused-const-variable]
310static const char s_splicing[] = "Non-list result for unquote-splicing";
311                  ^
312expand.c:127:19: warning: unused variable 's_bad_slot_number'
313      [-Wunused-const-variable]
314static const char s_bad_slot_number[] = "Bad slot number";
315                  ^
3169 warnings generated.
317  CC       libguile_2.0_la-extensions.lo
318  CC       libguile_2.0_la-feature.lo
319  CC       libguile_2.0_la-filesys.lo
320  CC       libguile_2.0_la-finalizers.lo
321  CC       libguile_2.0_la-fluids.lo
322  CC       libguile_2.0_la-foreign.lo
323  CC       libguile_2.0_la-fports.lo
324  CC       libguile_2.0_la-frames.lo
325  CC       libguile_2.0_la-gc-malloc.lo
326  CC       libguile_2.0_la-gc.lo
327  CC       libguile_2.0_la-gdbint.lo
328  CC       libguile_2.0_la-gettext.lo
329  CC       libguile_2.0_la-generalized-arrays.lo
330  CC       libguile_2.0_la-generalized-vectors.lo
331  CC       libguile_2.0_la-goops.lo
332  CC       libguile_2.0_la-gsubr.lo
333  CC       libguile_2.0_la-guardians.lo
334  CC       libguile_2.0_la-hash.lo
335  CC       libguile_2.0_la-hashtab.lo
336  CC       libguile_2.0_la-hooks.lo
337  CC       libguile_2.0_la-i18n.lo
338i18n.c:839:1: warning: unused function 'str_upcase' [-Wunused-function]
339str_upcase (register char *dst, register const char *src)
340^
341i18n.c:847:1: warning: unused function 'str_downcase' [-Wunused-function]
342str_downcase (register char *dst, register const char *src)
343^
344i18n.c:856:1: warning: unused function 'str_upcase_l' [-Wunused-function]
345str_upcase_l (register char *dst, register const char *src,
346^
347i18n.c:865:1: warning: unused function 'str_downcase_l' [-Wunused-function]
348str_downcase_l (register char *dst, register const char *src,
349^
3504 warnings generated.
351  CC       libguile_2.0_la-init.lo
352  CC       libguile_2.0_la-inline.lo
353  CC       libguile_2.0_la-instructions.lo
354  CC       libguile_2.0_la-ioext.lo
355  CC       libguile_2.0_la-keywords.lo
356  CC       libguile_2.0_la-list.lo
357  CC       libguile_2.0_la-load.lo
358  CC       libguile_2.0_la-macros.lo
359  CC       libguile_2.0_la-mallocs.lo
360  CC       libguile_2.0_la-memoize.lo
361  CC       libguile_2.0_la-modules.lo
362  CC       libguile_2.0_la-null-threads.lo
363  CC       libguile_2.0_la-numbers.lo
364  CC       libguile_2.0_la-objcodes.lo
365  CC       libguile_2.0_la-objprop.lo
366  CC       libguile_2.0_la-options.lo
367  CC       libguile_2.0_la-pairs.lo
368  CC       libguile_2.0_la-poll.lo
369  CC       libguile_2.0_la-ports.lo
370ports.c:2402:28: warning: unused variable 'scm_utf8_bom'
371      [-Wunused-const-variable]
372static const unsigned char scm_utf8_bom[3]    = {0xEF, 0xBB, 0xBF};
373                           ^
374ports.c:2403:28: warning: unused variable 'scm_utf16be_bom'
375      [-Wunused-const-variable]
376static const unsigned char scm_utf16be_bom[2] = {0xFE, 0xFF};
377                           ^
378ports.c:2405:28: warning: unused variable 'scm_utf32be_bom'
379      [-Wunused-const-variable]
380static const unsigned char scm_utf32be_bom[4] = {0x00, 0x00, 0xFE, 0xFF};
381                           ^
3823 warnings generated.
383  CC       libguile_2.0_la-print.lo
384print.c:641:45: warning: implicit conversion from enumeration type 'enum
385      iconv_ilseq_handler' to different enumeration type
386      'scm_t_string_failed_conversion_handler' [-Wenum-conversion]
387              display_character ('"', port, iconveh_question_mark);
388              ~~~~~~~~~~~~~~~~~             ^~~~~~~~~~~~~~~~~~~~~
389print.c:646:45: warning: implicit conversion from enumeration type 'enum
390      iconv_ilseq_handler' to different enumeration type
391      'scm_t_string_failed_conversion_handler' [-Wenum-conversion]
392              display_character ('"', port, iconveh_question_mark);
393              ~~~~~~~~~~~~~~~~~             ^~~~~~~~~~~~~~~~~~~~~
394print.c:964:51: warning: implicit conversion from enumeration type 'enum
395      iconv_ilseq_handler' to different enumeration type
396      'scm_t_string_failed_conversion_handler' [-Wenum-conversion]
397        display_character (SCM_UNICODE_BOM, port, iconveh_error);
398        ~~~~~~~~~~~~~~~~~                         ^~~~~~~~~~~~~
399print.c:1096:43: warning: implicit conversion from enumeration type 'enum
400      iconv_ilseq_handler' to different enumeration type
401      'scm_t_string_failed_conversion_handler' [-Wenum-conversion]
402  return display_string (str, 0, 2, port, iconveh_error) == 2;
403         ~~~~~~~~~~~~~~                   ^~~~~~~~~~~~~
404print.c:1205:35: warning: implicit conversion from enumeration type 'enum
405      iconv_ilseq_handler' to different enumeration type
406      'scm_t_string_failed_conversion_handler' [-Wenum-conversion]
407          display_character ('\\', port, iconveh_question_mark);
408          ~~~~~~~~~~~~~~~~~              ^~~~~~~~~~~~~~~~~~~~~
409print.c:1211:35: warning: implicit conversion from enumeration type 'enum
410      iconv_ilseq_handler' to different enumeration type
411      'scm_t_string_failed_conversion_handler' [-Wenum-conversion]
412          display_character ('\\', port, iconveh_question_mark);
413          ~~~~~~~~~~~~~~~~~              ^~~~~~~~~~~~~~~~~~~~~
414print.c:1223:42: warning: implicit conversion from enumeration type 'enum
415      iconv_ilseq_handler' to different enumeration type
416      'scm_t_string_failed_conversion_handler' [-Wenum-conversion]
417      display_string ("#\\", 1, 2, port, iconveh_question_mark);
418      ~~~~~~~~~~~~~~                     ^~~~~~~~~~~~~~~~~~~~~
419print.c:1239:44: warning: implicit conversion from enumeration type 'enum
420      iconv_ilseq_handler' to different enumeration type
421      'scm_t_string_failed_conversion_handler' [-Wenum-conversion]
422    printed = display_character (ch, port, iconveh_error);
423              ~~~~~~~~~~~~~~~~~            ^~~~~~~~~~~~~
4248 warnings generated.
425  CC       libguile_2.0_la-procprop.lo
426  CC       libguile_2.0_la-procs.lo
427  CC       libguile_2.0_la-programs.lo
428  CC       libguile_2.0_la-promises.lo
429  CC       libguile_2.0_la-r6rs-ports.lo
430  CC       libguile_2.0_la-random.lo
431  CC       libguile_2.0_la-rdelim.lo
432  CC       libguile_2.0_la-read.lo
433  CC       libguile_2.0_la-root.lo
434  CC       libguile_2.0_la-rw.lo
435  CC       libguile_2.0_la-scmsigs.lo
436  CC       libguile_2.0_la-script.lo
437  CC       libguile_2.0_la-simpos.lo
438  CC       libguile_2.0_la-smob.lo
439  CC       libguile_2.0_la-sort.lo
440  CC       libguile_2.0_la-srcprop.lo
441  CC       libguile_2.0_la-srfi-1.lo
442  CC       libguile_2.0_la-srfi-4.lo
443  CC       libguile_2.0_la-srfi-13.lo
444  CC       libguile_2.0_la-srfi-14.lo
445  CC       libguile_2.0_la-srfi-60.lo
446  CC       libguile_2.0_la-stackchk.lo
447  CC       libguile_2.0_la-stacks.lo
448  CC       libguile_2.0_la-stime.lo
449  CC       libguile_2.0_la-strings.lo
450  CC       libguile_2.0_la-strorder.lo
451  CC       libguile_2.0_la-strports.lo
452  CC       libguile_2.0_la-struct.lo
453  CC       libguile_2.0_la-symbols.lo
454  CC       libguile_2.0_la-threads.lo
455  CC       libguile_2.0_la-throw.lo
456  CC       libguile_2.0_la-trees.lo
457  CC       libguile_2.0_la-uniform.lo
458  CC       libguile_2.0_la-values.lo
459  CC       libguile_2.0_la-variable.lo
460  CC       libguile_2.0_la-vectors.lo
461  CC       libguile_2.0_la-version.lo
462  CC       libguile_2.0_la-vm.lo
463  CC       libguile_2.0_la-vports.lo
464  CC       libguile_2.0_la-weaks.lo
465  CC       libguile_2.0_la-dynl.lo
466  CC       libguile_2.0_la-posix.lo
467posix.c:1488:21: warning: 'tmpnam' is deprecated: This function is provided for
468      compatibility reasons only. Due to security concerns inherent in the
469      design of tmpnam(3), it is highly recommended that you use mkstemp(3)
470      instead. [-Wdeprecated-declarations]
471  SCM_SYSCALL (rv = tmpnam (name));
472                    ^
473../libguile/_scm.h:119:7: note: expanded from macro 'SCM_SYSCALL'
474      line;                                     \
475      ^
476/usr/include/stdio.h:274:7: note: 'tmpnam' declared here
477char    *tmpnam(char *);
478         ^
4791 warning generated.
480  CC       libguile_2.0_la-net_db.lo
481  CC       libguile_2.0_la-socket.lo
482  CC       libguile_2.0_la-regex-posix.lo
483  CCLD     libguile-2.0.la
484ld: warning: directory not found for option '-L/Users/Shared/Applications/Programming/Lisp/guile/2.0.11/lib'
485/Applications/Xcode.app/Contents/Developer/Toolchains/XcodeDefault.xctoolchain/usr/bin/ranlib: file: .libs/libguile-2.0.a(libguile_2.0_la-null-threads.o) has no symbols
486/Applications/Xcode.app/Contents/Developer/Toolchains/XcodeDefault.xctoolchain/usr/bin/ranlib: file: .libs/libguile-2.0.a(binary-io.o) has no symbols
487/Applications/Xcode.app/Contents/Developer/Toolchains/XcodeDefault.xctoolchain/usr/bin/ranlib: file: .libs/libguile-2.0.a(fd-hook.o) has no symbols
488/Applications/Xcode.app/Contents/Developer/Toolchains/XcodeDefault.xctoolchain/usr/bin/ranlib: file: .libs/libguile-2.0.a(math.o) has no symbols
489/Applications/Xcode.app/Contents/Developer/Toolchains/XcodeDefault.xctoolchain/usr/bin/ranlib: file: .libs/libguile-2.0.a(stat-time.o) has no symbols
490/Applications/Xcode.app/Contents/Developer/Toolchains/XcodeDefault.xctoolchain/usr/bin/ranlib: file: .libs/libguile-2.0.a(sys_socket.o) has no symbols
491/Applications/Xcode.app/Contents/Developer/Toolchains/XcodeDefault.xctoolchain/usr/bin/ranlib: file: .libs/libguile-2.0.a(u8-mbtouc-unsafe.o) has no symbols
492/Applications/Xcode.app/Contents/Developer/Toolchains/XcodeDefault.xctoolchain/usr/bin/ranlib: file: .libs/libguile-2.0.a(u8-mbtouc.o) has no symbols
493/Applications/Xcode.app/Contents/Developer/Toolchains/XcodeDefault.xctoolchain/usr/bin/ranlib: file: .libs/libguile-2.0.a(unistd.o) has no symbols
494/Applications/Xcode.app/Contents/Developer/Toolchains/XcodeDefault.xctoolchain/usr/bin/ranlib: file: .libs/libguile-2.0.a(wctype-h.o) has no symbols
495/Applications/Xcode.app/Contents/Developer/Toolchains/XcodeDefault.xctoolchain/usr/bin/ranlib: file: .libs/libguile-2.0.a(xsize.o) has no symbols
496/Applications/Xcode.app/Contents/Developer/Toolchains/XcodeDefault.xctoolchain/usr/bin/ranlib: file: .libs/libguile-2.0.a(libguile_2.0_la-null-threads.o) has no symbols
497/Applications/Xcode.app/Contents/Developer/Toolchains/XcodeDefault.xctoolchain/usr/bin/ranlib: file: .libs/libguile-2.0.a(binary-io.o) has no symbols
498/Applications/Xcode.app/Contents/Developer/Toolchains/XcodeDefault.xctoolchain/usr/bin/ranlib: file: .libs/libguile-2.0.a(fd-hook.o) has no symbols
499/Applications/Xcode.app/Contents/Developer/Toolchains/XcodeDefault.xctoolchain/usr/bin/ranlib: file: .libs/libguile-2.0.a(math.o) has no symbols
500/Applications/Xcode.app/Contents/Developer/Toolchains/XcodeDefault.xctoolchain/usr/bin/ranlib: file: .libs/libguile-2.0.a(stat-time.o) has no symbols
501/Applications/Xcode.app/Contents/Developer/Toolchains/XcodeDefault.xctoolchain/usr/bin/ranlib: file: .libs/libguile-2.0.a(sys_socket.o) has no symbols
502/Applications/Xcode.app/Contents/Developer/Toolchains/XcodeDefault.xctoolchain/usr/bin/ranlib: file: .libs/libguile-2.0.a(u8-mbtouc-unsafe.o) has no symbols
503/Applications/Xcode.app/Contents/Developer/Toolchains/XcodeDefault.xctoolchain/usr/bin/ranlib: file: .libs/libguile-2.0.a(u8-mbtouc.o) has no symbols
504/Applications/Xcode.app/Contents/Developer/Toolchains/XcodeDefault.xctoolchain/usr/bin/ranlib: file: .libs/libguile-2.0.a(unistd.o) has no symbols
505/Applications/Xcode.app/Contents/Developer/Toolchains/XcodeDefault.xctoolchain/usr/bin/ranlib: file: .libs/libguile-2.0.a(wctype-h.o) has no symbols
506/Applications/Xcode.app/Contents/Developer/Toolchains/XcodeDefault.xctoolchain/usr/bin/ranlib: file: .libs/libguile-2.0.a(xsize.o) has no symbols
507  CC       guile-guile.o
508  CCLD     guile
509ld: warning: directory not found for option '-L/Users/Shared/Applications/Programming/Lisp/guile/2.0.11/lib'
510  GEN      c-tokenize.o
511  GEN      guile_filter_doc_snarfage
512  SNARF  alist.doc
513  SNARF  arbiters.doc
514  SNARF  array-handle.doc
515  SNARF  array-map.doc
516  SNARF  arrays.doc
517  SNARF  async.doc
518  SNARF  backtrace.doc
519  SNARF  boolean.doc
520  SNARF  bitvectors.doc
521  SNARF  bytevectors.doc
522  SNARF  chars.doc
523  SNARF  control.doc
524  SNARF  continuations.doc
525  SNARF  debug.doc
526  SNARF  deprecated.doc
527  SNARF  deprecation.doc
528  SNARF  dynl.doc
529  SNARF  dynwind.doc
530  SNARF  eq.doc
531  SNARF  error.doc
532  SNARF  eval.doc
533  SNARF  evalext.doc
534  SNARF  expand.doc
535  SNARF  extensions.doc
536  SNARF  feature.doc
537  SNARF  filesys.doc
538  SNARF  fluids.doc
539  SNARF  foreign.doc
540  SNARF  fports.doc
541  SNARF  gc-malloc.doc
542  SNARF  gc.doc
543  SNARF  gettext.doc
544  SNARF  generalized-arrays.doc
545  SNARF  generalized-vectors.doc
546  SNARF  goops.doc
547  SNARF  gsubr.doc
548  SNARF  guardians.doc
549  SNARF  hash.doc
550  SNARF  hashtab.doc
551  SNARF  hooks.doc
552  SNARF  i18n.doc
553  SNARF  init.doc
554  SNARF  ioext.doc
555  SNARF  keywords.doc
556  SNARF  list.doc
557  SNARF  load.doc
558  SNARF  macros.doc
559  SNARF  mallocs.doc
560  SNARF  memoize.doc
561memoize.c:515:***Mismatching FUNC_NAME.  Should be: `#define FUNC_NAME s_"@prompt"'
562  SNARF  modules.doc
563  SNARF  numbers.doc
564  SNARF  objprop.doc
565  SNARF  options.doc
566  SNARF  pairs.doc
567  SNARF  ports.doc
568  SNARF  print.doc
569  SNARF  procprop.doc
570  SNARF  procs.doc
571  SNARF  promises.doc
572  SNARF  r6rs-ports.doc
573  SNARF  random.doc
574  SNARF  rdelim.doc
575  SNARF  read.doc
576  SNARF  root.doc
577  SNARF  rw.doc
578  SNARF  scmsigs.doc
579  SNARF  script.doc
580  SNARF  simpos.doc
581  SNARF  smob.doc
582  SNARF  sort.doc
583  SNARF  srcprop.doc
584  SNARF  srfi-1.doc
585  SNARF  srfi-4.doc
586  SNARF  srfi-13.doc
587  SNARF  srfi-14.doc
588  SNARF  srfi-60.doc
589  SNARF  stackchk.doc
590  SNARF  stacks.doc
591  SNARF  stime.doc
592  SNARF  strings.doc
593  SNARF  strorder.doc
594  SNARF  strports.doc
595  SNARF  struct.doc
596  SNARF  symbols.doc
597  SNARF  threads.doc
598  SNARF  throw.doc
599  SNARF  trees.doc
600  SNARF  uniform.doc
601  SNARF  values.doc
602  SNARF  variable.doc
603  SNARF  vectors.doc
604  SNARF  version.doc
605  SNARF  vports.doc
606  SNARF  weaks.doc
607  SNARF  posix.doc
608  SNARF  net_db.doc
609  SNARF  socket.doc
610  SNARF  regex-posix.doc
611  GEN      guile-procedures.texi
612Making all in module
613  GUILEC ice-9/eval.go
614wrote `ice-9/eval.go'
615  GUILEC ice-9/psyntax-pp.go
616Backtrace:
617In ice-9/eval.scm:
618 484: 17 [eval # #]
619 481: 16 [lp (#<fluid 13>) (#<procedure 104c20230 at ice-9/eval.scm:264:7 %args>)]
620In unknown file:
621   ?: 15 [apply-smob/1 #<catch-closure 10486c800>]
622In ice-9/eval.scm:
623 484: 14 [eval # #]
624 432: 13 [eval # #]
625 387: 12 [eval # #]
626 432: 11 [eval # #]
627 387: 10 [eval # #]
628 481: 9 [lp (#<fluid 24>) ("")]
629 481: 8 [lp # #]
630 481: 7 [lp (#<fluid 26> #<fluid 27>) (little 8)]
631 481: 6 [lp (#<fluid 27>) (8)]
632 481: 5 [lp (#<fluid 1>) (relative)]
633 432: 4 [eval # #]
634 486: 3 [eval # #]
635 381: 2 [eval # #]
636In unknown file:
637   ?: 1 [#<variable 10469dd00 value: #<procedure #<variable 10469dd00 value: #<program 103fc5ac0>> (_ #:optional _)>> # ...]
638In ice-9/eval.scm:
639 481: 0 [lp (#<fluid 12>) ((#<catch-closure 10486c7c0>))]
640
641ice-9/eval.scm:481:19: make[2]: *** [ice-9/psyntax-pp.go] Error 1
642make[1]: *** [all-recursive] Error 1
643make: *** [all] Error 2