| 1 | version:1 |
|---|
| 2 | :msg:main ---> Computing dependencies for qt4-mac:info:main .:debug:main Searching for dependency: pkgconfig |
|---|
| 3 | :debug:main Found Dependency: receipt exists for pkgconfig |
|---|
| 4 | :debug:main Searching for dependency: zlib |
|---|
| 5 | :debug:main Found Dependency: receipt exists for zlib |
|---|
| 6 | :debug:main Searching for dependency: dbus |
|---|
| 7 | :debug:main Found Dependency: receipt exists for dbus |
|---|
| 8 | :debug:main Searching for dependency: openssl |
|---|
| 9 | :debug:main Found Dependency: receipt exists for openssl |
|---|
| 10 | :debug:main Searching for dependency: sqlite3 |
|---|
| 11 | :debug:main Found Dependency: receipt exists for sqlite3 |
|---|
| 12 | :debug:main Searching for dependency: tiff |
|---|
| 13 | :debug:main Found Dependency: receipt exists for tiff |
|---|
| 14 | :debug:main Searching for dependency: libpng |
|---|
| 15 | :debug:main Found Dependency: receipt exists for libpng |
|---|
| 16 | :debug:main Searching for dependency: libmng |
|---|
| 17 | :debug:main Found Dependency: receipt exists for libmng |
|---|
| 18 | :debug:main Searching for dependency: jpeg |
|---|
| 19 | :debug:main Found Dependency: receipt exists for jpeg |
|---|
| 20 | :msg:main |
|---|
| 21 | :debug:main Executing org.macports.main (qt4-mac) |
|---|
| 22 | :debug:main Skipping completed org.macports.fetch (qt4-mac) |
|---|
| 23 | :debug:main Skipping completed org.macports.checksum (qt4-mac) |
|---|
| 24 | :debug:main Skipping completed org.macports.extract (qt4-mac) |
|---|
| 25 | :debug:main Skipping completed org.macports.patch (qt4-mac) |
|---|
| 26 | :debug:main Skipping completed org.macports.configure (qt4-mac) |
|---|
| 27 | :msg:main ---> Building qt4-mac |
|---|
| 28 | :debug:build build phase started at Thu Jul 21 02:09:46 CEST 2011 |
|---|
| 29 | :debug:build Executing proc-pre-org.macports.build-build-0 |
|---|
| 30 | :debug:build Executing org.macports.build (qt4-mac) |
|---|
| 31 | :debug:build Environment: CPATH='/opt/local/include/dbus-1.0:/opt/local/lib/dbus-1.0/include:/opt/local/include' CC_PRINT_OPTIONS_FILE='/opt/local/var/macports/build/_opt_local_var_macports_sources_rsync.macports.org_release_ports_aqua_qt4-mac/work/.CC_PRINT_OPTIONS' QTDIR='/opt/local' LIBRARY_PATH='/opt/local/lib' CC_PRINT_OPTIONS='YES' MACOSX_DEPLOYMENT_TARGET='10.7' QMAKESPEC='macx-g++' MOC='/opt/local/bin/moc' QMAKE='/opt/local/bin/qmake' |
|---|
| 32 | :debug:build Assembled command: 'cd "/opt/local/var/macports/build/_opt_local_var_macports_sources_rsync.macports.org_release_ports_aqua_qt4-mac/work/qt-everywhere-opensource-src-4.7.3" && /usr/bin/make -j4 all' |
|---|
| 33 | :info:build cd src/tools/bootstrap/ && /usr/bin/make -f Makefile all |
|---|
| 34 | :info:build make[1]: Nothing to be done for `all'. |
|---|
| 35 | :info:build cd src/tools/moc/ && /usr/bin/make -f Makefile all |
|---|
| 36 | :info:build make[1]: Nothing to be done for `all'. |
|---|
| 37 | :info:build cd src/tools/rcc/ && /usr/bin/make -f Makefile all |
|---|
| 38 | :info:build make[1]: Nothing to be done for `all'. |
|---|
| 39 | :info:build cd src/tools/uic/ && /usr/bin/make -f Makefile all |
|---|
| 40 | :info:build make[1]: Nothing to be done for `all'. |
|---|
| 41 | :info:build cd src/corelib/ && /usr/bin/make -f Makefile all |
|---|
| 42 | :info:build /usr/bin/make -f Makefile.Release all |
|---|
| 43 | :info:build /usr/bin/make -f Makefile.Debug all |
|---|
| 44 | :info:build make[2]: Nothing to be done for `all'. |
|---|
| 45 | :info:build make[2]: Nothing to be done for `all'. |
|---|
| 46 | :info:build cd src/xml/ && /usr/bin/make -f Makefile all |
|---|
| 47 | :info:build /usr/bin/make -f Makefile.Release all |
|---|
| 48 | :info:build /usr/bin/make -f Makefile.Debug all |
|---|
| 49 | :info:build make[2]: Nothing to be done for `all'. |
|---|
| 50 | :info:build make[2]: Nothing to be done for `all'. |
|---|
| 51 | :info:build cd src/network/ && /usr/bin/make -f Makefile all |
|---|
| 52 | :info:build /usr/bin/make -f Makefile.Release all |
|---|
| 53 | :info:build /usr/bin/make -f Makefile.Debug all |
|---|
| 54 | :info:build make[2]: Nothing to be done for `all'. |
|---|
| 55 | :info:build make[2]: Nothing to be done for `all'. |
|---|
| 56 | :info:build cd src/sql/ && /usr/bin/make -f Makefile all |
|---|
| 57 | :info:build /usr/bin/make -f Makefile.Release all |
|---|
| 58 | :info:build /usr/bin/make -f Makefile.Debug all |
|---|
| 59 | :info:build make[2]: Nothing to be done for `all'. |
|---|
| 60 | :info:build make[2]: Nothing to be done for `all'. |
|---|
| 61 | :info:build cd src/testlib/ && /usr/bin/make -f Makefile all |
|---|
| 62 | :info:build /usr/bin/make -f Makefile.Release all |
|---|
| 63 | :info:build /usr/bin/make -f Makefile.Debug all |
|---|
| 64 | :info:build make[2]: Nothing to be done for `all'. |
|---|
| 65 | :info:build make[2]: Nothing to be done for `all'. |
|---|
| 66 | :info:build cd src/dbus/ && /usr/bin/make -f Makefile all |
|---|
| 67 | :info:build /usr/bin/make -f Makefile.Release all |
|---|
| 68 | :info:build /usr/bin/make -f Makefile.Debug all |
|---|
| 69 | :info:build make[2]: Nothing to be done for `all'. |
|---|
| 70 | :info:build make[2]: Nothing to be done for `all'. |
|---|
| 71 | :info:build cd src/gui/ && /usr/bin/make -f Makefile all |
|---|
| 72 | :info:build /usr/bin/make -f Makefile.Release all |
|---|
| 73 | :info:build /usr/bin/make -f Makefile.Debug all |
|---|
| 74 | :info:build /Developer/usr/bin/llvm-gcc-4.2 -c -pipe -Xarch_x86_64 -mmacosx-version-min=10.7 -fconstant-cfstrings -O2 -arch x86_64 -Xarch_x86_64 -mmacosx-version-min=10.7 -fvisibility=hidden -fvisibility-inlines-hidden -Wall -W -isysroot /Developer/SDKs/MacOSX10.7.sdk -DQT_SHARED -DQT_BUILD_GUI_LIB -DQT_NO_USING_NAMESPACE -DQT_NO_CAST_TO_ASCII -DQT_ASCII_CAST_WARNINGS -DQT3_SUPPORT -DQT_MOC_COMPAT -DQT_USE_FAST_OPERATOR_PLUS -DQT_USE_FAST_CONCATENATION -DQT_NO_CUPS -DQT_NO_LPR -DQT_NO_OPENTYPE -DQT_NO_STYLE_WINDOWSVISTA -DQT_NO_STYLE_WINDOWSXP -DQT_NO_STYLE_GTK -DQT_NO_STYLE_WINDOWSCE -DQT_NO_STYLE_WINDOWSMOBILE -DQT_NO_STYLE_S60 -DQ_INTERNAL_QAPP_SRC -DQT_NO_DEBUG -DQT_CORE_LIB -DQT_HAVE_MMX -DQT_HAVE_3DNOW -DQT_HAVE_SSE -DQT_HAVE_MMXEXT -DQT_HAVE_SSE2 -DQT_HAVE_SSE3 -DQT_HAVE_SSSE3 -DQT_HAVE_SSE4_1 -DQT_HAVE_SSE4_2 -D_LARGEFILE64_SOURCE -D_LARGEFILE_SOURCE -I../../mkspecs/macx-g++ -I. -I.moc/release-shared -I../../include/QtGui -I.rcc/release-shared -Iimage -I../3rdparty/harfbuzz/src -Idialogs -I../../include/QtCore -I../../include -I.uic/release-shared kernel/qsound_mac.mm -o .obj/release-shared/qsound_mac.o |
|---|
| 75 | :info:build /Developer/usr/bin/llvm-gcc-4.2 -c -pipe -Xarch_x86_64 -mmacosx-version-min=10.7 -fconstant-cfstrings -g -gdwarf-2 -arch x86_64 -Xarch_x86_64 -mmacosx-version-min=10.7 -fvisibility=hidden -fvisibility-inlines-hidden -Wall -W -isysroot /Developer/SDKs/MacOSX10.7.sdk -DQT_SHARED -DQT_BUILD_GUI_LIB -DQT_NO_USING_NAMESPACE -DQT_NO_CAST_TO_ASCII -DQT_ASCII_CAST_WARNINGS -DQT3_SUPPORT -DQT_MOC_COMPAT -DQT_USE_FAST_OPERATOR_PLUS -DQT_USE_FAST_CONCATENATION -DQT_NO_CUPS -DQT_NO_LPR -DQT_NO_OPENTYPE -DQT_NO_STYLE_WINDOWSVISTA -DQT_NO_STYLE_WINDOWSXP -DQT_NO_STYLE_GTK -DQT_NO_STYLE_WINDOWSCE -DQT_NO_STYLE_WINDOWSMOBILE -DQT_NO_STYLE_S60 -DQ_INTERNAL_QAPP_SRC -DQT_CORE_LIB -DQT_HAVE_MMX -DQT_HAVE_3DNOW -DQT_HAVE_SSE -DQT_HAVE_MMXEXT -DQT_HAVE_SSE2 -DQT_HAVE_SSE3 -DQT_HAVE_SSSE3 -DQT_HAVE_SSE4_1 -DQT_HAVE_SSE4_2 -D_LARGEFILE64_SOURCE -D_LARGEFILE_SOURCE -I../../mkspecs/macx-g++ -I. -I.moc/debug-shared -I../../include/QtGui -I.rcc/release-shared -Iimage -I../3rdparty/harfbuzz/src -Idialogs -I../../include/QtCore -I../../include -I.uic/release-shared kernel/qsound_mac.mm -o .obj/debug-shared/qsound_mac.o |
|---|
| 76 | :info:build /Developer/usr/bin/llvm-gcc-4.2 -c -pipe -Xarch_x86_64 -mmacosx-version-min=10.7 -fconstant-cfstrings -O2 -arch x86_64 -Xarch_x86_64 -mmacosx-version-min=10.7 -fvisibility=hidden -fvisibility-inlines-hidden -Wall -W -isysroot /Developer/SDKs/MacOSX10.7.sdk -DQT_SHARED -DQT_BUILD_GUI_LIB -DQT_NO_USING_NAMESPACE -DQT_NO_CAST_TO_ASCII -DQT_ASCII_CAST_WARNINGS -DQT3_SUPPORT -DQT_MOC_COMPAT -DQT_USE_FAST_OPERATOR_PLUS -DQT_USE_FAST_CONCATENATION -DQT_NO_CUPS -DQT_NO_LPR -DQT_NO_OPENTYPE -DQT_NO_STYLE_WINDOWSVISTA -DQT_NO_STYLE_WINDOWSXP -DQT_NO_STYLE_GTK -DQT_NO_STYLE_WINDOWSCE -DQT_NO_STYLE_WINDOWSMOBILE -DQT_NO_STYLE_S60 -DQ_INTERNAL_QAPP_SRC -DQT_NO_DEBUG -DQT_CORE_LIB -DQT_HAVE_MMX -DQT_HAVE_3DNOW -DQT_HAVE_SSE -DQT_HAVE_MMXEXT -DQT_HAVE_SSE2 -DQT_HAVE_SSE3 -DQT_HAVE_SSSE3 -DQT_HAVE_SSE4_1 -DQT_HAVE_SSE4_2 -D_LARGEFILE64_SOURCE -D_LARGEFILE_SOURCE -I../../mkspecs/macx-g++ -I. -I.moc/release-shared -I../../include/QtGui -I.rcc/release-shared -Iimage -I../3rdparty/harfbuzz/src -Idialogs -I../../include/QtCore -I../../include -I.uic/release-shared kernel/qcocoapanel_mac.mm -o .obj/release-shared/qcocoapanel_mac.o |
|---|
| 77 | :info:build /Developer/usr/bin/llvm-gcc-4.2 -c -pipe -Xarch_x86_64 -mmacosx-version-min=10.7 -fconstant-cfstrings -g -gdwarf-2 -arch x86_64 -Xarch_x86_64 -mmacosx-version-min=10.7 -fvisibility=hidden -fvisibility-inlines-hidden -Wall -W -isysroot /Developer/SDKs/MacOSX10.7.sdk -DQT_SHARED -DQT_BUILD_GUI_LIB -DQT_NO_USING_NAMESPACE -DQT_NO_CAST_TO_ASCII -DQT_ASCII_CAST_WARNINGS -DQT3_SUPPORT -DQT_MOC_COMPAT -DQT_USE_FAST_OPERATOR_PLUS -DQT_USE_FAST_CONCATENATION -DQT_NO_CUPS -DQT_NO_LPR -DQT_NO_OPENTYPE -DQT_NO_STYLE_WINDOWSVISTA -DQT_NO_STYLE_WINDOWSXP -DQT_NO_STYLE_GTK -DQT_NO_STYLE_WINDOWSCE -DQT_NO_STYLE_WINDOWSMOBILE -DQT_NO_STYLE_S60 -DQ_INTERNAL_QAPP_SRC -DQT_CORE_LIB -DQT_HAVE_MMX -DQT_HAVE_3DNOW -DQT_HAVE_SSE -DQT_HAVE_MMXEXT -DQT_HAVE_SSE2 -DQT_HAVE_SSE3 -DQT_HAVE_SSSE3 -DQT_HAVE_SSE4_1 -DQT_HAVE_SSE4_2 -D_LARGEFILE64_SOURCE -D_LARGEFILE_SOURCE -I../../mkspecs/macx-g++ -I. -I.moc/debug-shared -I../../include/QtGui -I.rcc/release-shared -Iimage -I../3rdparty/harfbuzz/src -Idialogs -I../../include/QtCore -I../../include -I.uic/release-shared kernel/qcocoapanel_mac.mm -o .obj/debug-shared/qcocoapanel_mac.o |
|---|
| 78 | :info:build In file included from ../../include/QtCore/qglobal.h:1, |
|---|
| 79 | :info:build from ../../include/QtGui/private/../../../src/gui/kernel/qmacdefines_mac.h:95, |
|---|
| 80 | :info:build from ../../include/QtGui/private/../../../src/gui/kernel/qcocoapanel_mac_p.h:53, |
|---|
| 81 | :info:build from ../../include/QtGui/private/qcocoapanel_mac_p.h:1, |
|---|
| 82 | :info:build from kernel/qcocoapanel_mac.mm:42: |
|---|
| 83 | :info:build ../../include/QtCore/../../src/corelib/global/qglobal.h:320:6: warning: #warning "This version of Mac OS X is unsupported" |
|---|
| 84 | :info:build In file included from ../../include/QtCore/qglobal.h:1, |
|---|
| 85 | :info:build from ../../include/QtGui/private/../../../src/gui/kernel/qmacdefines_mac.h:95, |
|---|
| 86 | :info:build from ../../include/QtGui/private/../../../src/gui/kernel/qcocoapanel_mac_p.h:53, |
|---|
| 87 | :info:build from ../../include/QtGui/private/qcocoapanel_mac_p.h:1, |
|---|
| 88 | :info:build from kernel/qcocoapanel_mac.mm:42: |
|---|
| 89 | :info:build ../../include/QtCore/../../src/corelib/global/qglobal.h:320:6: warning: #warning "This version of Mac OS X is unsupported" |
|---|
| 90 | :info:build In file included from ../../include/QtCore/qglobal.h:1, |
|---|
| 91 | :info:build from ../../include/QtCore/../../src/corelib/global/qnamespace.h:45, |
|---|
| 92 | :info:build from ../../include/QtCore/qnamespace.h:1, |
|---|
| 93 | :info:build from ../../include/QtCore/../../src/corelib/kernel/qobjectdefs.h:45, |
|---|
| 94 | :info:build from ../../include/QtCore/qobjectdefs.h:1, |
|---|
| 95 | :info:build from ../../include/QtCore/../../src/corelib/kernel/qobject.h:47, |
|---|
| 96 | :info:build from ../../include/QtCore/qobject.h:1, |
|---|
| 97 | :info:build from ../../include/QtCore/../../src/corelib/kernel/qcoreapplication.h:45, |
|---|
| 98 | :info:build from ../../include/QtCore/qcoreapplication.h:1, |
|---|
| 99 | :info:build from ../../include/QtGui/../../src/gui/kernel/qapplication.h:45, |
|---|
| 100 | :info:build from ../../include/QtGui/qapplication.h:1, |
|---|
| 101 | :info:build from kernel/qsound_mac.mm:41: |
|---|
| 102 | :info:build ../../include/QtCore/../../src/corelib/global/qglobal.h:320:6: warning: #warning "This version of Mac OS X is unsupported" |
|---|
| 103 | :info:build In file included from ../../include/QtCore/qglobal.h:1, |
|---|
| 104 | :info:build from ../../include/QtCore/../../src/corelib/global/qnamespace.h:45, |
|---|
| 105 | :info:build from ../../include/QtCore/qnamespace.h:1, |
|---|
| 106 | :info:build from ../../include/QtCore/../../src/corelib/kernel/qobjectdefs.h:45, |
|---|
| 107 | :info:build from ../../include/QtCore/qobjectdefs.h:1, |
|---|
| 108 | :info:build from ../../include/QtCore/../../src/corelib/kernel/qobject.h:47, |
|---|
| 109 | :info:build from ../../include/QtCore/qobject.h:1, |
|---|
| 110 | :info:build from ../../include/QtCore/../../src/corelib/kernel/qcoreapplication.h:45, |
|---|
| 111 | :info:build from ../../include/QtCore/qcoreapplication.h:1, |
|---|
| 112 | :info:build from ../../include/QtGui/../../src/gui/kernel/qapplication.h:45, |
|---|
| 113 | :info:build from ../../include/QtGui/qapplication.h:1, |
|---|
| 114 | :info:build from kernel/qsound_mac.mm:41: |
|---|
| 115 | :info:build ../../include/QtCore/../../src/corelib/global/qglobal.h:320:6: warning: #warning "This version of Mac OS X is unsupported" |
|---|
| 116 | :info:build In file included from kernel/qcocoapanel_mac.mm:66: |
|---|
| 117 | :info:build kernel/qcocoasharedwindowmethods_mac_p.h: In function 'NSDragOperation -[QCocoaPanel draggingEntered:](QCocoaPanel*, objc_selector*, objc_object*)': |
|---|
| 118 | :info:build kernel/qcocoasharedwindowmethods_mac_p.h:312: warning: 'NSPanel' may not respond to '-draggingEntered:' |
|---|
| 119 | :info:build kernel/qcocoasharedwindowmethods_mac_p.h:312: warning: (Messages without a matching method signature |
|---|
| 120 | :info:build kernel/qcocoasharedwindowmethods_mac_p.h:312: warning: will be assumed to return 'id' and accept |
|---|
| 121 | :info:build kernel/qcocoasharedwindowmethods_mac_p.h:312: warning: '...' as arguments.) |
|---|
| 122 | :info:build kernel/qcocoasharedwindowmethods_mac_p.h:312: error: invalid conversion from 'objc_object*' to 'NSDragOperation' |
|---|
| 123 | :info:build kernel/qcocoasharedwindowmethods_mac_p.h: In function 'NSDragOperation -[QCocoaPanel draggingUpdated:](QCocoaPanel*, objc_selector*, objc_object*)': |
|---|
| 124 | :info:build kernel/qcocoasharedwindowmethods_mac_p.h:324: warning: 'NSPanel' may not respond to '-draggingUpdated:' |
|---|
| 125 | :info:build kernel/qcocoasharedwindowmethods_mac_p.h:324: error: invalid conversion from 'objc_object*' to 'NSDragOperation' |
|---|
| 126 | :info:build kernel/qcocoasharedwindowmethods_mac_p.h: In function 'void -[QCocoaPanel draggingExited:](QCocoaPanel*, objc_selector*, objc_object*)': |
|---|
| 127 | :info:build kernel/qcocoasharedwindowmethods_mac_p.h:348: warning: 'NSPanel' may not respond to '-draggingExited:' |
|---|
| 128 | :info:build kernel/qcocoasharedwindowmethods_mac_p.h:348: error: return-statement with a value, in function returning 'void' |
|---|
| 129 | :info:build kernel/qcocoasharedwindowmethods_mac_p.h: In function 'BOOL -[QCocoaPanel performDragOperation:](QCocoaPanel*, objc_selector*, objc_object*)': |
|---|
| 130 | :info:build kernel/qcocoasharedwindowmethods_mac_p.h:360: warning: 'NSPanel' may not respond to '-performDragOperation:' |
|---|
| 131 | :info:build kernel/qcocoasharedwindowmethods_mac_p.h:360: error: invalid conversion from 'objc_object*' to 'BOOL' |
|---|
| 132 | :info:build kernel/qcocoasharedwindowmethods_mac_p.h: In function 'void -[QCocoaPanel drawRectSpecial:](QCocoaPanel*, objc_selector*, NSRect)': |
|---|
| 133 | :info:build kernel/qcocoasharedwindowmethods_mac_p.h:418: warning: 'QCocoaPanel' may not respond to '-drawRectOriginal:' |
|---|
| 134 | :info:build kernel/qcocoasharedwindowmethods_mac_p.h:419: warning: 'QCocoaPanel' may not respond to '-window' |
|---|
| 135 | :info:build /Developer/usr/bin/llvm-gcc-4.2 -c -pipe -Xarch_x86_64 -mmacosx-version-min=10.7 -fconstant-cfstrings -g -gdwarf-2 -arch x86_64 -Xarch_x86_64 -mmacosx-version-min=10.7 -fvisibility=hidden -fvisibility-inlines-hidden -Wall -W -isysroot /Developer/SDKs/MacOSX10.7.sdk -DQT_SHARED -DQT_BUILD_GUI_LIB -DQT_NO_USING_NAMESPACE -DQT_NO_CAST_TO_ASCII -DQT_ASCII_CAST_WARNINGS -DQT3_SUPPORT -DQT_MOC_COMPAT -DQT_USE_FAST_OPERATOR_PLUS -DQT_USE_FAST_CONCATENATION -DQT_NO_CUPS -DQT_NO_LPR -DQT_NO_OPENTYPE -DQT_NO_STYLE_WINDOWSVISTA -DQT_NO_STYLE_WINDOWSXP -DQT_NO_STYLE_GTK -DQT_NO_STYLE_WINDOWSCE -DQT_NO_STYLE_WINDOWSMOBILE -DQT_NO_STYLE_S60 -DQ_INTERNAL_QAPP_SRC -DQT_CORE_LIB -DQT_HAVE_MMX -DQT_HAVE_3DNOW -DQT_HAVE_SSE -DQT_HAVE_MMXEXT -DQT_HAVE_SSE2 -DQT_HAVE_SSE3 -DQT_HAVE_SSSE3 -DQT_HAVE_SSE4_1 -DQT_HAVE_SSE4_2 -D_LARGEFILE64_SOURCE -D_LARGEFILE_SOURCE -I../../mkspecs/macx-g++ -I. -I.moc/debug-shared -I../../include/QtGui -I.rcc/release-shared -Iimage -I../3rdparty/harfbuzz/src -Idialogs -I../../include/QtCore -I../../include -I.uic/release-shared kernel/qcocoaview_mac.mm -o .obj/debug-shared/qcocoaview_mac.o |
|---|
| 136 | :info:build make[2]: *** [.obj/debug-shared/qcocoapanel_mac.o] Error 1 |
|---|
| 137 | :info:build make[2]: *** Waiting for unfinished jobs.... |
|---|
| 138 | :info:build /Developer/usr/bin/llvm-gcc-4.2 -c -pipe -Xarch_x86_64 -mmacosx-version-min=10.7 -fconstant-cfstrings -O2 -arch x86_64 -Xarch_x86_64 -mmacosx-version-min=10.7 -fvisibility=hidden -fvisibility-inlines-hidden -Wall -W -isysroot /Developer/SDKs/MacOSX10.7.sdk -DQT_SHARED -DQT_BUILD_GUI_LIB -DQT_NO_USING_NAMESPACE -DQT_NO_CAST_TO_ASCII -DQT_ASCII_CAST_WARNINGS -DQT3_SUPPORT -DQT_MOC_COMPAT -DQT_USE_FAST_OPERATOR_PLUS -DQT_USE_FAST_CONCATENATION -DQT_NO_CUPS -DQT_NO_LPR -DQT_NO_OPENTYPE -DQT_NO_STYLE_WINDOWSVISTA -DQT_NO_STYLE_WINDOWSXP -DQT_NO_STYLE_GTK -DQT_NO_STYLE_WINDOWSCE -DQT_NO_STYLE_WINDOWSMOBILE -DQT_NO_STYLE_S60 -DQ_INTERNAL_QAPP_SRC -DQT_NO_DEBUG -DQT_CORE_LIB -DQT_HAVE_MMX -DQT_HAVE_3DNOW -DQT_HAVE_SSE -DQT_HAVE_MMXEXT -DQT_HAVE_SSE2 -DQT_HAVE_SSE3 -DQT_HAVE_SSSE3 -DQT_HAVE_SSE4_1 -DQT_HAVE_SSE4_2 -D_LARGEFILE64_SOURCE -D_LARGEFILE_SOURCE -I../../mkspecs/macx-g++ -I. -I.moc/release-shared -I../../include/QtGui -I.rcc/release-shared -Iimage -I../3rdparty/harfbuzz/src -Idialogs -I../../include/QtCore -I../../include -I.uic/release-shared kernel/qcocoawindow_mac.mm -o .obj/release-shared/qcocoawindow_mac.o |
|---|
| 139 | :info:build In file included from ../../include/QtCore/qglobal.h:1, |
|---|
| 140 | :info:build from kernel/qmacdefines_mac.h:95, |
|---|
| 141 | :info:build from kernel/qcocoawindow_mac.mm:42: |
|---|
| 142 | :info:build ../../include/QtCore/../../src/corelib/global/qglobal.h:320:6: warning: #warning "This version of Mac OS X is unsupported" |
|---|
| 143 | :info:build /Developer/usr/bin/llvm-gcc-4.2 -c -pipe -Xarch_x86_64 -mmacosx-version-min=10.7 -fconstant-cfstrings -O2 -arch x86_64 -Xarch_x86_64 -mmacosx-version-min=10.7 -fvisibility=hidden -fvisibility-inlines-hidden -Wall -W -isysroot /Developer/SDKs/MacOSX10.7.sdk -DQT_SHARED -DQT_BUILD_GUI_LIB -DQT_NO_USING_NAMESPACE -DQT_NO_CAST_TO_ASCII -DQT_ASCII_CAST_WARNINGS -DQT3_SUPPORT -DQT_MOC_COMPAT -DQT_USE_FAST_OPERATOR_PLUS -DQT_USE_FAST_CONCATENATION -DQT_NO_CUPS -DQT_NO_LPR -DQT_NO_OPENTYPE -DQT_NO_STYLE_WINDOWSVISTA -DQT_NO_STYLE_WINDOWSXP -DQT_NO_STYLE_GTK -DQT_NO_STYLE_WINDOWSCE -DQT_NO_STYLE_WINDOWSMOBILE -DQT_NO_STYLE_S60 -DQ_INTERNAL_QAPP_SRC -DQT_NO_DEBUG -DQT_CORE_LIB -DQT_HAVE_MMX -DQT_HAVE_3DNOW -DQT_HAVE_SSE -DQT_HAVE_MMXEXT -DQT_HAVE_SSE2 -DQT_HAVE_SSE3 -DQT_HAVE_SSSE3 -DQT_HAVE_SSE4_1 -DQT_HAVE_SSE4_2 -D_LARGEFILE64_SOURCE -D_LARGEFILE_SOURCE -I../../mkspecs/macx-g++ -I. -I.moc/release-shared -I../../include/QtGui -I.rcc/release-shared -Iimage -I../3rdparty/harfbuzz/src -Idialogs -I../../include/QtCore -I../../include -I.uic/release-shared kernel/qcocoawindowdelegate_mac.mm -o .obj/release-shared/qcocoawindowdelegate_mac.o |
|---|
| 144 | :info:build In file included from ../../include/QtCore/qglobal.h:1, |
|---|
| 145 | :info:build from ../../include/QtCore/../../src/corelib/global/qnamespace.h:45, |
|---|
| 146 | :info:build from ../../include/QtCore/qnamespace.h:1, |
|---|
| 147 | :info:build from ../../include/QtCore/../../src/corelib/kernel/qobjectdefs.h:45, |
|---|
| 148 | :info:build from ../../include/QtCore/qobjectdefs.h:1, |
|---|
| 149 | :info:build from ../../include/QtGui/../../src/gui/kernel/qwindowdefs.h:45, |
|---|
| 150 | :info:build from ../../include/QtGui/qwindowdefs.h:1, |
|---|
| 151 | :info:build from ../../include/QtGui/../../src/gui/kernel/qevent.h:45, |
|---|
| 152 | :info:build from ../../include/QtGui/qevent.h:1, |
|---|
| 153 | :info:build from ../../include/QtGui/private/../../../src/gui/kernel/qcocoaview_mac_p.h:53, |
|---|
| 154 | :info:build from ../../include/QtGui/private/qcocoaview_mac_p.h:1, |
|---|
| 155 | :info:build from kernel/qcocoaview_mac.mm:42: |
|---|
| 156 | :info:build ../../include/QtCore/../../src/corelib/global/qglobal.h:320:6: warning: #warning "This version of Mac OS X is unsupported" |
|---|
| 157 | :info:build In file included from ../../include/QtCore/qglobal.h:1, |
|---|
| 158 | :info:build from ../../include/QtGui/private/../../../src/gui/kernel/qmacdefines_mac.h:95, |
|---|
| 159 | :info:build from ../../include/QtGui/private/../../../src/gui/kernel/qcocoawindowdelegate_mac_p.h:53, |
|---|
| 160 | :info:build from ../../include/QtGui/private/qcocoawindowdelegate_mac_p.h:1, |
|---|
| 161 | :info:build from kernel/qcocoawindowdelegate_mac.mm:42: |
|---|
| 162 | :info:build ../../include/QtCore/../../src/corelib/global/qglobal.h:320:6: warning: #warning "This version of Mac OS X is unsupported" |
|---|
| 163 | :info:build In file included from kernel/qcocoapanel_mac.mm:66: |
|---|
| 164 | :info:build kernel/qcocoasharedwindowmethods_mac_p.h: In function 'NSDragOperation -[QCocoaPanel draggingEntered:](QCocoaPanel*, objc_selector*, objc_object*)': |
|---|
| 165 | :info:build kernel/qcocoasharedwindowmethods_mac_p.h:312: warning: 'NSPanel' may not respond to '-draggingEntered:' |
|---|
| 166 | :info:build kernel/qcocoasharedwindowmethods_mac_p.h:312: warning: (Messages without a matching method signature |
|---|
| 167 | :info:build kernel/qcocoasharedwindowmethods_mac_p.h:312: warning: will be assumed to return 'id' and accept |
|---|
| 168 | :info:build kernel/qcocoasharedwindowmethods_mac_p.h:312: warning: '...' as arguments.) |
|---|
| 169 | :info:build kernel/qcocoasharedwindowmethods_mac_p.h:312: error: invalid conversion from 'objc_object*' to 'NSDragOperation' |
|---|
| 170 | :info:build kernel/qcocoasharedwindowmethods_mac_p.h: In function 'NSDragOperation -[QCocoaPanel draggingUpdated:](QCocoaPanel*, objc_selector*, objc_object*)': |
|---|
| 171 | :info:build kernel/qcocoasharedwindowmethods_mac_p.h:324: warning: 'NSPanel' may not respond to '-draggingUpdated:' |
|---|
| 172 | :info:build kernel/qcocoasharedwindowmethods_mac_p.h:324: error: invalid conversion from 'objc_object*' to 'NSDragOperation' |
|---|
| 173 | :info:build kernel/qcocoasharedwindowmethods_mac_p.h: In function 'void -[QCocoaPanel draggingExited:](QCocoaPanel*, objc_selector*, objc_object*)': |
|---|
| 174 | :info:build kernel/qcocoasharedwindowmethods_mac_p.h:348: warning: 'NSPanel' may not respond to '-draggingExited:' |
|---|
| 175 | :info:build kernel/qcocoasharedwindowmethods_mac_p.h:348: error: return-statement with a value, in function returning 'void' |
|---|
| 176 | :info:build kernel/qcocoasharedwindowmethods_mac_p.h: In function 'BOOL -[QCocoaPanel performDragOperation:](QCocoaPanel*, objc_selector*, objc_object*)': |
|---|
| 177 | :info:build kernel/qcocoasharedwindowmethods_mac_p.h:360: warning: 'NSPanel' may not respond to '-performDragOperation:' |
|---|
| 178 | :info:build kernel/qcocoasharedwindowmethods_mac_p.h:360: error: invalid conversion from 'objc_object*' to 'BOOL' |
|---|
| 179 | :info:build kernel/qcocoasharedwindowmethods_mac_p.h: In function 'void -[QCocoaPanel drawRectSpecial:](QCocoaPanel*, objc_selector*, NSRect)': |
|---|
| 180 | :info:build kernel/qcocoasharedwindowmethods_mac_p.h:418: warning: 'QCocoaPanel' may not respond to '-drawRectOriginal:' |
|---|
| 181 | :info:build kernel/qcocoasharedwindowmethods_mac_p.h:419: warning: 'QCocoaPanel' may not respond to '-window' |
|---|
| 182 | :info:build make[2]: *** [.obj/release-shared/qcocoapanel_mac.o] Error 1 |
|---|
| 183 | :info:build make[2]: *** Waiting for unfinished jobs.... |
|---|
| 184 | :info:build In file included from kernel/qcocoawindow_mac.mm:85: |
|---|
| 185 | :info:build kernel/qcocoasharedwindowmethods_mac_p.h: In function 'NSDragOperation -[QCocoaWindow draggingEntered:](QCocoaWindow*, objc_selector*, objc_object*)': |
|---|
| 186 | :info:build kernel/qcocoasharedwindowmethods_mac_p.h:312: warning: 'NSWindow' may not respond to '-draggingEntered:' |
|---|
| 187 | :info:build kernel/qcocoasharedwindowmethods_mac_p.h:312: warning: (Messages without a matching method signature |
|---|
| 188 | :info:build kernel/qcocoasharedwindowmethods_mac_p.h:312: warning: will be assumed to return 'id' and accept |
|---|
| 189 | :info:build kernel/qcocoasharedwindowmethods_mac_p.h:312: warning: '...' as arguments.) |
|---|
| 190 | :info:build kernel/qcocoasharedwindowmethods_mac_p.h:312: error: invalid conversion from 'objc_object*' to 'NSDragOperation' |
|---|
| 191 | :info:build kernel/qcocoasharedwindowmethods_mac_p.h: In function 'NSDragOperation -[QCocoaWindow draggingUpdated:](QCocoaWindow*, objc_selector*, objc_object*)': |
|---|
| 192 | :info:build kernel/qcocoasharedwindowmethods_mac_p.h:324: warning: 'NSWindow' may not respond to '-draggingUpdated:' |
|---|
| 193 | :info:build kernel/qcocoasharedwindowmethods_mac_p.h:324: error: invalid conversion from 'objc_object*' to 'NSDragOperation' |
|---|
| 194 | :info:build kernel/qcocoasharedwindowmethods_mac_p.h: In function 'void -[QCocoaWindow draggingExited:](QCocoaWindow*, objc_selector*, objc_object*)': |
|---|
| 195 | :info:build kernel/qcocoasharedwindowmethods_mac_p.h:348: warning: 'NSWindow' may not respond to '-draggingExited:' |
|---|
| 196 | :info:build kernel/qcocoasharedwindowmethods_mac_p.h:348: error: return-statement with a value, in function returning 'void' |
|---|
| 197 | :info:build kernel/qcocoasharedwindowmethods_mac_p.h: In function 'BOOL -[QCocoaWindow performDragOperation:](QCocoaWindow*, objc_selector*, objc_object*)': |
|---|
| 198 | :info:build kernel/qcocoasharedwindowmethods_mac_p.h:360: warning: 'NSWindow' may not respond to '-performDragOperation:' |
|---|
| 199 | :info:build kernel/qcocoasharedwindowmethods_mac_p.h:360: error: invalid conversion from 'objc_object*' to 'BOOL' |
|---|
| 200 | :info:build kernel/qcocoasharedwindowmethods_mac_p.h: In function 'void -[QCocoaWindow drawRectSpecial:](QCocoaWindow*, objc_selector*, NSRect)': |
|---|
| 201 | :info:build kernel/qcocoasharedwindowmethods_mac_p.h:418: warning: 'QCocoaWindow' may not respond to '-drawRectOriginal:' |
|---|
| 202 | :info:build kernel/qcocoasharedwindowmethods_mac_p.h:419: warning: 'QCocoaWindow' may not respond to '-window' |
|---|
| 203 | :info:build make[2]: *** [.obj/release-shared/qcocoawindow_mac.o] Error 1 |
|---|
| 204 | :info:build make[1]: *** [release-all] Error 2 |
|---|
| 205 | :info:build make[1]: *** Waiting for unfinished jobs.... |
|---|
| 206 | :info:build make[1]: *** [debug-all] Error 2 |
|---|
| 207 | :info:build make: *** [sub-gui-all-ordered] Error 2 |
|---|
| 208 | :info:build shell command " cd "/opt/local/var/macports/build/_opt_local_var_macports_sources_rsync.macports.org_release_ports_aqua_qt4-mac/work/qt-everywhere-opensource-src-4.7.3" && /usr/bin/make -j4 all " returned error 2 |
|---|
| 209 | :error:build Target org.macports.build returned: shell command failed (see log for details) |
|---|
| 210 | :debug:build Backtrace: shell command failed (see log for details) |
|---|
| 211 | while executing |
|---|
| 212 | "command_exec build" |
|---|
| 213 | (procedure "portbuild::build_main" line 8) |
|---|
| 214 | invoked from within |
|---|
| 215 | "$procedure $targetname" |
|---|
| 216 | :info:build Warning: the following items did not execute (for qt4-mac): org.macports.destroot org.macports.build |
|---|
| 217 | :notice:build Log for qt4-mac is at: /opt/local/var/macports/logs/_opt_local_var_macports_sources_rsync.macports.org_release_ports_aqua_qt4-mac/main.log |
|---|