Ticket #30363: upgrade_soprano-2.6.52_main.log

File upgrade_soprano-2.6.52_main.log, 44.0 KB (added by martinhennemann@…, 10 years ago)

build log for soprano

Line 
1version:1
2:msg:main --->  Computing dependencies for soprano:info:main .:debug:main Searching for dependency: git-core
3:debug:main Found Dependency: receipt exists for git-core
4:debug:main Searching for dependency: cmake
5:debug:main Found Dependency: receipt exists for cmake
6:debug:main Searching for dependency: pkgconfig
7:debug:main Found Dependency: receipt exists for pkgconfig
8:debug:main Searching for dependency: automoc
9:debug:main Found Dependency: receipt exists for automoc
10:debug:main Searching for dependency: qt4-mac
11:debug:main Found Dependency: receipt exists for qt4-mac
12:debug:main Searching for dependency: phonon
13:debug:main Found Dependency: receipt exists for phonon
14:debug:main Searching for dependency: clucene
15:debug:main Found Dependency: receipt exists for clucene
16:debug:main Searching for dependency: strigi
17:debug:main Found Dependency: receipt exists for strigi
18:debug:main Searching for dependency: raptor2
19:debug:main Found Dependency: receipt exists for raptor2
20:debug:main Searching for dependency: redland
21:debug:main Found Dependency: receipt exists for redland
22:debug:main Searching for dependency: libiodbc
23:debug:main Found Dependency: receipt exists for libiodbc
24:debug:main Searching for dependency: virtuoso
25:debug:main Found Dependency: receipt exists for virtuoso
26:msg:main
27:debug:main Executing org.macports.main (soprano)
28:debug:main Skipping completed org.macports.archivefetch (soprano)
29:debug:main Skipping completed org.macports.fetch (soprano)
30:debug:main Skipping completed org.macports.checksum (soprano)
31:debug:main Skipping completed org.macports.extract (soprano)
32:debug:main Skipping completed org.macports.patch (soprano)
33:debug:main Skipping completed org.macports.configure (soprano)
34:debug:build build phase started at Mon Jul 25 16:39:57 CEST 2011
35:notice:build --->  Building soprano
36:debug:build Executing org.macports.build (soprano)
37:debug:build Environment: CPATH='/opt/local/include' CC_PRINT_OPTIONS_FILE='/opt/local/var/macports/build/_opt_local_var_macports_sources_rsync.macports.org_release_ports_devel_soprano/soprano/work/.CC_PRINT_OPTIONS' QTDIR='/opt/local' LIBRARY_PATH='/opt/local/lib' CC_PRINT_OPTIONS='YES' MACOSX_DEPLOYMENT_TARGET='10.6' QMAKESPEC='macx-g++' MOC='/opt/local/bin/moc' QMAKE='/opt/local/bin/qmake'
38:debug:build Assembled command: 'cd "/opt/local/var/macports/build/_opt_local_var_macports_sources_rsync.macports.org_release_ports_devel_soprano/soprano/work/build" && /usr/bin/make -j2 -w all'
39:debug:build Executing command line:  cd "/opt/local/var/macports/build/_opt_local_var_macports_sources_rsync.macports.org_release_ports_devel_soprano/soprano/work/build" && /usr/bin/make -j2 -w all
40:info:build make: Entering directory `/opt/local/var/macports/build/_opt_local_var_macports_sources_rsync.macports.org_release_ports_devel_soprano/soprano/work/build'
41:info:build /opt/local/bin/cmake -H/opt/local/var/macports/build/_opt_local_var_macports_sources_rsync.macports.org_release_ports_devel_soprano/soprano/work/soprano-2.6.52 -B/opt/local/var/macports/build/_opt_local_var_macports_sources_rsync.macports.org_release_ports_devel_soprano/soprano/work/build --check-build-system CMakeFiles/Makefile.cmake 0
42:info:build /opt/local/bin/cmake -E cmake_progress_start /opt/local/var/macports/build/_opt_local_var_macports_sources_rsync.macports.org_release_ports_devel_soprano/soprano/work/build/CMakeFiles /opt/local/var/macports/build/_opt_local_var_macports_sources_rsync.macports.org_release_ports_devel_soprano/soprano/work/build/CMakeFiles/progress.marks
43:info:build /usr/bin/make -f CMakeFiles/Makefile2 all
44:info:build make[1]: Entering directory `/opt/local/var/macports/build/_opt_local_var_macports_sources_rsync.macports.org_release_ports_devel_soprano/soprano/work/build'
45:info:build /usr/bin/make -f soprano/CMakeFiles/soprano.dir/build.make soprano/CMakeFiles/soprano.dir/depend
46:info:build make[2]: Entering directory `/opt/local/var/macports/build/_opt_local_var_macports_sources_rsync.macports.org_release_ports_devel_soprano/soprano/work/build'
47:info:build cd /opt/local/var/macports/build/_opt_local_var_macports_sources_rsync.macports.org_release_ports_devel_soprano/soprano/work/build && /opt/local/bin/cmake -E cmake_depends "Unix Makefiles" /opt/local/var/macports/build/_opt_local_var_macports_sources_rsync.macports.org_release_ports_devel_soprano/soprano/work/soprano-2.6.52 /opt/local/var/macports/build/_opt_local_var_macports_sources_rsync.macports.org_release_ports_devel_soprano/soprano/work/soprano-2.6.52/soprano /opt/local/var/macports/build/_opt_local_var_macports_sources_rsync.macports.org_release_ports_devel_soprano/soprano/work/build /opt/local/var/macports/build/_opt_local_var_macports_sources_rsync.macports.org_release_ports_devel_soprano/soprano/work/build/soprano /opt/local/var/macports/build/_opt_local_var_macports_sources_rsync.macports.org_release_ports_devel_soprano/soprano/work/build/soprano/CMakeFiles/soprano.dir/DependInfo.cmake --color=
48:info:build make[2]: Leaving directory `/opt/local/var/macports/build/_opt_local_var_macports_sources_rsync.macports.org_release_ports_devel_soprano/soprano/work/build'
49:info:build /usr/bin/make -f soprano/CMakeFiles/soprano.dir/build.make soprano/CMakeFiles/soprano.dir/build
50:info:build make[2]: Entering directory `/opt/local/var/macports/build/_opt_local_var_macports_sources_rsync.macports.org_release_ports_devel_soprano/soprano/work/build'
51:info:build make[2]: Nothing to be done for `soprano/CMakeFiles/soprano.dir/build'.
52:info:build make[2]: Leaving directory `/opt/local/var/macports/build/_opt_local_var_macports_sources_rsync.macports.org_release_ports_devel_soprano/soprano/work/build'
53:info:build /opt/local/bin/cmake -E cmake_progress_report /opt/local/var/macports/build/_opt_local_var_macports_sources_rsync.macports.org_release_ports_devel_soprano/soprano/work/build/CMakeFiles  1 2 3 4 5 6 7 8 9 10 11 12 13 14 15 16 17 18 19 20 21 22 23 24 25 26 27 28 29 30 31 32 33 34 35 36
54:info:build [ 36%] Built target soprano
55:info:build /usr/bin/make -f index/CMakeFiles/sopranoindex.dir/build.make index/CMakeFiles/sopranoindex.dir/depend
56:info:build /usr/bin/make -f backends/redland/CMakeFiles/soprano_redlandcore.dir/build.make backends/redland/CMakeFiles/soprano_redlandcore.dir/depend
57:info:build make[2]: Entering directory `/opt/local/var/macports/build/_opt_local_var_macports_sources_rsync.macports.org_release_ports_devel_soprano/soprano/work/build'
58:info:build cd /opt/local/var/macports/build/_opt_local_var_macports_sources_rsync.macports.org_release_ports_devel_soprano/soprano/work/build && /opt/local/bin/cmake -E cmake_depends "Unix Makefiles" /opt/local/var/macports/build/_opt_local_var_macports_sources_rsync.macports.org_release_ports_devel_soprano/soprano/work/soprano-2.6.52 /opt/local/var/macports/build/_opt_local_var_macports_sources_rsync.macports.org_release_ports_devel_soprano/soprano/work/soprano-2.6.52/backends/redland /opt/local/var/macports/build/_opt_local_var_macports_sources_rsync.macports.org_release_ports_devel_soprano/soprano/work/build /opt/local/var/macports/build/_opt_local_var_macports_sources_rsync.macports.org_release_ports_devel_soprano/soprano/work/build/backends/redland /opt/local/var/macports/build/_opt_local_var_macports_sources_rsync.macports.org_release_ports_devel_soprano/soprano/work/build/backends/redland/CMakeFiles/soprano_redlandcore.dir/DependInfo.cmake --color=
59:info:build make[2]: Entering directory `/opt/local/var/macports/build/_opt_local_var_macports_sources_rsync.macports.org_release_ports_devel_soprano/soprano/work/build'
60:info:build cd /opt/local/var/macports/build/_opt_local_var_macports_sources_rsync.macports.org_release_ports_devel_soprano/soprano/work/build && /opt/local/bin/cmake -E cmake_depends "Unix Makefiles" /opt/local/var/macports/build/_opt_local_var_macports_sources_rsync.macports.org_release_ports_devel_soprano/soprano/work/soprano-2.6.52 /opt/local/var/macports/build/_opt_local_var_macports_sources_rsync.macports.org_release_ports_devel_soprano/soprano/work/soprano-2.6.52/index /opt/local/var/macports/build/_opt_local_var_macports_sources_rsync.macports.org_release_ports_devel_soprano/soprano/work/build /opt/local/var/macports/build/_opt_local_var_macports_sources_rsync.macports.org_release_ports_devel_soprano/soprano/work/build/index /opt/local/var/macports/build/_opt_local_var_macports_sources_rsync.macports.org_release_ports_devel_soprano/soprano/work/build/index/CMakeFiles/sopranoindex.dir/DependInfo.cmake --color=
61:info:build make[2]: Leaving directory `/opt/local/var/macports/build/_opt_local_var_macports_sources_rsync.macports.org_release_ports_devel_soprano/soprano/work/build'
62:info:build /usr/bin/make -f backends/redland/CMakeFiles/soprano_redlandcore.dir/build.make backends/redland/CMakeFiles/soprano_redlandcore.dir/build
63:info:build make[2]: Entering directory `/opt/local/var/macports/build/_opt_local_var_macports_sources_rsync.macports.org_release_ports_devel_soprano/soprano/work/build'
64:info:build make[2]: Nothing to be done for `backends/redland/CMakeFiles/soprano_redlandcore.dir/build'.
65:info:build make[2]: Leaving directory `/opt/local/var/macports/build/_opt_local_var_macports_sources_rsync.macports.org_release_ports_devel_soprano/soprano/work/build'
66:info:build /opt/local/bin/cmake -E cmake_progress_report /opt/local/var/macports/build/_opt_local_var_macports_sources_rsync.macports.org_release_ports_devel_soprano/soprano/work/build/CMakeFiles  42 43
67:info:build make[2]: Leaving directory `/opt/local/var/macports/build/_opt_local_var_macports_sources_rsync.macports.org_release_ports_devel_soprano/soprano/work/build'
68:info:build /usr/bin/make -f index/CMakeFiles/sopranoindex.dir/build.make index/CMakeFiles/sopranoindex.dir/build
69:info:build [ 38%] Built target soprano_redlandcore
70:info:build /usr/bin/make -f backends/sesame2/CMakeFiles/soprano_sesame2backend.dir/build.make backends/sesame2/CMakeFiles/soprano_sesame2backend.dir/depend
71:info:build make[2]: Entering directory `/opt/local/var/macports/build/_opt_local_var_macports_sources_rsync.macports.org_release_ports_devel_soprano/soprano/work/build'
72:info:build cd /opt/local/var/macports/build/_opt_local_var_macports_sources_rsync.macports.org_release_ports_devel_soprano/soprano/work/build && /opt/local/bin/cmake -E cmake_depends "Unix Makefiles" /opt/local/var/macports/build/_opt_local_var_macports_sources_rsync.macports.org_release_ports_devel_soprano/soprano/work/soprano-2.6.52 /opt/local/var/macports/build/_opt_local_var_macports_sources_rsync.macports.org_release_ports_devel_soprano/soprano/work/soprano-2.6.52/backends/sesame2 /opt/local/var/macports/build/_opt_local_var_macports_sources_rsync.macports.org_release_ports_devel_soprano/soprano/work/build /opt/local/var/macports/build/_opt_local_var_macports_sources_rsync.macports.org_release_ports_devel_soprano/soprano/work/build/backends/sesame2 /opt/local/var/macports/build/_opt_local_var_macports_sources_rsync.macports.org_release_ports_devel_soprano/soprano/work/build/backends/sesame2/CMakeFiles/soprano_sesame2backend.dir/DependInfo.cmake --color=
73:info:build make[2]: Entering directory `/opt/local/var/macports/build/_opt_local_var_macports_sources_rsync.macports.org_release_ports_devel_soprano/soprano/work/build'
74:info:build make[2]: Nothing to be done for `index/CMakeFiles/sopranoindex.dir/build'.
75:info:build make[2]: Leaving directory `/opt/local/var/macports/build/_opt_local_var_macports_sources_rsync.macports.org_release_ports_devel_soprano/soprano/work/build'
76:info:build /opt/local/bin/cmake -E cmake_progress_report /opt/local/var/macports/build/_opt_local_var_macports_sources_rsync.macports.org_release_ports_devel_soprano/soprano/work/build/CMakeFiles  83 84 85 86
77:info:build [ 42%] Built target sopranoindex
78:info:build /usr/bin/make -f backends/virtuoso/CMakeFiles/soprano_virtuosobackend.dir/build.make backends/virtuoso/CMakeFiles/soprano_virtuosobackend.dir/depend
79:info:build make[2]: Entering directory `/opt/local/var/macports/build/_opt_local_var_macports_sources_rsync.macports.org_release_ports_devel_soprano/soprano/work/build'
80:info:build cd /opt/local/var/macports/build/_opt_local_var_macports_sources_rsync.macports.org_release_ports_devel_soprano/soprano/work/build && /opt/local/bin/cmake -E cmake_depends "Unix Makefiles" /opt/local/var/macports/build/_opt_local_var_macports_sources_rsync.macports.org_release_ports_devel_soprano/soprano/work/soprano-2.6.52 /opt/local/var/macports/build/_opt_local_var_macports_sources_rsync.macports.org_release_ports_devel_soprano/soprano/work/soprano-2.6.52/backends/virtuoso /opt/local/var/macports/build/_opt_local_var_macports_sources_rsync.macports.org_release_ports_devel_soprano/soprano/work/build /opt/local/var/macports/build/_opt_local_var_macports_sources_rsync.macports.org_release_ports_devel_soprano/soprano/work/build/backends/virtuoso /opt/local/var/macports/build/_opt_local_var_macports_sources_rsync.macports.org_release_ports_devel_soprano/soprano/work/build/backends/virtuoso/CMakeFiles/soprano_virtuosobackend.dir/DependInfo.cmake --color=
81:info:build make[2]: Leaving directory `/opt/local/var/macports/build/_opt_local_var_macports_sources_rsync.macports.org_release_ports_devel_soprano/soprano/work/build'
82:info:build /usr/bin/make -f backends/sesame2/CMakeFiles/soprano_sesame2backend.dir/build.make backends/sesame2/CMakeFiles/soprano_sesame2backend.dir/build
83:info:build make[2]: Entering directory `/opt/local/var/macports/build/_opt_local_var_macports_sources_rsync.macports.org_release_ports_devel_soprano/soprano/work/build'
84:info:build make[2]: Nothing to be done for `backends/sesame2/CMakeFiles/soprano_sesame2backend.dir/build'.
85:info:build make[2]: Leaving directory `/opt/local/var/macports/build/_opt_local_var_macports_sources_rsync.macports.org_release_ports_devel_soprano/soprano/work/build'
86:info:build /opt/local/bin/cmake -E cmake_progress_report /opt/local/var/macports/build/_opt_local_var_macports_sources_rsync.macports.org_release_ports_devel_soprano/soprano/work/build/CMakeFiles  44 45 46 47 48 49 50 51
87:info:build make[2]: Leaving directory `/opt/local/var/macports/build/_opt_local_var_macports_sources_rsync.macports.org_release_ports_devel_soprano/soprano/work/build'
88:info:build /usr/bin/make -f backends/virtuoso/CMakeFiles/soprano_virtuosobackend.dir/build.make backends/virtuoso/CMakeFiles/soprano_virtuosobackend.dir/build
89:info:build [ 50%] Built target soprano_sesame2backend
90:info:build /usr/bin/make -f parsers/raptor/CMakeFiles/soprano_raptorparser.dir/build.make parsers/raptor/CMakeFiles/soprano_raptorparser.dir/depend
91:info:build make[2]: Entering directory `/opt/local/var/macports/build/_opt_local_var_macports_sources_rsync.macports.org_release_ports_devel_soprano/soprano/work/build'
92:info:build make[2]: Nothing to be done for `backends/virtuoso/CMakeFiles/soprano_virtuosobackend.dir/build'.
93:info:build make[2]: Leaving directory `/opt/local/var/macports/build/_opt_local_var_macports_sources_rsync.macports.org_release_ports_devel_soprano/soprano/work/build'
94:info:build /opt/local/bin/cmake -E cmake_progress_report /opt/local/var/macports/build/_opt_local_var_macports_sources_rsync.macports.org_release_ports_devel_soprano/soprano/work/build/CMakeFiles  52 53 54 55 56 57 58 59
95:info:build [ 58%] Built target soprano_virtuosobackend
96:info:build /usr/bin/make -f parsers/nquads/CMakeFiles/soprano_nquadparser.dir/build.make parsers/nquads/CMakeFiles/soprano_nquadparser.dir/depend
97:info:build make[2]: Entering directory `/opt/local/var/macports/build/_opt_local_var_macports_sources_rsync.macports.org_release_ports_devel_soprano/soprano/work/build'
98:info:build cd /opt/local/var/macports/build/_opt_local_var_macports_sources_rsync.macports.org_release_ports_devel_soprano/soprano/work/build && /opt/local/bin/cmake -E cmake_depends "Unix Makefiles" /opt/local/var/macports/build/_opt_local_var_macports_sources_rsync.macports.org_release_ports_devel_soprano/soprano/work/soprano-2.6.52 /opt/local/var/macports/build/_opt_local_var_macports_sources_rsync.macports.org_release_ports_devel_soprano/soprano/work/soprano-2.6.52/parsers/nquads /opt/local/var/macports/build/_opt_local_var_macports_sources_rsync.macports.org_release_ports_devel_soprano/soprano/work/build /opt/local/var/macports/build/_opt_local_var_macports_sources_rsync.macports.org_release_ports_devel_soprano/soprano/work/build/parsers/nquads /opt/local/var/macports/build/_opt_local_var_macports_sources_rsync.macports.org_release_ports_devel_soprano/soprano/work/build/parsers/nquads/CMakeFiles/soprano_nquadparser.dir/DependInfo.cmake --color=
99:info:build make[2]: Entering directory `/opt/local/var/macports/build/_opt_local_var_macports_sources_rsync.macports.org_release_ports_devel_soprano/soprano/work/build'
100:info:build cd /opt/local/var/macports/build/_opt_local_var_macports_sources_rsync.macports.org_release_ports_devel_soprano/soprano/work/build && /opt/local/bin/cmake -E cmake_depends "Unix Makefiles" /opt/local/var/macports/build/_opt_local_var_macports_sources_rsync.macports.org_release_ports_devel_soprano/soprano/work/soprano-2.6.52 /opt/local/var/macports/build/_opt_local_var_macports_sources_rsync.macports.org_release_ports_devel_soprano/soprano/work/soprano-2.6.52/parsers/raptor /opt/local/var/macports/build/_opt_local_var_macports_sources_rsync.macports.org_release_ports_devel_soprano/soprano/work/build /opt/local/var/macports/build/_opt_local_var_macports_sources_rsync.macports.org_release_ports_devel_soprano/soprano/work/build/parsers/raptor /opt/local/var/macports/build/_opt_local_var_macports_sources_rsync.macports.org_release_ports_devel_soprano/soprano/work/build/parsers/raptor/CMakeFiles/soprano_raptorparser.dir/DependInfo.cmake --color=
101:info:build make[2]: Leaving directory `/opt/local/var/macports/build/_opt_local_var_macports_sources_rsync.macports.org_release_ports_devel_soprano/soprano/work/build'
102:info:build /usr/bin/make -f parsers/nquads/CMakeFiles/soprano_nquadparser.dir/build.make parsers/nquads/CMakeFiles/soprano_nquadparser.dir/build
103:info:build make[2]: Leaving directory `/opt/local/var/macports/build/_opt_local_var_macports_sources_rsync.macports.org_release_ports_devel_soprano/soprano/work/build'
104:info:build /usr/bin/make -f parsers/raptor/CMakeFiles/soprano_raptorparser.dir/build.make parsers/raptor/CMakeFiles/soprano_raptorparser.dir/build
105:info:build make[2]: Entering directory `/opt/local/var/macports/build/_opt_local_var_macports_sources_rsync.macports.org_release_ports_devel_soprano/soprano/work/build'
106:info:build make[2]: Nothing to be done for `parsers/nquads/CMakeFiles/soprano_nquadparser.dir/build'.
107:info:build make[2]: Leaving directory `/opt/local/var/macports/build/_opt_local_var_macports_sources_rsync.macports.org_release_ports_devel_soprano/soprano/work/build'
108:info:build /opt/local/bin/cmake -E cmake_progress_report /opt/local/var/macports/build/_opt_local_var_macports_sources_rsync.macports.org_release_ports_devel_soprano/soprano/work/build/CMakeFiles  37
109:info:build make[2]: Entering directory `/opt/local/var/macports/build/_opt_local_var_macports_sources_rsync.macports.org_release_ports_devel_soprano/soprano/work/build'
110:info:build make[2]: Nothing to be done for `parsers/raptor/CMakeFiles/soprano_raptorparser.dir/build'.
111:info:build make[2]: Leaving directory `/opt/local/var/macports/build/_opt_local_var_macports_sources_rsync.macports.org_release_ports_devel_soprano/soprano/work/build'
112:info:build /opt/local/bin/cmake -E cmake_progress_report /opt/local/var/macports/build/_opt_local_var_macports_sources_rsync.macports.org_release_ports_devel_soprano/soprano/work/build/CMakeFiles  39
113:info:build [ 59%] Built target soprano_nquadparser
114:info:build /usr/bin/make -f serializers/raptor/CMakeFiles/soprano_raptorserializer.dir/build.make serializers/raptor/CMakeFiles/soprano_raptorserializer.dir/depend
115:info:build [ 60%] make[2]: Entering directory `/opt/local/var/macports/build/_opt_local_var_macports_sources_rsync.macports.org_release_ports_devel_soprano/soprano/work/build'
116:info:build cd /opt/local/var/macports/build/_opt_local_var_macports_sources_rsync.macports.org_release_ports_devel_soprano/soprano/work/build && /opt/local/bin/cmake -E cmake_depends "Unix Makefiles" /opt/local/var/macports/build/_opt_local_var_macports_sources_rsync.macports.org_release_ports_devel_soprano/soprano/work/soprano-2.6.52 /opt/local/var/macports/build/_opt_local_var_macports_sources_rsync.macports.org_release_ports_devel_soprano/soprano/work/soprano-2.6.52/serializers/raptor /opt/local/var/macports/build/_opt_local_var_macports_sources_rsync.macports.org_release_ports_devel_soprano/soprano/work/build /opt/local/var/macports/build/_opt_local_var_macports_sources_rsync.macports.org_release_ports_devel_soprano/soprano/work/build/serializers/raptor /opt/local/var/macports/build/_opt_local_var_macports_sources_rsync.macports.org_release_ports_devel_soprano/soprano/work/build/serializers/raptor/CMakeFiles/soprano_raptorserializer.dir/DependInfo.cmake --color=
117:info:build Built target soprano_raptorparser
118:info:build /usr/bin/make -f serializers/nquads/CMakeFiles/soprano_nquadserializer.dir/build.make serializers/nquads/CMakeFiles/soprano_nquadserializer.dir/depend
119:info:build make[2]: Entering directory `/opt/local/var/macports/build/_opt_local_var_macports_sources_rsync.macports.org_release_ports_devel_soprano/soprano/work/build'
120:info:build cd /opt/local/var/macports/build/_opt_local_var_macports_sources_rsync.macports.org_release_ports_devel_soprano/soprano/work/build && /opt/local/bin/cmake -E cmake_depends "Unix Makefiles" /opt/local/var/macports/build/_opt_local_var_macports_sources_rsync.macports.org_release_ports_devel_soprano/soprano/work/soprano-2.6.52 /opt/local/var/macports/build/_opt_local_var_macports_sources_rsync.macports.org_release_ports_devel_soprano/soprano/work/soprano-2.6.52/serializers/nquads /opt/local/var/macports/build/_opt_local_var_macports_sources_rsync.macports.org_release_ports_devel_soprano/soprano/work/build /opt/local/var/macports/build/_opt_local_var_macports_sources_rsync.macports.org_release_ports_devel_soprano/soprano/work/build/serializers/nquads /opt/local/var/macports/build/_opt_local_var_macports_sources_rsync.macports.org_release_ports_devel_soprano/soprano/work/build/serializers/nquads/CMakeFiles/soprano_nquadserializer.dir/DependInfo.cmake --color=
121:info:build make[2]: Leaving directory `/opt/local/var/macports/build/_opt_local_var_macports_sources_rsync.macports.org_release_ports_devel_soprano/soprano/work/build'
122:info:build /usr/bin/make -f serializers/raptor/CMakeFiles/soprano_raptorserializer.dir/build.make serializers/raptor/CMakeFiles/soprano_raptorserializer.dir/build
123:info:build make[2]: Leaving directory `/opt/local/var/macports/build/_opt_local_var_macports_sources_rsync.macports.org_release_ports_devel_soprano/soprano/work/build'
124:info:build /usr/bin/make -f serializers/nquads/CMakeFiles/soprano_nquadserializer.dir/build.make serializers/nquads/CMakeFiles/soprano_nquadserializer.dir/build
125:info:build make[2]: Entering directory `/opt/local/var/macports/build/_opt_local_var_macports_sources_rsync.macports.org_release_ports_devel_soprano/soprano/work/build'
126:info:build /opt/local/bin/cmake -E cmake_progress_report /opt/local/var/macports/build/_opt_local_var_macports_sources_rsync.macports.org_release_ports_devel_soprano/soprano/work/build/CMakeFiles
127:info:build make[2]: Entering directory `/opt/local/var/macports/build/_opt_local_var_macports_sources_rsync.macports.org_release_ports_devel_soprano/soprano/work/build'
128:info:build make[2]: Nothing to be done for `serializers/nquads/CMakeFiles/soprano_nquadserializer.dir/build'.
129:info:build make[2]: Leaving directory `/opt/local/var/macports/build/_opt_local_var_macports_sources_rsync.macports.org_release_ports_devel_soprano/soprano/work/build'
130:info:build [ 60%] /opt/local/bin/cmake -E cmake_progress_report /opt/local/var/macports/build/_opt_local_var_macports_sources_rsync.macports.org_release_ports_devel_soprano/soprano/work/build/CMakeFiles  38
131:info:build [ 61%] Building CXX object serializers/raptor/CMakeFiles/soprano_raptorserializer.dir/raptorserializer.cpp.o
132:info:build cd /opt/local/var/macports/build/_opt_local_var_macports_sources_rsync.macports.org_release_ports_devel_soprano/soprano/work/build/serializers/raptor && /usr/bin/g++-4.2   -DMAKE_RAPTORSERIALIZER_LIB -DQT_GUI_LIB -DQT_CORE_LIB -DQT_NO_DEBUG -O2 -arch x86_64  -Wnon-virtual-dtor -Wno-long-long -ansi -Wundef -Wcast-align -Wchar-subscripts -Wall -W -Wpointer-arith -Wformat-security -fno-check-new -fno-common -fvisibility=hidden -fvisibility-inlines-hidden -O3 -DNDEBUG -arch x86_64 -isysroot / -mmacosx-version-min=10.6 -fPIC -I/opt/local/include -I/opt/local/include/QtGui -I/opt/local/include/QtCore -I/opt/local/var/macports/build/_opt_local_var_macports_sources_rsync.macports.org_release_ports_devel_soprano/soprano/work/soprano-2.6.52 -I/opt/local/var/macports/build/_opt_local_var_macports_sources_rsync.macports.org_release_ports_devel_soprano/soprano/work/soprano-2.6.52/soprano -I/opt/local/var/macports/build/_opt_local_var_macports_sources_rsync.macports.org_release_ports_devel_soprano/soprano/work/build/serializers/raptor -I/opt/local/include/raptor2   -o CMakeFiles/soprano_raptorserializer.dir/raptorserializer.cpp.o -c /opt/local/var/macports/build/_opt_local_var_macports_sources_rsync.macports.org_release_ports_devel_soprano/soprano/work/soprano-2.6.52/serializers/raptor/raptorserializer.cpp
133:info:build Built target soprano_nquadserializer
134:info:build /usr/bin/make -f server/CMakeFiles/sopranoserver.dir/build.make server/CMakeFiles/sopranoserver.dir/depend
135:info:build make[2]: Entering directory `/opt/local/var/macports/build/_opt_local_var_macports_sources_rsync.macports.org_release_ports_devel_soprano/soprano/work/build'
136:info:build cd /opt/local/var/macports/build/_opt_local_var_macports_sources_rsync.macports.org_release_ports_devel_soprano/soprano/work/build && /opt/local/bin/cmake -E cmake_depends "Unix Makefiles" /opt/local/var/macports/build/_opt_local_var_macports_sources_rsync.macports.org_release_ports_devel_soprano/soprano/work/soprano-2.6.52 /opt/local/var/macports/build/_opt_local_var_macports_sources_rsync.macports.org_release_ports_devel_soprano/soprano/work/soprano-2.6.52/server /opt/local/var/macports/build/_opt_local_var_macports_sources_rsync.macports.org_release_ports_devel_soprano/soprano/work/build /opt/local/var/macports/build/_opt_local_var_macports_sources_rsync.macports.org_release_ports_devel_soprano/soprano/work/build/server /opt/local/var/macports/build/_opt_local_var_macports_sources_rsync.macports.org_release_ports_devel_soprano/soprano/work/build/server/CMakeFiles/sopranoserver.dir/DependInfo.cmake --color=
137:info:build make[2]: Leaving directory `/opt/local/var/macports/build/_opt_local_var_macports_sources_rsync.macports.org_release_ports_devel_soprano/soprano/work/build'
138:info:build /usr/bin/make -f server/CMakeFiles/sopranoserver.dir/build.make server/CMakeFiles/sopranoserver.dir/build
139:info:build make[2]: Entering directory `/opt/local/var/macports/build/_opt_local_var_macports_sources_rsync.macports.org_release_ports_devel_soprano/soprano/work/build'
140:info:build make[2]: Nothing to be done for `server/CMakeFiles/sopranoserver.dir/build'.
141:info:build make[2]: Leaving directory `/opt/local/var/macports/build/_opt_local_var_macports_sources_rsync.macports.org_release_ports_devel_soprano/soprano/work/build'
142:info:build /opt/local/bin/cmake -E cmake_progress_report /opt/local/var/macports/build/_opt_local_var_macports_sources_rsync.macports.org_release_ports_devel_soprano/soprano/work/build/CMakeFiles  87 88 89 90 91 92 93 94 95 96 97 98 99 100
143:info:build [ 75%] Built target sopranoserver
144:info:build /usr/bin/make -f client/CMakeFiles/sopranoclient.dir/build.make client/CMakeFiles/sopranoclient.dir/depend
145:info:build make[2]: Entering directory `/opt/local/var/macports/build/_opt_local_var_macports_sources_rsync.macports.org_release_ports_devel_soprano/soprano/work/build'
146:info:build cd /opt/local/var/macports/build/_opt_local_var_macports_sources_rsync.macports.org_release_ports_devel_soprano/soprano/work/build && /opt/local/bin/cmake -E cmake_depends "Unix Makefiles" /opt/local/var/macports/build/_opt_local_var_macports_sources_rsync.macports.org_release_ports_devel_soprano/soprano/work/soprano-2.6.52 /opt/local/var/macports/build/_opt_local_var_macports_sources_rsync.macports.org_release_ports_devel_soprano/soprano/work/soprano-2.6.52/client /opt/local/var/macports/build/_opt_local_var_macports_sources_rsync.macports.org_release_ports_devel_soprano/soprano/work/build /opt/local/var/macports/build/_opt_local_var_macports_sources_rsync.macports.org_release_ports_devel_soprano/soprano/work/build/client /opt/local/var/macports/build/_opt_local_var_macports_sources_rsync.macports.org_release_ports_devel_soprano/soprano/work/build/client/CMakeFiles/sopranoclient.dir/DependInfo.cmake --color=
147:info:build make[2]: Leaving directory `/opt/local/var/macports/build/_opt_local_var_macports_sources_rsync.macports.org_release_ports_devel_soprano/soprano/work/build'
148:info:build /usr/bin/make -f client/CMakeFiles/sopranoclient.dir/build.make client/CMakeFiles/sopranoclient.dir/build
149:info:build make[2]: Entering directory `/opt/local/var/macports/build/_opt_local_var_macports_sources_rsync.macports.org_release_ports_devel_soprano/soprano/work/build'
150:info:build make[2]: Nothing to be done for `client/CMakeFiles/sopranoclient.dir/build'.
151:info:build make[2]: Leaving directory `/opt/local/var/macports/build/_opt_local_var_macports_sources_rsync.macports.org_release_ports_devel_soprano/soprano/work/build'
152:info:build /opt/local/bin/cmake -E cmake_progress_report /opt/local/var/macports/build/_opt_local_var_macports_sources_rsync.macports.org_release_ports_devel_soprano/soprano/work/build/CMakeFiles  60 61 62 63 64 65 66 67 68 69 70 71 72 73 74 75 76 77 78 79
153:info:build [ 95%] Built target sopranoclient
154:info:build /usr/bin/make -f tools/CMakeFiles/onto2vocabularyclass.dir/build.make tools/CMakeFiles/onto2vocabularyclass.dir/depend
155:info:build make[2]: Entering directory `/opt/local/var/macports/build/_opt_local_var_macports_sources_rsync.macports.org_release_ports_devel_soprano/soprano/work/build'
156:info:build cd /opt/local/var/macports/build/_opt_local_var_macports_sources_rsync.macports.org_release_ports_devel_soprano/soprano/work/build && /opt/local/bin/cmake -E cmake_depends "Unix Makefiles" /opt/local/var/macports/build/_opt_local_var_macports_sources_rsync.macports.org_release_ports_devel_soprano/soprano/work/soprano-2.6.52 /opt/local/var/macports/build/_opt_local_var_macports_sources_rsync.macports.org_release_ports_devel_soprano/soprano/work/soprano-2.6.52/tools /opt/local/var/macports/build/_opt_local_var_macports_sources_rsync.macports.org_release_ports_devel_soprano/soprano/work/build /opt/local/var/macports/build/_opt_local_var_macports_sources_rsync.macports.org_release_ports_devel_soprano/soprano/work/build/tools /opt/local/var/macports/build/_opt_local_var_macports_sources_rsync.macports.org_release_ports_devel_soprano/soprano/work/build/tools/CMakeFiles/onto2vocabularyclass.dir/DependInfo.cmake --color=
157:info:build make[2]: Leaving directory `/opt/local/var/macports/build/_opt_local_var_macports_sources_rsync.macports.org_release_ports_devel_soprano/soprano/work/build'
158:info:build /usr/bin/make -f tools/CMakeFiles/onto2vocabularyclass.dir/build.make tools/CMakeFiles/onto2vocabularyclass.dir/build
159:info:build make[2]: Entering directory `/opt/local/var/macports/build/_opt_local_var_macports_sources_rsync.macports.org_release_ports_devel_soprano/soprano/work/build'
160:info:build make[2]: Nothing to be done for `tools/CMakeFiles/onto2vocabularyclass.dir/build'.
161:info:build make[2]: Leaving directory `/opt/local/var/macports/build/_opt_local_var_macports_sources_rsync.macports.org_release_ports_devel_soprano/soprano/work/build'
162:info:build /opt/local/bin/cmake -E cmake_progress_report /opt/local/var/macports/build/_opt_local_var_macports_sources_rsync.macports.org_release_ports_devel_soprano/soprano/work/build/CMakeFiles
163:info:build [ 95%] Built target onto2vocabularyclass
164:info:build /usr/bin/make -f tools/CMakeFiles/sopranocmd.dir/build.make tools/CMakeFiles/sopranocmd.dir/depend
165:info:build make[2]: Entering directory `/opt/local/var/macports/build/_opt_local_var_macports_sources_rsync.macports.org_release_ports_devel_soprano/soprano/work/build'
166:info:build /opt/local/bin/cmake -E cmake_progress_report /opt/local/var/macports/build/_opt_local_var_macports_sources_rsync.macports.org_release_ports_devel_soprano/soprano/work/build/CMakeFiles 81
167:info:build [ 96%] Generating modelmonitor.moc
168:info:build cd /opt/local/var/macports/build/_opt_local_var_macports_sources_rsync.macports.org_release_ports_devel_soprano/soprano/work/build/tools && /opt/local/bin/moc -I /opt/local/include -I /opt/local/include/QtGui -I /opt/local/include/QtCore -I /opt/local/var/macports/build/_opt_local_var_macports_sources_rsync.macports.org_release_ports_devel_soprano/soprano/work/soprano-2.6.52/soprano -I /opt/local/var/macports/build/_opt_local_var_macports_sources_rsync.macports.org_release_ports_devel_soprano/soprano/work/soprano-2.6.52/soprano/util -I /opt/local/var/macports/build/_opt_local_var_macports_sources_rsync.macports.org_release_ports_devel_soprano/soprano/work/soprano-2.6.52/soprano/query -I /opt/local/var/macports/build/_opt_local_var_macports_sources_rsync.macports.org_release_ports_devel_soprano/soprano/work/soprano-2.6.52/soprano/vocabulary -I /opt/local/var/macports/build/_opt_local_var_macports_sources_rsync.macports.org_release_ports_devel_soprano/soprano/work/build/soprano -I /opt/local/var/macports/build/_opt_local_var_macports_sources_rsync.macports.org_release_ports_devel_soprano/soprano/work/build/tools -I /opt/local/share/qt4/mkspecs/default -I /opt/local/include/Qt3Support -I /opt/local/include/QtDesigner -I /opt/local/include/QtNetwork -I /opt/local/include/QtOpenGL -I /opt/local/include/QtSql -I /opt/local/include/QtXml -I /opt/local/include/QtSvg -I /opt/local/include/QtScript -I /opt/local/include/QtUiTools -I /opt/local/include/QtTest -I /opt/local/include/QtDBus -I /opt/local/var/macports/build/_opt_local_var_macports_sources_rsync.macports.org_release_ports_devel_soprano/soprano/work/soprano-2.6.52 /opt/local/var/macports/build/_opt_local_var_macports_sources_rsync.macports.org_release_ports_devel_soprano/soprano/work/soprano-2.6.52/tools/modelmonitor.h -o /opt/local/var/macports/build/_opt_local_var_macports_sources_rsync.macports.org_release_ports_devel_soprano/soprano/work/build/tools/modelmonitor.moc
169:info:build cd /opt/local/var/macports/build/_opt_local_var_macports_sources_rsync.macports.org_release_ports_devel_soprano/soprano/work/build && /opt/local/bin/cmake -E cmake_depends "Unix Makefiles" /opt/local/var/macports/build/_opt_local_var_macports_sources_rsync.macports.org_release_ports_devel_soprano/soprano/work/soprano-2.6.52 /opt/local/var/macports/build/_opt_local_var_macports_sources_rsync.macports.org_release_ports_devel_soprano/soprano/work/soprano-2.6.52/tools /opt/local/var/macports/build/_opt_local_var_macports_sources_rsync.macports.org_release_ports_devel_soprano/soprano/work/build /opt/local/var/macports/build/_opt_local_var_macports_sources_rsync.macports.org_release_ports_devel_soprano/soprano/work/build/tools /opt/local/var/macports/build/_opt_local_var_macports_sources_rsync.macports.org_release_ports_devel_soprano/soprano/work/build/tools/CMakeFiles/sopranocmd.dir/DependInfo.cmake --color=
170:info:build Scanning dependencies of target sopranocmd
171:info:build make[2]: Leaving directory `/opt/local/var/macports/build/_opt_local_var_macports_sources_rsync.macports.org_release_ports_devel_soprano/soprano/work/build'
172:info:build /usr/bin/make -f tools/CMakeFiles/sopranocmd.dir/build.make tools/CMakeFiles/sopranocmd.dir/build
173:info:build make[2]: Entering directory `/opt/local/var/macports/build/_opt_local_var_macports_sources_rsync.macports.org_release_ports_devel_soprano/soprano/work/build'
174:info:build /opt/local/bin/cmake -E cmake_progress_report /opt/local/var/macports/build/_opt_local_var_macports_sources_rsync.macports.org_release_ports_devel_soprano/soprano/work/build/CMakeFiles 80
175:info:build [ 97%] Building CXX object tools/CMakeFiles/sopranocmd.dir/sopranocmd.cpp.o
176:info:build cd /opt/local/var/macports/build/_opt_local_var_macports_sources_rsync.macports.org_release_ports_devel_soprano/soprano/work/build/tools && /usr/bin/g++-4.2   -DQT_GUI_LIB -DQT_CORE_LIB -DQT_NO_DEBUG -O2 -arch x86_64  -Wnon-virtual-dtor -Wno-long-long -ansi -Wundef -Wcast-align -Wchar-subscripts -Wall -W -Wpointer-arith -Wformat-security -fno-check-new -fno-common -fvisibility=hidden -fvisibility-inlines-hidden -O3 -DNDEBUG -arch x86_64 -isysroot / -mmacosx-version-min=10.6 -I/opt/local/include -I/opt/local/include/QtGui -I/opt/local/include/QtCore -I/opt/local/var/macports/build/_opt_local_var_macports_sources_rsync.macports.org_release_ports_devel_soprano/soprano/work/soprano-2.6.52/soprano -I/opt/local/var/macports/build/_opt_local_var_macports_sources_rsync.macports.org_release_ports_devel_soprano/soprano/work/soprano-2.6.52/soprano/util -I/opt/local/var/macports/build/_opt_local_var_macports_sources_rsync.macports.org_release_ports_devel_soprano/soprano/work/soprano-2.6.52/soprano/query -I/opt/local/var/macports/build/_opt_local_var_macports_sources_rsync.macports.org_release_ports_devel_soprano/soprano/work/soprano-2.6.52/soprano/vocabulary -I/opt/local/var/macports/build/_opt_local_var_macports_sources_rsync.macports.org_release_ports_devel_soprano/soprano/work/build/soprano -I/opt/local/var/macports/build/_opt_local_var_macports_sources_rsync.macports.org_release_ports_devel_soprano/soprano/work/build/tools -I/opt/local/share/qt4/mkspecs/default -I/opt/local/include/Qt3Support -I/opt/local/include/QtDesigner -I/opt/local/include/QtNetwork -I/opt/local/include/QtOpenGL -I/opt/local/include/QtSql -I/opt/local/include/QtXml -I/opt/local/include/QtSvg -I/opt/local/include/QtScript -I/opt/local/include/QtUiTools -I/opt/local/include/QtTest -I/opt/local/include/QtDBus -I/opt/local/var/macports/build/_opt_local_var_macports_sources_rsync.macports.org_release_ports_devel_soprano/soprano/work/soprano-2.6.52   -o CMakeFiles/sopranocmd.dir/sopranocmd.cpp.o -c /opt/local/var/macports/build/_opt_local_var_macports_sources_rsync.macports.org_release_ports_devel_soprano/soprano/work/soprano-2.6.52/tools/sopranocmd.cpp
177:info:build /opt/local/var/macports/build/_opt_local_var_macports_sources_rsync.macports.org_release_ports_devel_soprano/soprano/work/soprano-2.6.52/serializers/raptor/raptorserializer.cpp:64: error: expected constructor, destructor, or type conversion before ‘*’ token
178:info:build In file included from /opt/local/var/macports/build/_opt_local_var_macports_sources_rsync.macports.org_release_ports_devel_soprano/soprano/work/soprano-2.6.52/serializers/raptor/raptorserializer.cpp:417:
179:info:build /opt/local/var/macports/build/_opt_local_var_macports_sources_rsync.macports.org_release_ports_devel_soprano/soprano/work/build/serializers/raptor/raptorserializer.moc:72: error: expected `}' at end of input
180:info:build make[2]: *** [serializers/raptor/CMakeFiles/soprano_raptorserializer.dir/raptorserializer.cpp.o] Error 1
181:info:build make[2]: Leaving directory `/opt/local/var/macports/build/_opt_local_var_macports_sources_rsync.macports.org_release_ports_devel_soprano/soprano/work/build'
182:info:build make[1]: *** [serializers/raptor/CMakeFiles/soprano_raptorserializer.dir/all] Error 2
183:info:build make[1]: *** Waiting for unfinished jobs....
184:info:build /opt/local/bin/cmake -E cmake_progress_report /opt/local/var/macports/build/_opt_local_var_macports_sources_rsync.macports.org_release_ports_devel_soprano/soprano/work/build/CMakeFiles
185:info:build [ 97%] Building CXX object tools/CMakeFiles/sopranocmd.dir/modelmonitor.cpp.o
186:info:build cd /opt/local/var/macports/build/_opt_local_var_macports_sources_rsync.macports.org_release_ports_devel_soprano/soprano/work/build/tools && /usr/bin/g++-4.2   -DQT_GUI_LIB -DQT_CORE_LIB -DQT_NO_DEBUG -O2 -arch x86_64  -Wnon-virtual-dtor -Wno-long-long -ansi -Wundef -Wcast-align -Wchar-subscripts -Wall -W -Wpointer-arith -Wformat-security -fno-check-new -fno-common -fvisibility=hidden -fvisibility-inlines-hidden -O3 -DNDEBUG -arch x86_64 -isysroot / -mmacosx-version-min=10.6 -I/opt/local/include -I/opt/local/include/QtGui -I/opt/local/include/QtCore -I/opt/local/var/macports/build/_opt_local_var_macports_sources_rsync.macports.org_release_ports_devel_soprano/soprano/work/soprano-2.6.52/soprano -I/opt/local/var/macports/build/_opt_local_var_macports_sources_rsync.macports.org_release_ports_devel_soprano/soprano/work/soprano-2.6.52/soprano/util -I/opt/local/var/macports/build/_opt_local_var_macports_sources_rsync.macports.org_release_ports_devel_soprano/soprano/work/soprano-2.6.52/soprano/query -I/opt/local/var/macports/build/_opt_local_var_macports_sources_rsync.macports.org_release_ports_devel_soprano/soprano/work/soprano-2.6.52/soprano/vocabulary -I/opt/local/var/macports/build/_opt_local_var_macports_sources_rsync.macports.org_release_ports_devel_soprano/soprano/work/build/soprano -I/opt/local/var/macports/build/_opt_local_var_macports_sources_rsync.macports.org_release_ports_devel_soprano/soprano/work/build/tools -I/opt/local/share/qt4/mkspecs/default -I/opt/local/include/Qt3Support -I/opt/local/include/QtDesigner -I/opt/local/include/QtNetwork -I/opt/local/include/QtOpenGL -I/opt/local/include/QtSql -I/opt/local/include/QtXml -I/opt/local/include/QtSvg -I/opt/local/include/QtScript -I/opt/local/include/QtUiTools -I/opt/local/include/QtTest -I/opt/local/include/QtDBus -I/opt/local/var/macports/build/_opt_local_var_macports_sources_rsync.macports.org_release_ports_devel_soprano/soprano/work/soprano-2.6.52   -o CMakeFiles/sopranocmd.dir/modelmonitor.cpp.o -c /opt/local/var/macports/build/_opt_local_var_macports_sources_rsync.macports.org_release_ports_devel_soprano/soprano/work/soprano-2.6.52/tools/modelmonitor.cpp
187:info:build Linking CXX executable sopranocmd
188:info:build cd /opt/local/var/macports/build/_opt_local_var_macports_sources_rsync.macports.org_release_ports_devel_soprano/soprano/work/build/tools && /opt/local/bin/cmake -E cmake_link_script CMakeFiles/sopranocmd.dir/link.txt --verbose=1
189:info:build /usr/bin/g++-4.2   -O2 -arch x86_64  -Wnon-virtual-dtor -Wno-long-long -ansi -Wundef -Wcast-align -Wchar-subscripts -Wall -W -Wpointer-arith -Wformat-security -fno-check-new -fno-common -fvisibility=hidden -fvisibility-inlines-hidden -O3 -DNDEBUG -arch x86_64 -isysroot / -mmacosx-version-min=10.6 -Wl,-search_paths_first -Wl,-headerpad_max_install_names -arch x86_64 CMakeFiles/sopranocmd.dir/sopranocmd.cpp.o CMakeFiles/sopranocmd.dir/modelmonitor.cpp.o  -o sopranocmd  /opt/local/lib/libQtCore.dylib -lpthread ../soprano/libsoprano.4.3.0.dylib ../client/libsopranoclient.1.2.0.dylib ../index/libsopranoindex.1.1.0.dylib /opt/local/lib/libQtNetwork.dylib /opt/local/lib/libQtXml.dylib /opt/local/lib/libQtDBus.dylib ../soprano/libsoprano.4.3.0.dylib /opt/local/lib/libQtCore.dylib -lpthread /opt/local/lib/libclucene.dylib
190:info:build make[2]: Leaving directory `/opt/local/var/macports/build/_opt_local_var_macports_sources_rsync.macports.org_release_ports_devel_soprano/soprano/work/build'
191:info:build /opt/local/bin/cmake -E cmake_progress_report /opt/local/var/macports/build/_opt_local_var_macports_sources_rsync.macports.org_release_ports_devel_soprano/soprano/work/build/CMakeFiles  80 81
192:info:build [ 97%] Built target sopranocmd
193:info:build make[1]: Leaving directory `/opt/local/var/macports/build/_opt_local_var_macports_sources_rsync.macports.org_release_ports_devel_soprano/soprano/work/build'
194:info:build make: *** [all] Error 2
195:info:build make: Leaving directory `/opt/local/var/macports/build/_opt_local_var_macports_sources_rsync.macports.org_release_ports_devel_soprano/soprano/work/build'
196:info:build shell command " cd "/opt/local/var/macports/build/_opt_local_var_macports_sources_rsync.macports.org_release_ports_devel_soprano/soprano/work/build" && /usr/bin/make -j2 -w all " returned error 2
197:error:build Target org.macports.build returned: shell command failed (see log for details)
198:debug:build Backtrace: shell command failed (see log for details)
199    while executing
200"command_exec build"
201    (procedure "portbuild::build_main" line 8)
202    invoked from within
203"$procedure $targetname"
204:info:build Warning: the following items did not execute (for soprano): org.macports.install org.macports.build org.macports.destroot
205:notice:build Log for soprano is at: /opt/local/var/macports/logs/_opt_local_var_macports_sources_rsync.macports.org_release_ports_devel_soprano/soprano/main.log