Ticket #30380: main.log

File main.log, 7.9 KB (added by george@…, 10 years ago)
Line 
1version:1
2:debug:main Executing org.macports.main (manopen)
3:debug:main changing euid/egid - current euid: 0 - current egid: 0
4:debug:main egid changed to: 501
5:debug:main euid changed to: 502
6:debug:main Skipping completed org.macports.archivefetch (manopen)
7:debug:main Privilege de-escalation not attempted as not running as root.
8:debug:main Skipping completed org.macports.fetch (manopen)
9:debug:main Privilege de-escalation not attempted as not running as root.
10:debug:main Skipping completed org.macports.checksum (manopen)
11:debug:main Privilege de-escalation not attempted as not running as root.
12:debug:main Skipping completed org.macports.extract (manopen)
13:debug:main Privilege de-escalation not attempted as not running as root.
14:debug:main Skipping completed org.macports.patch (manopen)
15:debug:main Privilege de-escalation not attempted as not running as root.
16:debug:main Skipping completed org.macports.configure (manopen)
17:debug:main Privilege de-escalation not attempted as not running as root.
18:debug:build build phase started at Mon Jul 25 18:46:40 PDT 2011
19:notice:build --->  Building manopen
20:debug:build Executing org.macports.build (manopen)
21:debug:build port disallows a parallel build
22:debug:build Environment: CPATH='/opt/local/include' CC_PRINT_OPTIONS_FILE='/opt/local/var/macports/build/_opt_local_var_macports_sources_rsync.macports.org_release_tarballs_ports_aqua_ManOpen/manopen/work/.CC_PRINT_OPTIONS' LIBRARY_PATH='/opt/local/lib' CC_PRINT_OPTIONS='YES' MACOSX_DEPLOYMENT_TARGET='10.7'
23:debug:build Assembled command: 'cd "/opt/local/var/macports/build/_opt_local_var_macports_sources_rsync.macports.org_release_tarballs_ports_aqua_ManOpen/manopen/work/ManOpen-2.5.1" && /usr/bin/make -w all'
24:debug:build Executing command line:  cd "/opt/local/var/macports/build/_opt_local_var_macports_sources_rsync.macports.org_release_tarballs_ports_aqua_ManOpen/manopen/work/ManOpen-2.5.1" && /usr/bin/make -w all
25:info:build make: Entering directory `/opt/local/var/macports/build/_opt_local_var_macports_sources_rsync.macports.org_release_tarballs_ports_aqua_ManOpen/manopen/work/ManOpen-2.5.1'
26:info:build == Making all for i386 in ManOpen openman.tproj ==
27:info:build make[1]: Entering directory `/opt/local/var/macports/build/_opt_local_var_macports_sources_rsync.macports.org_release_tarballs_ports_aqua_ManOpen/manopen/work/ManOpen-2.5.1/ManOpen'
28:info:build == Making ManOpen for i386 ==
29:info:build Pre-build setup...
30:info:build /bin/rm -f /opt/local/var/macports/build/_opt_local_var_macports_sources_rsync.macports.org_release_tarballs_ports_aqua_ManOpen/manopen/work/ManOpen-2.5.1/ManOpen.build/derived_src/TrustedPrecomps.txt
31:info:build ......skipping cat2html.tproj
32:info:build ......skipping cat2rtf.tproj
33:info:build Building...
34:info:build ......skipping cat2html.tproj
35:info:build ......skipping cat2rtf.tproj
36:info:build -n
37:info:build Copying English resources...
38:info:build /usr/bin/cc -arch i386 -Os  -Wmost  -g  -fno-common -I/opt/local/var/macports/build/_opt_local_var_macports_sources_rsync.macports.org_release_tarballs_ports_aqua_ManOpen/manopen/work/ManOpen-2.5.1/ManOpen.build/ProjectHeaders -I/opt/local/var/macports/build/_opt_local_var_macports_sources_rsync.macports.org_release_tarballs_ports_aqua_ManOpen/manopen/work/ManOpen-2.5.1/ManOpen.app/PrivateHeaders -I/opt/local/var/macports/build/_opt_local_var_macports_sources_rsync.macports.org_release_tarballs_ports_aqua_ManOpen/manopen/work/ManOpen-2.5.1/ManOpen.build/Headers -I/opt/local/var/macports/build/_opt_local_var_macports_sources_rsync.macports.org_release_tarballs_ports_aqua_ManOpen/manopen/work/ManOpen-2.5.1/ManOpen.build/derived_src/ManOpen -I. -pipe        -I/opt/local/var/macports/build/_opt_local_var_macports_sources_rsync.macports.org_release_tarballs_ports_aqua_ManOpen/manopen/work/ManOpen-2.5.1/ManOpen.build/Headers -I/opt/local/var/macports/build/_opt_local_var_macports_sources_rsync.macports.org_release_tarballs_ports_aqua_ManOpen/manopen/work/ManOpen-2.5.1/ManOpen.build/PrivateHeaders -F/opt/local/var/macports/build/_opt_local_var_macports_sources_rsync.macports.org_release_tarballs_ports_aqua_ManOpen/manopen/work/ManOpen-2.5.1      -ObjC       -c -o /opt/local/var/macports/build/_opt_local_var_macports_sources_rsync.macports.org_release_tarballs_ports_aqua_ManOpen/manopen/work/ManOpen-2.5.1/ManOpen.build/objects-optimized/ManOpen/ManDocument.i386.o ManDocument.m
39:info:build In file included from ManDocument.m:2:
40:info:build ManDocument.h:16: error: expected specifier-qualifier-list before ‘NSMutableArray’
41:info:build ManDocument.h:17: error: expected specifier-qualifier-list before ‘NSMutableArray’
42:info:build ManDocument.m: In function ‘-[ManDocument dealloc]’:
43:info:build ManDocument.m:70: error: ‘sections’ undeclared (first use in this function)
44:info:build ManDocument.m:70: error: (Each undeclared identifier is reported only once
45:info:build ManDocument.m:70: error: for each function it appears in.)
46:info:build ManDocument.m: In function ‘-[ManDocument displayName]’:
47:info:build ManDocument.m:85: warning: ‘fileName’ is deprecated (declared at /System/Library/Frameworks/AppKit.framework/Headers/NSDocument.h:723)
48:info:build ManDocument.m: In function ‘-[ManDocument setupSectionPopup]’:
49:info:build ManDocument.m:108: error: ‘sections’ undeclared (first use in this function)
50:info:build ManDocument.m: In function ‘-[ManDocument addSectionHeader:range:]’:
51:info:build ManDocument.m:124: error: ‘sections’ undeclared (first use in this function)
52:info:build ManDocument.m:130: error: ‘sectionRanges’ undeclared (first use in this function)
53:info:build ManDocument.m: In function ‘-[ManDocument showData]’:
54:info:build ManDocument.m:164: error: ‘sections’ undeclared (first use in this function)
55:info:build ManDocument.m:166: error: ‘sectionRanges’ undeclared (first use in this function)
56:info:build ManDocument.m: In function ‘-[ManDocument windowControllerDidLoadNib:]’:
57:info:build ManDocument.m:369: warning: class 'ManDocument' does not implement the 'NSWindowDelegate' protocol
58:info:build ManDocument.m: In function ‘-[ManDocument displaySection:]’:
59:info:build ManDocument.m:401: error: ‘sectionRanges’ undeclared (first use in this function)
60:info:build ManDocument.m: In function ‘-[ManDocument printShowingPrintPanel:]’:
61:info:build ManDocument.m:427: warning: ‘setShowPanels:’ is deprecated (declared at /System/Library/Frameworks/AppKit.framework/Headers/NSPrintOperation.h:157)
62:info:build make[1]: *** [/opt/local/var/macports/build/_opt_local_var_macports_sources_rsync.macports.org_release_tarballs_ports_aqua_ManOpen/manopen/work/ManOpen-2.5.1/ManOpen.build/objects-optimized/ManOpen/ManDocument.i386.o] Error 1
63:info:build make[1]: Leaving directory `/opt/local/var/macports/build/_opt_local_var_macports_sources_rsync.macports.org_release_tarballs_ports_aqua_ManOpen/manopen/work/ManOpen-2.5.1/ManOpen'
64:info:build make: *** [all@ManOpen] Error 2
65:info:build make: Leaving directory `/opt/local/var/macports/build/_opt_local_var_macports_sources_rsync.macports.org_release_tarballs_ports_aqua_ManOpen/manopen/work/ManOpen-2.5.1'
66:info:build shell command " cd "/opt/local/var/macports/build/_opt_local_var_macports_sources_rsync.macports.org_release_tarballs_ports_aqua_ManOpen/manopen/work/ManOpen-2.5.1" && /usr/bin/make -w all " returned error 2
67:error:build Target org.macports.build returned: shell command failed (see log for details)
68:debug:build Backtrace: shell command failed (see log for details)
69    while executing
70"command_exec build"
71    (procedure "portbuild::build_main" line 8)
72    invoked from within
73"$procedure $targetname"
74:info:build Warning: the following items did not execute (for manopen): org.macports.activate org.macports.build org.macports.destroot org.macports.install
75:notice:build Log for manopen is at: /opt/local/var/macports/logs/_opt_local_var_macports_sources_rsync.macports.org_release_tarballs_ports_aqua_ManOpen/manopen/main.log