Ticket #30384: rpm.log

File rpm.log, 145.0 KB (added by whcordis@…, 9 years ago)

Build Log

Line 
1version:1
2:debug:main epoch: in tree: 0 installed: 0
3:debug:main expat 2.0.1_1 exists in the ports tree
4:debug:main expat 2.0.1_1  is the latest installed
5:debug:main expat 2.0.1_1  is active
6:debug:main Merging existing variants '' into variants
7:debug:main new fully merged portvariants:
8:debug:main Changing to port directory: /opt/local/var/macports/sources/rsync.macports.org/release/ports/textproc/expat
9:debug:main OS darwin/11.0.0 (Mac OS X 10.7) arch i386
10:debug:main org.macports.load registered provides 'load', a pre-existing procedure. Target override will not be provided
11:debug:main org.macports.unload registered provides 'unload', a pre-existing procedure. Target override will not be provided
12:debug:main org.macports.distfiles registered provides 'distfiles', a pre-existing procedure. Target override will not be provided
13:debug:main adding the default universal variant
14:debug:main Reading variant descriptions from /opt/local/var/macports/sources/rsync.macports.org/release/ports/_resources/port1.0/variant_descriptions.conf
15:debug:main No need to upgrade! expat 2.0.1_1 >= expat 2.0.1_1
16:debug:main epoch: in tree: 0 installed: 0
17:debug:main gettext 0.18.1.1_2 exists in the ports tree
18:debug:main gettext 0.18.1.1_2  is the latest installed
19:debug:main gettext 0.18.1.1_2  is active
20:debug:main Merging existing variants '' into variants
21:debug:main new fully merged portvariants:
22:debug:main Changing to port directory: /opt/local/var/macports/sources/rsync.macports.org/release/ports/devel/gettext
23:debug:main OS darwin/11.0.0 (Mac OS X 10.7) arch i386
24:debug:main org.macports.load registered provides 'load', a pre-existing procedure. Target override will not be provided
25:debug:main org.macports.unload registered provides 'unload', a pre-existing procedure. Target override will not be provided
26:debug:main org.macports.distfiles registered provides 'distfiles', a pre-existing procedure. Target override will not be provided
27:debug:main Using group file /opt/local/var/macports/sources/rsync.macports.org/release/ports/_resources/port1.0/group/muniversal-1.0.tcl
28:debug:main Reading variant descriptions from /opt/local/var/macports/sources/rsync.macports.org/release/ports/_resources/port1.0/variant_descriptions.conf
29:debug:main Using group file /opt/local/var/macports/sources/rsync.macports.org/release/ports/_resources/port1.0/group/archcheck-1.0.tcl
30:debug:main universal variant already exists, so not adding the default one
31:debug:main No need to upgrade! gettext 0.18.1.1_2 >= gettext 0.18.1.1_2
32:debug:main Not following dependencies
33:debug:main epoch: in tree: 0 installed: 0
34:debug:main neon 0.29.6_0 exists in the ports tree
35:debug:main neon 0.29.6_0  is the latest installed
36:debug:main neon 0.29.6_0  is active
37:debug:main Merging existing variants '' into variants
38:debug:main new fully merged portvariants:
39:debug:main Changing to port directory: /opt/local/var/macports/sources/rsync.macports.org/release/ports/www/neon
40:debug:main OS darwin/11.0.0 (Mac OS X 10.7) arch i386
41:debug:main org.macports.load registered provides 'load', a pre-existing procedure. Target override will not be provided
42:debug:main org.macports.unload registered provides 'unload', a pre-existing procedure. Target override will not be provided
43:debug:main org.macports.distfiles registered provides 'distfiles', a pre-existing procedure. Target override will not be provided
44:debug:main adding the default universal variant
45:debug:main Reading variant descriptions from /opt/local/var/macports/sources/rsync.macports.org/release/ports/_resources/port1.0/variant_descriptions.conf
46:debug:main No need to upgrade! neon 0.29.6_0 >= neon 0.29.6_0
47:debug:main Not following dependencies
48:debug:main epoch: in tree: 0 installed: 0
49:debug:main beecrypt 4.2.1_2 exists in the ports tree
50:debug:main beecrypt 4.2.1_2  is the latest installed
51:debug:main beecrypt 4.2.1_2  is active
52:debug:main Merging existing variants '' into variants
53:debug:main new fully merged portvariants:
54:debug:main Changing to port directory: /opt/local/var/macports/sources/rsync.macports.org/release/ports/devel/beecrypt
55:debug:main OS darwin/11.0.0 (Mac OS X 10.7) arch i386
56:debug:main org.macports.load registered provides 'load', a pre-existing procedure. Target override will not be provided
57:debug:main org.macports.unload registered provides 'unload', a pre-existing procedure. Target override will not be provided
58:debug:main org.macports.distfiles registered provides 'distfiles', a pre-existing procedure. Target override will not be provided
59:debug:main adding the default universal variant
60:debug:main Reading variant descriptions from /opt/local/var/macports/sources/rsync.macports.org/release/ports/_resources/port1.0/variant_descriptions.conf
61:debug:main No need to upgrade! beecrypt 4.2.1_2 >= beecrypt 4.2.1_2
62:debug:main epoch: in tree: 0 installed: 0
63:debug:main icu 4.6.1_0 exists in the ports tree
64:debug:main icu 4.6.1_0  is the latest installed
65:debug:main icu 4.6.1_0  is active
66:debug:main Merging existing variants '' into variants
67:debug:main new fully merged portvariants:
68:debug:main Changing to port directory: /opt/local/var/macports/sources/rsync.macports.org/release/ports/devel/icu
69:debug:main OS darwin/11.0.0 (Mac OS X 10.7) arch i386
70:debug:main org.macports.load registered provides 'load', a pre-existing procedure. Target override will not be provided
71:debug:main org.macports.unload registered provides 'unload', a pre-existing procedure. Target override will not be provided
72:debug:main org.macports.distfiles registered provides 'distfiles', a pre-existing procedure. Target override will not be provided
73:debug:main Using group file /opt/local/var/macports/sources/rsync.macports.org/release/ports/_resources/port1.0/group/muniversal-1.0.tcl
74:debug:main Reading variant descriptions from /opt/local/var/macports/sources/rsync.macports.org/release/ports/_resources/port1.0/variant_descriptions.conf
75:debug:main universal variant already exists, so not adding the default one
76:debug:main No need to upgrade! icu 4.6.1_0 >= icu 4.6.1_0
77:debug:main epoch: in tree: 0 installed: 0
78:debug:main libiconv 1.13.1_0 exists in the ports tree
79:debug:main libiconv 1.13.1_0  is the latest installed
80:debug:main libiconv 1.13.1_0  is active
81:debug:main Merging existing variants '' into variants
82:debug:main new fully merged portvariants:
83:debug:main Changing to port directory: /opt/local/var/macports/sources/rsync.macports.org/release/ports/textproc/libiconv
84:debug:main OS darwin/11.0.0 (Mac OS X 10.7) arch i386
85:debug:main org.macports.load registered provides 'load', a pre-existing procedure. Target override will not be provided
86:debug:main org.macports.unload registered provides 'unload', a pre-existing procedure. Target override will not be provided
87:debug:main org.macports.distfiles registered provides 'distfiles', a pre-existing procedure. Target override will not be provided
88:debug:main Using group file /opt/local/var/macports/sources/rsync.macports.org/release/ports/_resources/port1.0/group/muniversal-1.0.tcl
89:debug:main Reading variant descriptions from /opt/local/var/macports/sources/rsync.macports.org/release/ports/_resources/port1.0/variant_descriptions.conf
90:debug:main universal variant already exists, so not adding the default one
91:debug:main No need to upgrade! libiconv 1.13.1_0 >= libiconv 1.13.1_0
92:debug:main epoch: in tree: 1 installed: 1
93:debug:main openssl 1.0.0d_0 exists in the ports tree
94:debug:main openssl 1.0.0d_0  is the latest installed
95:debug:main openssl 1.0.0d_0  is active
96:debug:main Merging existing variants '' into variants
97:debug:main new fully merged portvariants:
98:debug:main Changing to port directory: /opt/local/var/macports/sources/rsync.macports.org/release/ports/devel/openssl
99:debug:main OS darwin/11.0.0 (Mac OS X 10.7) arch i386
100:debug:main org.macports.load registered provides 'load', a pre-existing procedure. Target override will not be provided
101:debug:main org.macports.unload registered provides 'unload', a pre-existing procedure. Target override will not be provided
102:debug:main org.macports.distfiles registered provides 'distfiles', a pre-existing procedure. Target override will not be provided
103:debug:main Using group file /opt/local/var/macports/sources/rsync.macports.org/release/ports/_resources/port1.0/group/muniversal-1.0.tcl
104:debug:main Reading variant descriptions from /opt/local/var/macports/sources/rsync.macports.org/release/ports/_resources/port1.0/variant_descriptions.conf
105:debug:main universal variant already exists, so not adding the default one
106:debug:main No need to upgrade! openssl 1.0.0d_0 >= openssl 1.0.0d_0
107:debug:main epoch: in tree: 0 installed: 0
108:debug:main zlib 1.2.5_0 exists in the ports tree
109:debug:main zlib 1.2.5_0  is the latest installed
110:debug:main zlib 1.2.5_0  is active
111:debug:main Merging existing variants '' into variants
112:debug:main new fully merged portvariants:
113:debug:main Changing to port directory: /opt/local/var/macports/sources/rsync.macports.org/release/ports/archivers/zlib
114:debug:main OS darwin/11.0.0 (Mac OS X 10.7) arch i386
115:debug:main org.macports.load registered provides 'load', a pre-existing procedure. Target override will not be provided
116:debug:main org.macports.unload registered provides 'unload', a pre-existing procedure. Target override will not be provided
117:debug:main org.macports.distfiles registered provides 'distfiles', a pre-existing procedure. Target override will not be provided
118:debug:main Using group file /opt/local/var/macports/sources/rsync.macports.org/release/ports/_resources/port1.0/group/xcodeversion-1.0.tcl
119:debug:main adding the default universal variant
120:debug:main Reading variant descriptions from /opt/local/var/macports/sources/rsync.macports.org/release/ports/_resources/port1.0/variant_descriptions.conf
121:debug:main No need to upgrade! zlib 1.2.5_0 >= zlib 1.2.5_0
122:debug:main Found Dependency: path: /usr/bin filename: gzip regex: ^gzip$
123:debug:main Found Dependency: path: /usr/bin filename: bzip2 regex: ^bzip2$
124:debug:main Found Dependency: path: /usr/bin filename: unzip regex: ^unzip$
125:msg:main --->  Computing dependencies for rpm:info:main .:debug:main Searching for dependency: expat
126:debug:main Found Dependency: receipt exists for expat
127:debug:main Searching for dependency: neon
128:debug:main Found Dependency: receipt exists for neon
129:debug:main Searching for dependency: python24
130:debug:main Didn't find receipt, going to depspec regex for: python24
131:debug:main Changing to port directory: /opt/local/var/macports/sources/rsync.macports.org/release/ports/lang/python24
132:debug:main OS darwin/11.0.0 (Mac OS X 10.7) arch i386
133:debug:main org.macports.load registered provides 'load', a pre-existing procedure. Target override will not be provided
134:debug:main org.macports.unload registered provides 'unload', a pre-existing procedure. Target override will not be provided
135:debug:main org.macports.distfiles registered provides 'distfiles', a pre-existing procedure. Target override will not be provided
136:debug:main Using group file /opt/local/var/macports/sources/rsync.macports.org/release/ports/_resources/port1.0/group/select-1.0.tcl
137:debug:main Reading variant descriptions from /opt/local/var/macports/sources/rsync.macports.org/release/ports/_resources/port1.0/variant_descriptions.conf
138:debug:main universal variant already exists, so not adding the default one
139:debug:main Searching for dependency: perl5.8
140:debug:main Didn't find receipt, going to depspec regex for: perl5.8
141:debug:main Changing to port directory: /opt/local/var/macports/sources/rsync.macports.org/release/ports/lang/perl5.8
142:debug:main OS darwin/11.0.0 (Mac OS X 10.7) arch i386
143:debug:main org.macports.load registered provides 'load', a pre-existing procedure. Target override will not be provided
144:debug:main org.macports.unload registered provides 'unload', a pre-existing procedure. Target override will not be provided
145:debug:main org.macports.distfiles registered provides 'distfiles', a pre-existing procedure. Target override will not be provided
146:debug:main adding the default universal variant
147:debug:main Reading variant descriptions from /opt/local/var/macports/sources/rsync.macports.org/release/ports/_resources/port1.0/variant_descriptions.conf
148:debug:main Searching for dependency: readline
149:debug:main Didn't find receipt, going to depspec regex for: readline
150:debug:main Changing to port directory: /opt/local/var/macports/sources/rsync.macports.org/release/ports/devel/readline
151:debug:main OS darwin/11.0.0 (Mac OS X 10.7) arch i386
152:debug:main org.macports.load registered provides 'load', a pre-existing procedure. Target override will not be provided
153:debug:main org.macports.unload registered provides 'unload', a pre-existing procedure. Target override will not be provided
154:debug:main org.macports.distfiles registered provides 'distfiles', a pre-existing procedure. Target override will not be provided
155:debug:main Using group file /opt/local/var/macports/sources/rsync.macports.org/release/ports/_resources/port1.0/group/muniversal-1.0.tcl
156:debug:main Reading variant descriptions from /opt/local/var/macports/sources/rsync.macports.org/release/ports/_resources/port1.0/variant_descriptions.conf
157:debug:main universal variant already exists, so not adding the default one
158:debug:main Searching for dependency: beecrypt
159:debug:main Found Dependency: receipt exists for beecrypt
160:debug:main Searching for dependency: libiconv
161:debug:main Found Dependency: receipt exists for libiconv
162:debug:main Searching for dependency: gettext
163:debug:main Found Dependency: receipt exists for gettext
164:debug:main Searching for dependency: readline
165:debug:main Didn't find receipt, going to depspec regex for: readline
166:debug:main Changing to port directory: /opt/local/var/macports/sources/rsync.macports.org/release/ports/devel/readline
167:debug:main OS darwin/11.0.0 (Mac OS X 10.7) arch i386
168:debug:main org.macports.load registered provides 'load', a pre-existing procedure. Target override will not be provided
169:debug:main org.macports.unload registered provides 'unload', a pre-existing procedure. Target override will not be provided
170:debug:main org.macports.distfiles registered provides 'distfiles', a pre-existing procedure. Target override will not be provided
171:debug:main Using group file /opt/local/var/macports/sources/rsync.macports.org/release/ports/_resources/port1.0/group/muniversal-1.0.tcl
172:debug:main Reading variant descriptions from /opt/local/var/macports/sources/rsync.macports.org/release/ports/_resources/port1.0/variant_descriptions.conf
173:debug:main universal variant already exists, so not adding the default one
174:debug:main Searching for dependency: popt
175:debug:main Didn't find receipt, going to depspec regex for: popt
176:debug:main Changing to port directory: /opt/local/var/macports/sources/rsync.macports.org/release/ports/devel/popt
177:debug:main OS darwin/11.0.0 (Mac OS X 10.7) arch i386
178:debug:main org.macports.load registered provides 'load', a pre-existing procedure. Target override will not be provided
179:debug:main org.macports.unload registered provides 'unload', a pre-existing procedure. Target override will not be provided
180:debug:main org.macports.distfiles registered provides 'distfiles', a pre-existing procedure. Target override will not be provided
181:debug:main adding the default universal variant
182:debug:main Reading variant descriptions from /opt/local/var/macports/sources/rsync.macports.org/release/ports/_resources/port1.0/variant_descriptions.conf
183:debug:main Searching for dependency: sqlite3
184:debug:main Didn't find receipt, going to depspec regex for: sqlite3
185:debug:main Changing to port directory: /opt/local/var/macports/sources/rsync.macports.org/release/ports/databases/sqlite3
186:debug:main OS darwin/11.0.0 (Mac OS X 10.7) arch i386
187:debug:main org.macports.load registered provides 'load', a pre-existing procedure. Target override will not be provided
188:debug:main org.macports.unload registered provides 'unload', a pre-existing procedure. Target override will not be provided
189:debug:main org.macports.distfiles registered provides 'distfiles', a pre-existing procedure. Target override will not be provided
190:debug:main adding the default universal variant
191:debug:main Reading variant descriptions from /opt/local/var/macports/sources/rsync.macports.org/release/ports/_resources/port1.0/variant_descriptions.conf
192:debug:main Searching for dependency: openssl
193:debug:main Found Dependency: receipt exists for openssl
194:debug:main Searching for dependency: gzip
195:debug:main Didn't find receipt, going to depspec regex for: gzip
196:debug:main Found Dependency: path: /usr/bin filename: gzip regex: ^gzip$
197:debug:main Found Dependency: path: /usr/bin filename: gzip regex: ^gzip$
198:debug:main Searching for dependency: bzip2
199:debug:main Didn't find receipt, going to depspec regex for: bzip2
200:debug:main Found Dependency: path: /usr/bin filename: bzip2 regex: ^bzip2$
201:debug:main Found Dependency: path: /usr/bin filename: bzip2 regex: ^bzip2$
202:debug:main Searching for dependency: unzip
203:debug:main Didn't find receipt, going to depspec regex for: unzip
204:debug:main Found Dependency: path: /usr/bin filename: unzip regex: ^unzip$
205:debug:main Found Dependency: path: /usr/bin filename: unzip regex: ^unzip$
206:info:main .:debug:main Searching for dependency: python_select
207:debug:main Didn't find receipt, going to depspec regex for: python_select
208:debug:main Changing to port directory: /opt/local/var/macports/sources/rsync.macports.org/release/ports/sysutils/python_select
209:debug:main OS darwin/11.0.0 (Mac OS X 10.7) arch i386
210:debug:main org.macports.load registered provides 'load', a pre-existing procedure. Target override will not be provided
211:debug:main org.macports.unload registered provides 'unload', a pre-existing procedure. Target override will not be provided
212:debug:main org.macports.distfiles registered provides 'distfiles', a pre-existing procedure. Target override will not be provided
213:debug:main Using group file /opt/local/var/macports/sources/rsync.macports.org/release/ports/_resources/port1.0/group/select-1.0.tcl
214:debug:main universal_variant is false, so not adding the default universal variant
215:info:main .:info:main .:info:main .:debug:main Searching for dependency: ncurses
216:debug:main Found Dependency: receipt exists for ncurses
217:info:main .:info:main .:info:main .:msg:main
218:msg:main --->  Dependencies to be installed: perl5.8 popt python24 python_select readline readline sqlite3
219:debug:main Starting logging for perl5.8
220:debug:clean Starting logging for popt
221:debug:clean Starting logging for python_select
222:debug:clean Starting logging for python24
223:debug:clean Starting logging for readline
224:debug:clean Starting logging for readline
225:debug:clean Starting logging for sqlite3
226:debug:main Executing org.macports.main (rpm)
227:debug:archivefetch archivefetch phase started at Tue Jul 26 00:44:09 EDT 2011
228:msg:archivefetch --->  Fetching archive for rpm
229:debug:archivefetch Executing org.macports.archivefetch (rpm)
230:info:archivefetch --->  rpm-4.4.9_11.darwin_11.x86_64.tbz doesn't seem to exist in /opt/local/var/macports/software/rpm
231:debug:fetch fetch phase started at Tue Jul 26 00:44:09 EDT 2011
232:notice:fetch --->  Fetching rpm
233:debug:fetch Executing org.macports.fetch (rpm)
234:info:fetch --->  rpm-4.4.9.tar.gz doesn't seem to exist in /opt/local/var/macports/distfiles/rpm
235:debug:fetch Pinging rpm5.org...
236:debug:fetch Pinging distfiles.macports.org...
237:debug:fetch Pinging aarnet.au.distfiles.macports.org...
238:debug:fetch Pinging her.gr.distfiles.macports.org...
239:debug:fetch Pinging lil.fr.distfiles.macports.org...
240:debug:fetch Pinging sea.us.distfiles.macports.org...
241:debug:fetch Pinging ykf.ca.distfiles.macports.org...
242:debug:fetch rpm5.org ping time is 522.351
243:debug:fetch distfiles.macports.org ping time is 655.304
244:debug:fetch aarnet.au.distfiles.macports.org ping time is 633.819
245:debug:fetch her.gr.distfiles.macports.org ping time is 626.160
246:debug:fetch lil.fr.distfiles.macports.org ping time is 610.944
247:debug:fetch sea.us.distfiles.macports.org ping time is 10000
248:debug:fetch ykf.ca.distfiles.macports.org ping time is 582.645
249:notice:fetch --->  Attempting to fetch rpm-4.4.9.tar.gz from http://rpm5.org/files/rpm/rpm-4.4
250:debug:checksum checksum phase started at Tue Jul 26 00:45:29 EDT 2011
251:notice:checksum --->  Verifying checksum(s) for rpm
252:debug:checksum Executing org.macports.checksum (rpm)
253:info:checksum --->  Checksumming rpm-4.4.9.tar.gz
254:debug:checksum Correct (md5) checksum for rpm-4.4.9.tar.gz
255:debug:extract extract phase started at Tue Jul 26 00:45:29 EDT 2011
256:notice:extract --->  Extracting rpm
257:debug:extract Executing org.macports.extract (rpm)
258:info:extract --->  Extracting rpm-4.4.9.tar.gz
259:debug:extract setting option extract.args to '/opt/local/var/macports/distfiles/rpm/rpm-4.4.9.tar.gz'
260:debug:extract Environment: CPATH='/opt/local/include' CC_PRINT_OPTIONS_FILE='/opt/local/var/macports/build/_opt_local_var_macports_sources_rsync.macports.org_release_ports_sysutils_rpm/rpm/work/.CC_PRINT_OPTIONS' LIBRARY_PATH='/opt/local/lib' CC_PRINT_OPTIONS='YES' MACOSX_DEPLOYMENT_TARGET='10.7'
261:debug:extract Assembled command: 'cd "/opt/local/var/macports/build/_opt_local_var_macports_sources_rsync.macports.org_release_ports_sysutils_rpm/rpm/work" && /usr/bin/gzip -dc '/opt/local/var/macports/distfiles/rpm/rpm-4.4.9.tar.gz' | /usr/bin/gnutar --no-same-owner -xf -'
262:debug:extract Executing command line:  cd "/opt/local/var/macports/build/_opt_local_var_macports_sources_rsync.macports.org_release_ports_sysutils_rpm/rpm/work" && /usr/bin/gzip -dc '/opt/local/var/macports/distfiles/rpm/rpm-4.4.9.tar.gz' | /usr/bin/gnutar --no-same-owner -xf -
263:debug:patch patch phase started at Tue Jul 26 00:45:35 EDT 2011
264:debug:patch Executing org.macports.patch (rpm)
265:notice:patch --->  Applying patches to rpm
266:info:patch --->  Applying /opt/local/var/macports/sources/rsync.macports.org/release/ports/sysutils/rpm/files/patch-neon.diff
267:debug:patch Environment: CPATH='/opt/local/include' CC_PRINT_OPTIONS_FILE='/opt/local/var/macports/build/_opt_local_var_macports_sources_rsync.macports.org_release_ports_sysutils_rpm/rpm/work/.CC_PRINT_OPTIONS' LIBRARY_PATH='/opt/local/lib' CC_PRINT_OPTIONS='YES' MACOSX_DEPLOYMENT_TARGET='10.7'
268:debug:patch Assembled command: 'cd "/opt/local/var/macports/build/_opt_local_var_macports_sources_rsync.macports.org_release_ports_sysutils_rpm/rpm/work/rpm-4.4.9" && /usr/bin/patch -p0'
269:debug:patch Executing command line:  cd "/opt/local/var/macports/build/_opt_local_var_macports_sources_rsync.macports.org_release_ports_sysutils_rpm/rpm/work/rpm-4.4.9" && /usr/bin/patch -p0 < '/opt/local/var/macports/sources/rsync.macports.org/release/ports/sysutils/rpm/files/patch-neon.diff'
270:info:patch patching file rpmio/rpmdav.c
271:info:patch Hunk #1 succeeded at 114 (offset 11 lines).
272:info:patch Hunk #2 succeeded at 135 (offset 11 lines).
273:info:patch Hunk #3 succeeded at 381 (offset 29 lines).
274:info:patch patching file rpmio/rpmurl.h
275:info:patch --->  Applying /opt/local/var/macports/sources/rsync.macports.org/release/ports/sysutils/rpm/files/patch-macros.in
276:debug:patch Environment: CPATH='/opt/local/include' CC_PRINT_OPTIONS_FILE='/opt/local/var/macports/build/_opt_local_var_macports_sources_rsync.macports.org_release_ports_sysutils_rpm/rpm/work/.CC_PRINT_OPTIONS' LIBRARY_PATH='/opt/local/lib' CC_PRINT_OPTIONS='YES' MACOSX_DEPLOYMENT_TARGET='10.7'
277:debug:patch Assembled command: 'cd "/opt/local/var/macports/build/_opt_local_var_macports_sources_rsync.macports.org_release_ports_sysutils_rpm/rpm/work/rpm-4.4.9" && /usr/bin/patch -p0'
278:debug:patch Executing command line:  cd "/opt/local/var/macports/build/_opt_local_var_macports_sources_rsync.macports.org_release_ports_sysutils_rpm/rpm/work/rpm-4.4.9" && /usr/bin/patch -p0 < '/opt/local/var/macports/sources/rsync.macports.org/release/ports/sysutils/rpm/files/patch-macros.in'
279:info:patch patching file macros.in
280:info:patch Hunk #5 succeeded at 669 (offset -1 lines).
281:info:patch Hunk #7 succeeded at 778 (offset -1 lines).
282:info:patch Hunk #8 succeeded at 909 (offset -1 lines).
283:info:patch Hunk #9 succeeded at 934 (offset -1 lines).
284:info:patch --->  Applying /opt/local/var/macports/sources/rsync.macports.org/release/ports/sysutils/rpm/files/patch-configure
285:debug:patch Environment: CPATH='/opt/local/include' CC_PRINT_OPTIONS_FILE='/opt/local/var/macports/build/_opt_local_var_macports_sources_rsync.macports.org_release_ports_sysutils_rpm/rpm/work/.CC_PRINT_OPTIONS' LIBRARY_PATH='/opt/local/lib' CC_PRINT_OPTIONS='YES' MACOSX_DEPLOYMENT_TARGET='10.7'
286:debug:patch Assembled command: 'cd "/opt/local/var/macports/build/_opt_local_var_macports_sources_rsync.macports.org_release_ports_sysutils_rpm/rpm/work/rpm-4.4.9" && /usr/bin/patch -p0'
287:debug:patch Executing command line:  cd "/opt/local/var/macports/build/_opt_local_var_macports_sources_rsync.macports.org_release_ports_sysutils_rpm/rpm/work/rpm-4.4.9" && /usr/bin/patch -p0 < '/opt/local/var/macports/sources/rsync.macports.org/release/ports/sysutils/rpm/files/patch-configure'
288:info:patch patching file configure
289:info:patch --->  Applying /opt/local/var/macports/sources/rsync.macports.org/release/ports/sysutils/rpm/files/patch-db3-configure
290:debug:patch Environment: CPATH='/opt/local/include' CC_PRINT_OPTIONS_FILE='/opt/local/var/macports/build/_opt_local_var_macports_sources_rsync.macports.org_release_ports_sysutils_rpm/rpm/work/.CC_PRINT_OPTIONS' LIBRARY_PATH='/opt/local/lib' CC_PRINT_OPTIONS='YES' MACOSX_DEPLOYMENT_TARGET='10.7'
291:debug:patch Assembled command: 'cd "/opt/local/var/macports/build/_opt_local_var_macports_sources_rsync.macports.org_release_ports_sysutils_rpm/rpm/work/rpm-4.4.9" && /usr/bin/patch -p0'
292:debug:patch Executing command line:  cd "/opt/local/var/macports/build/_opt_local_var_macports_sources_rsync.macports.org_release_ports_sysutils_rpm/rpm/work/rpm-4.4.9" && /usr/bin/patch -p0 < '/opt/local/var/macports/sources/rsync.macports.org/release/ports/sysutils/rpm/files/patch-db3-configure'
293:info:patch patching file db3/configure
294:info:patch --->  Applying /opt/local/var/macports/sources/rsync.macports.org/release/ports/sysutils/rpm/files/patch-Makefile.PL
295:debug:patch Environment: CPATH='/opt/local/include' CC_PRINT_OPTIONS_FILE='/opt/local/var/macports/build/_opt_local_var_macports_sources_rsync.macports.org_release_ports_sysutils_rpm/rpm/work/.CC_PRINT_OPTIONS' LIBRARY_PATH='/opt/local/lib' CC_PRINT_OPTIONS='YES' MACOSX_DEPLOYMENT_TARGET='10.7'
296:debug:patch Assembled command: 'cd "/opt/local/var/macports/build/_opt_local_var_macports_sources_rsync.macports.org_release_ports_sysutils_rpm/rpm/work/rpm-4.4.9" && /usr/bin/patch -p0'
297:debug:patch Executing command line:  cd "/opt/local/var/macports/build/_opt_local_var_macports_sources_rsync.macports.org_release_ports_sysutils_rpm/rpm/work/rpm-4.4.9" && /usr/bin/patch -p0 < '/opt/local/var/macports/sources/rsync.macports.org/release/ports/sysutils/rpm/files/patch-Makefile.PL'
298:info:patch patching file perl/Makefile.PL
299:info:patch --->  Applying /opt/local/var/macports/sources/rsync.macports.org/release/ports/sysutils/rpm/files/patch-darwin.prov
300:debug:patch Environment: CPATH='/opt/local/include' CC_PRINT_OPTIONS_FILE='/opt/local/var/macports/build/_opt_local_var_macports_sources_rsync.macports.org_release_ports_sysutils_rpm/rpm/work/.CC_PRINT_OPTIONS' LIBRARY_PATH='/opt/local/lib' CC_PRINT_OPTIONS='YES' MACOSX_DEPLOYMENT_TARGET='10.7'
301:debug:patch Assembled command: 'cd "/opt/local/var/macports/build/_opt_local_var_macports_sources_rsync.macports.org_release_ports_sysutils_rpm/rpm/work/rpm-4.4.9" && /usr/bin/patch -p0'
302:debug:patch Executing command line:  cd "/opt/local/var/macports/build/_opt_local_var_macports_sources_rsync.macports.org_release_ports_sysutils_rpm/rpm/work/rpm-4.4.9" && /usr/bin/patch -p0 < '/opt/local/var/macports/sources/rsync.macports.org/release/ports/sysutils/rpm/files/patch-darwin.prov'
303:info:patch patching file autodeps/darwin.prov
304:info:patch patching file autodeps/darwin.prov
305:info:patch --->  Applying /opt/local/var/macports/sources/rsync.macports.org/release/ports/sysutils/rpm/files/patch-fts.c
306:debug:patch Environment: CPATH='/opt/local/include' CC_PRINT_OPTIONS_FILE='/opt/local/var/macports/build/_opt_local_var_macports_sources_rsync.macports.org_release_ports_sysutils_rpm/rpm/work/.CC_PRINT_OPTIONS' LIBRARY_PATH='/opt/local/lib' CC_PRINT_OPTIONS='YES' MACOSX_DEPLOYMENT_TARGET='10.7'
307:debug:patch Assembled command: 'cd "/opt/local/var/macports/build/_opt_local_var_macports_sources_rsync.macports.org_release_ports_sysutils_rpm/rpm/work/rpm-4.4.9" && /usr/bin/patch -p0'
308:debug:patch Executing command line:  cd "/opt/local/var/macports/build/_opt_local_var_macports_sources_rsync.macports.org_release_ports_sysutils_rpm/rpm/work/rpm-4.4.9" && /usr/bin/patch -p0 < '/opt/local/var/macports/sources/rsync.macports.org/release/ports/sysutils/rpm/files/patch-fts.c'
309:info:patch patching file rpmio/fts.c
310:info:patch --->  Applying /opt/local/var/macports/sources/rsync.macports.org/release/ports/sysutils/rpm/files/patch-rpmdav.c
311:debug:patch Environment: CPATH='/opt/local/include' CC_PRINT_OPTIONS_FILE='/opt/local/var/macports/build/_opt_local_var_macports_sources_rsync.macports.org_release_ports_sysutils_rpm/rpm/work/.CC_PRINT_OPTIONS' LIBRARY_PATH='/opt/local/lib' CC_PRINT_OPTIONS='YES' MACOSX_DEPLOYMENT_TARGET='10.7'
312:debug:patch Assembled command: 'cd "/opt/local/var/macports/build/_opt_local_var_macports_sources_rsync.macports.org_release_ports_sysutils_rpm/rpm/work/rpm-4.4.9" && /usr/bin/patch -p0'
313:debug:patch Executing command line:  cd "/opt/local/var/macports/build/_opt_local_var_macports_sources_rsync.macports.org_release_ports_sysutils_rpm/rpm/work/rpm-4.4.9" && /usr/bin/patch -p0 < '/opt/local/var/macports/sources/rsync.macports.org/release/ports/sysutils/rpm/files/patch-rpmdav.c'
314:info:patch patching file rpmio/rpmdav.c
315:info:patch Hunk #1 succeeded at 1681 (offset 2 lines).
316:info:patch --->  Applying /opt/local/var/macports/sources/rsync.macports.org/release/ports/sysutils/rpm/files/patch-rpmsq.c
317:debug:patch Environment: CPATH='/opt/local/include' CC_PRINT_OPTIONS_FILE='/opt/local/var/macports/build/_opt_local_var_macports_sources_rsync.macports.org_release_ports_sysutils_rpm/rpm/work/.CC_PRINT_OPTIONS' LIBRARY_PATH='/opt/local/lib' CC_PRINT_OPTIONS='YES' MACOSX_DEPLOYMENT_TARGET='10.7'
318:debug:patch Assembled command: 'cd "/opt/local/var/macports/build/_opt_local_var_macports_sources_rsync.macports.org_release_ports_sysutils_rpm/rpm/work/rpm-4.4.9" && /usr/bin/patch -p0'
319:debug:patch Executing command line:  cd "/opt/local/var/macports/build/_opt_local_var_macports_sources_rsync.macports.org_release_ports_sysutils_rpm/rpm/work/rpm-4.4.9" && /usr/bin/patch -p0 < '/opt/local/var/macports/sources/rsync.macports.org/release/ports/sysutils/rpm/files/patch-rpmsq.c'
320:info:patch patching file rpmio/rpmsq.c
321:info:patch --->  Applying /opt/local/var/macports/sources/rsync.macports.org/release/ports/sysutils/rpm/files/patch-rpmevr.h
322:debug:patch Environment: CPATH='/opt/local/include' CC_PRINT_OPTIONS_FILE='/opt/local/var/macports/build/_opt_local_var_macports_sources_rsync.macports.org_release_ports_sysutils_rpm/rpm/work/.CC_PRINT_OPTIONS' LIBRARY_PATH='/opt/local/lib' CC_PRINT_OPTIONS='YES' MACOSX_DEPLOYMENT_TARGET='10.7'
323:debug:patch Assembled command: 'cd "/opt/local/var/macports/build/_opt_local_var_macports_sources_rsync.macports.org_release_ports_sysutils_rpm/rpm/work/rpm-4.4.9" && /usr/bin/patch -p0'
324:debug:patch Executing command line:  cd "/opt/local/var/macports/build/_opt_local_var_macports_sources_rsync.macports.org_release_ports_sysutils_rpm/rpm/work/rpm-4.4.9" && /usr/bin/patch -p0 < '/opt/local/var/macports/sources/rsync.macports.org/release/ports/sysutils/rpm/files/patch-rpmevr.h'
325:info:patch patching file lib/rpmevr.h
326:info:patch patching file ./lib/rpmevr.h
327:info:patch Hunk #1 succeeded at 22 (offset 4 lines).
328:info:patch Hunk #2 succeeded at 69 (offset 4 lines).
329:info:patch --->  Applying /opt/local/var/macports/sources/rsync.macports.org/release/ports/sysutils/rpm/files/patch-parseBuildInstallClean.c
330:debug:patch Environment: CPATH='/opt/local/include' CC_PRINT_OPTIONS_FILE='/opt/local/var/macports/build/_opt_local_var_macports_sources_rsync.macports.org_release_ports_sysutils_rpm/rpm/work/.CC_PRINT_OPTIONS' LIBRARY_PATH='/opt/local/lib' CC_PRINT_OPTIONS='YES' MACOSX_DEPLOYMENT_TARGET='10.7'
331:debug:patch Assembled command: 'cd "/opt/local/var/macports/build/_opt_local_var_macports_sources_rsync.macports.org_release_ports_sysutils_rpm/rpm/work/rpm-4.4.9" && /usr/bin/patch -p0'
332:debug:patch Executing command line:  cd "/opt/local/var/macports/build/_opt_local_var_macports_sources_rsync.macports.org_release_ports_sysutils_rpm/rpm/work/rpm-4.4.9" && /usr/bin/patch -p0 < '/opt/local/var/macports/sources/rsync.macports.org/release/ports/sysutils/rpm/files/patch-parseBuildInstallClean.c'
333:info:patch patching file build/parseBuildInstallClean.c
334:info:patch --->  Applying /opt/local/var/macports/sources/rsync.macports.org/release/ports/sysutils/rpm/files/patch-scripts-brp-nobuildrootpath
335:debug:patch Environment: CPATH='/opt/local/include' CC_PRINT_OPTIONS_FILE='/opt/local/var/macports/build/_opt_local_var_macports_sources_rsync.macports.org_release_ports_sysutils_rpm/rpm/work/.CC_PRINT_OPTIONS' LIBRARY_PATH='/opt/local/lib' CC_PRINT_OPTIONS='YES' MACOSX_DEPLOYMENT_TARGET='10.7'
336:debug:patch Assembled command: 'cd "/opt/local/var/macports/build/_opt_local_var_macports_sources_rsync.macports.org_release_ports_sysutils_rpm/rpm/work/rpm-4.4.9" && /usr/bin/patch -p0'
337:debug:patch Executing command line:  cd "/opt/local/var/macports/build/_opt_local_var_macports_sources_rsync.macports.org_release_ports_sysutils_rpm/rpm/work/rpm-4.4.9" && /usr/bin/patch -p0 < '/opt/local/var/macports/sources/rsync.macports.org/release/ports/sysutils/rpm/files/patch-scripts-brp-nobuildrootpath'
338:info:patch patching file scripts/brp-nobuildrootpath
339:debug:patch Executing proc-post-org.macports.patch-patch-0
340:debug:patch delete: /opt/local/var/macports/build/_opt_local_var_macports_sources_rsync.macports.org_release_ports_sysutils_rpm/rpm/work/rpm-4.4.9/popt
341:debug:configure configure phase started at Tue Jul 26 00:45:35 EDT 2011
342:notice:configure --->  Configuring rpm
343:debug:configure Using compiler 'Mac OS X llvm-gcc 4.2'
344:debug:configure Executing org.macports.configure (rpm)
345:debug:configure Environment: CPATH='/opt/local/include' __PYTHON='/opt/local/bin/python2.4' CFLAGS='-O2 -arch x86_64' CPPFLAGS='-I/opt/local/include -I/opt/local/Library/Frameworks/Python.framework/Versions/2.4/include/python2.4' CXXFLAGS='-O2 -arch x86_64' LIBRARY_PATH='/opt/local/lib' MACOSX_DEPLOYMENT_TARGET='10.7' CXX='/Developer/usr/bin/llvm-g++-4.2' CC_PRINT_OPTIONS_FILE='/opt/local/var/macports/build/_opt_local_var_macports_sources_rsync.macports.org_release_ports_sysutils_rpm/rpm/work/.CC_PRINT_OPTIONS' F90FLAGS='-O2 -m64' LDFLAGS='-L/opt/local/lib -arch x86_64' FCFLAGS='-O2 -m64' OBJC='/Developer/usr/bin/llvm-gcc-4.2' INSTALL='/usr/bin/install -c' ac_cv_lib_sqlite_sqlite3_open='yes' __PERL='/opt/local/bin/perl5.8' FFLAGS='-O2 -m64' OBJCFLAGS='-O2 -arch x86_64' CC_PRINT_OPTIONS='YES' CC='/Developer/usr/bin/llvm-gcc-4.2'
346:debug:configure Assembled command: 'cd "/opt/local/var/macports/build/_opt_local_var_macports_sources_rsync.macports.org_release_ports_sysutils_rpm/rpm/work/rpm-4.4.9" && ./configure --prefix=/opt/local --disable-nls --without-javaglue --without-included-gettext --with-libintl-prefix=/opt/local --with-libiconv-prefix=/opt/local --mandir=/opt/local/share/man --infodir=/opt/local/share/info --with-python=2.4 --with-perl=5.8 --without-apidocs --sysconfdir=/opt/local/etc --disable-optimized --disable-aio --with-glob --enable-broken-chown --disable-rpath'
347:debug:configure Executing command line:  cd "/opt/local/var/macports/build/_opt_local_var_macports_sources_rsync.macports.org_release_ports_sysutils_rpm/rpm/work/rpm-4.4.9" && ./configure --prefix=/opt/local --disable-nls --without-javaglue --without-included-gettext --with-libintl-prefix=/opt/local --with-libiconv-prefix=/opt/local --mandir=/opt/local/share/man --infodir=/opt/local/share/info --with-python=2.4 --with-perl=5.8 --without-apidocs --sysconfdir=/opt/local/etc --disable-optimized --disable-aio --with-glob --enable-broken-chown --disable-rpath
348:info:configure checking build system type... i386-apple-darwin11.0.0
349:info:configure checking host system type... i386-apple-darwin11.0.0
350:info:configure checking target system type... i386-apple-darwin11.0.0
351:info:configure checking for a BSD-compatible install... /usr/bin/install -c
352:info:configure checking whether build environment is sane... yes
353:info:configure checking for a thread-safe mkdir -p... ./install-sh -c -d
354:info:configure checking for gawk... no
355:info:configure checking for mawk... no
356:info:configure checking for nawk... no
357:info:configure checking for awk... awk
358:info:configure checking whether make sets $(MAKE)... yes
359:info:configure checking for C++ compiler default output file name... a.out
360:info:configure checking whether the C++ compiler works... yes
361:info:configure checking whether we are cross compiling... no
362:info:configure checking for suffix of executables...
363:info:configure checking for suffix of object files... o
364:info:configure checking whether we are using the GNU C++ compiler... yes
365:info:configure checking whether /Developer/usr/bin/llvm-g++-4.2 accepts -g... yes
366:info:configure checking for style of include used by make... GNU
367:info:configure checking dependency style of /Developer/usr/bin/llvm-g++-4.2... gcc3
368:info:configure checking for gawk... (cached) awk
369:info:configure checking for gcc... /Developer/usr/bin/llvm-gcc-4.2
370:info:configure checking whether we are using the GNU C compiler... yes
371:info:configure checking whether /Developer/usr/bin/llvm-gcc-4.2 accepts -g... yes
372:info:configure checking for /Developer/usr/bin/llvm-gcc-4.2 option to accept ISO C89... none needed
373:info:configure checking dependency style of /Developer/usr/bin/llvm-gcc-4.2... gcc3
374:info:configure checking how to run the C preprocessor... /Developer/usr/bin/llvm-gcc-4.2 -E
375:info:configure checking for a BSD-compatible install... /usr/bin/install -c
376:info:configure checking whether ln -s works... yes
377:info:configure checking whether make sets $(MAKE)... (cached) yes
378:info:configure checking for bison... bison -y
379:info:configure checking for grep that handles long lines and -e... /usr/bin/grep
380:info:configure checking for egrep... /usr/bin/grep -E
381:info:configure checking for AIX... no
382:info:configure checking for ANSI C header files... yes
383:info:configure checking for sys/types.h... yes
384:info:configure checking for sys/stat.h... yes
385:info:configure checking for stdlib.h... yes
386:info:configure checking for string.h... yes
387:info:configure checking for memory.h... yes
388:info:configure checking for strings.h... yes
389:info:configure checking for inttypes.h... yes
390:info:configure checking for stdint.h... yes
391:info:configure checking for unistd.h... yes
392:info:configure checking minix/config.h usability... no
393:info:configure checking minix/config.h presence... no
394:info:configure checking for minix/config.h... no
395:info:configure checking whether /Developer/usr/bin/llvm-gcc-4.2 needs -traditional... no
396:info:configure checking for special C compiler options needed for large files... no
397:info:configure checking for _FILE_OFFSET_BITS value needed for large files... no
398:info:configure checking whether va_list assignments need array notation... yes
399:info:configure checking for ctags... /usr/bin/ctags
400:info:configure checking for cscope... /bin/true
401:info:configure checking flag used by libtool to link rpm... -pie
402:info:configure checking POSIX chmod... yes
403:info:configure checking for mkdir... /bin/mkdir
404:info:configure checking if /bin/mkdir supports -p... yes
405:info:configure checking for library containing strerror... none required
406:info:configure checking for function prototypes... yes
407:info:configure checking for string.h... (cached) yes
408:info:configure checking for a sed that does not truncate output... /usr/bin/sed
409:info:configure checking for ld used by /Developer/usr/bin/llvm-gcc-4.2... /Developer/usr/llvm-gcc-4.2/libexec/gcc/i686-apple-darwin11/4.2.1/ld
410:info:configure checking if the linker (/Developer/usr/llvm-gcc-4.2/libexec/gcc/i686-apple-darwin11/4.2.1/ld) is GNU ld... no
411:info:configure checking for /Developer/usr/llvm-gcc-4.2/libexec/gcc/i686-apple-darwin11/4.2.1/ld option to reload object files... -r
412:info:configure checking for BSD-compatible nm... /usr/bin/nm
413:info:configure checking how to recognise dependent libraries... pass_all
414:info:configure checking dlfcn.h usability... yes
415:info:configure checking dlfcn.h presence... yes
416:info:configure checking for dlfcn.h... yes
417:info:configure checking how to run the C++ preprocessor... /Developer/usr/bin/llvm-g++-4.2 -E
418:info:configure checking for g77... no
419:info:configure checking for xlf... no
420:info:configure checking for f77... no
421:info:configure checking for frt... no
422:info:configure checking for pgf77... no
423:info:configure checking for cf77... no
424:info:configure checking for fort77... no
425:info:configure checking for fl32... no
426:info:configure checking for af77... no
427:info:configure checking for xlf90... no
428:info:configure checking for f90... no
429:info:configure checking for pgf90... no
430:info:configure checking for pghpf... no
431:info:configure checking for epcf90... no
432:info:configure checking for gfortran... no
433:info:configure checking for g95... no
434:info:configure checking for xlf95... no
435:info:configure checking for f95... no
436:info:configure checking for fort... no
437:info:configure checking for ifort... no
438:info:configure checking for ifc... no
439:info:configure checking for efc... no
440:info:configure checking for pgf95... no
441:info:configure checking for lf95... no
442:info:configure checking for ftn... no
443:info:configure checking whether we are using the GNU Fortran 77 compiler... no
444:info:configure checking whether  accepts -g... no
445:info:configure checking the maximum length of command line arguments... 196608
446:info:configure checking command to parse /usr/bin/nm output from /Developer/usr/bin/llvm-gcc-4.2 object... ok
447:info:configure checking for objdir... .libs
448:info:configure checking for ar... ar
449:info:configure checking for ranlib... ranlib
450:info:configure checking for strip... strip
451:info:configure checking if /Developer/usr/bin/llvm-gcc-4.2 supports -fno-rtti -fno-exceptions... no
452:info:configure checking for /Developer/usr/bin/llvm-gcc-4.2 option to produce PIC... -fno-common
453:info:configure checking if /Developer/usr/bin/llvm-gcc-4.2 PIC flag -fno-common works... yes
454:info:configure checking if /Developer/usr/bin/llvm-gcc-4.2 static flag -static works... no
455:info:configure checking if /Developer/usr/bin/llvm-gcc-4.2 supports -c -o file.o... yes
456:info:configure checking whether the /Developer/usr/bin/llvm-gcc-4.2 linker (/Developer/usr/llvm-gcc-4.2/libexec/gcc/i686-apple-darwin11/4.2.1/ld) supports shared libraries... yes
457:info:configure checking dynamic linker characteristics... darwin11.0.0 dyld
458:info:configure checking how to hardcode library paths into programs... immediate
459:info:configure checking whether stripping libraries is possible... yes
460:info:configure checking if libtool supports shared libraries... yes
461:info:configure checking whether to build shared libraries... yes
462:info:configure checking whether to build static libraries... yes
463:info:configure configure: creating libtool
464:info:configure appending configuration tag "CXX" to libtool
465:info:configure checking for ld used by /Developer/usr/bin/llvm-g++-4.2... /Developer/usr/llvm-gcc-4.2/libexec/gcc/i686-apple-darwin11/4.2.1/ld
466:info:configure checking if the linker (/Developer/usr/llvm-gcc-4.2/libexec/gcc/i686-apple-darwin11/4.2.1/ld) is GNU ld... no
467:info:configure checking whether the /Developer/usr/bin/llvm-g++-4.2 linker (/Developer/usr/llvm-gcc-4.2/libexec/gcc/i686-apple-darwin11/4.2.1/ld) supports shared libraries... yes
468:info:configure checking for /Developer/usr/bin/llvm-g++-4.2 option to produce PIC... -fno-common
469:info:configure checking if /Developer/usr/bin/llvm-g++-4.2 PIC flag -fno-common works... yes
470:info:configure checking if /Developer/usr/bin/llvm-g++-4.2 static flag -static works... no
471:info:configure checking if /Developer/usr/bin/llvm-g++-4.2 supports -c -o file.o... yes
472:info:configure checking whether the /Developer/usr/bin/llvm-g++-4.2 linker (/Developer/usr/llvm-gcc-4.2/libexec/gcc/i686-apple-darwin11/4.2.1/ld) supports shared libraries... yes
473:info:configure checking dynamic linker characteristics... darwin11.0.0 dyld
474:info:configure checking how to hardcode library paths into programs... immediate
475:info:configure appending configuration tag "F77" to libtool
476:info:configure checking for ar... (cached) ar
477:info:configure checking for bash... /bin/bash
478:info:configure checking for bzip2... /usr/bin/bzip2
479:info:configure checking for cat... /bin/cat
480:info:configure checking for chgrp... /usr/bin/chgrp
481:info:configure checking for chmod... /bin/chmod
482:info:configure checking for chown... /usr/sbin/chown
483:info:configure checking for cp... /bin/cp
484:info:configure checking for cpio... /usr/bin/cpio
485:info:configure checking for curl... /usr/bin/curl
486:info:configure checking for cvs... /usr/bin/cvs
487:info:configure checking for diff... /usr/bin/diff
488:info:configure checking for ditto... /usr/bin/ditto
489:info:configure checking for file... /usr/bin/file
490:info:configure checking for find... /usr/bin/find
491:info:configure checking for gpg... %{_bindir}/gpg
492:info:configure checking for grep... /usr/bin/grep
493:info:configure checking for gzip... /usr/bin/gzip
494:info:configure checking for hg... %{_bindir}/hg
495:info:configure checking for id... /usr/bin/id
496:info:configure checking checking whether id supports -u... yes
497:info:configure checking for install... /usr/bin/install
498:info:configure checking for install-info... /usr/bin/install-info
499:info:configure checking for ldconfig... /sbin/ldconfig
500:info:configure checking for lua... %{_bindir}/lua
501:info:configure checking for lzma... %{_bindir}/lzma
502:info:configure checking for lzmash... %{_bindir}/lzmash
503:info:configure checking for lzop... %{_bindir}/lzop
504:info:configure checking for make... /usr/bin/make
505:info:configure checking for mkdir... /bin/mkdir
506:info:configure checking for mv... /bin/mv
507:info:configure checking for patch... /usr/bin/patch
508:info:configure checking old version of patch... patch later then 2.2 found
509:info:configure checking for pax... /bin/pax
510:info:configure checking for perl... /opt/local/bin/perl5.8
511:info:configure checking for pgp... %{_bindir}/pgp
512:info:configure checking for php... /usr/bin/php
513:info:configure checking for python... /opt/local/bin/python2.4
514:info:configure checking for rm... /bin/rm
515:info:configure checking for rsh... /usr/bin/rsh
516:info:configure checking for sed... /usr/bin/sed
517:info:configure checking for sh... /bin/sh
518:info:configure checking for ssh... /usr/bin/ssh
519:info:configure checking for svn... /usr/bin/svn
520:info:configure checking for tar... /usr/bin/tar
521:info:configure checking for tclsh... /usr/bin/tclsh
522:info:configure checking for unzip... /usr/bin/unzip
523:info:configure checking for wget... %{_bindir}/wget
524:info:configure checking for xar... /usr/bin/xar
525:info:configure checking for ld... /usr/bin/ld
526:info:configure checking for nm... /usr/bin/nm
527:info:configure checking for objcopy... %{_bindir}/objcopy
528:info:configure checking for objdump... %{_bindir}/objdump
529:info:configure checking for strip... /usr/bin/strip
530:info:configure checking for bzread in -lbz2... no
531:info:configure checking for BZ2_bzread in -lbz2... yes
532:info:configure checking for /opt/local/lib in LIBS... yes
533:info:configure checking for /opt/local/include in INCPATH... yes
534:info:configure checking for /usr/ucblib in LIBS... checking for setreuid... yes
535:info:configure checking for rand... yes
536:info:configure checking for getdomainname... yes
537:info:configure checking for socket... yes
538:info:configure checking error.h usability... no
539:info:configure checking error.h presence... no
540:info:configure checking for error.h... no
541:info:configure checking for error... no
542:info:configure checking poll.h usability... yes
543:info:configure checking poll.h presence... yes
544:info:configure checking for poll.h... yes
545:info:configure checking thread.h usability... no
546:info:configure checking thread.h presence... no
547:info:configure checking for thread.h... no
548:info:configure checking pthread.h usability... yes
549:info:configure checking pthread.h presence... yes
550:info:configure checking for pthread.h... yes
551:info:configure checking synch.h usability... no
552:info:configure checking synch.h presence... no
553:info:configure checking for synch.h... no
554:info:configure checking semaphore.h usability... yes
555:info:configure checking semaphore.h presence... yes
556:info:configure checking for semaphore.h... yes
557:info:configure checking for pthread_mutex_trylock in -lpthread... yes
558:info:configure checking aio.h usability... yes
559:info:configure checking aio.h presence... yes
560:info:configure checking for aio.h... yes
561:info:configure checking for library containing aio_read... none required
562:info:configure checking for fchmod... yes
563:info:configure checking for vsnprintf... yes
564:info:configure checking for snprintf... yes
565:info:configure checking for writev in -lport... no
566:info:configure checking libelf.h usability... no
567:info:configure checking libelf.h presence... no
568:info:configure checking for libelf.h... no
569:info:configure checking if libelf.h conflicts with _LARGEFILE_SOURCE... no
570:info:configure checking gelf.h usability... no
571:info:configure checking gelf.h presence... no
572:info:configure checking for gelf.h... no
573:info:configure checking if gelf.h conflicts with _LARGEFILE_SOURCE... no
574:info:configure checking dwarf.h usability... no
575:info:configure checking dwarf.h presence... no
576:info:configure checking for dwarf.h... no
577:info:configure checking beecrypt/beecrypt.h usability... yes
578:info:configure checking beecrypt/beecrypt.h presence... yes
579:info:configure checking for beecrypt/beecrypt.h... yes
580:info:configure checking for mpfprintln in -lbeecrypt... yes
581:info:configure checking beecrypt/api.h usability... yes
582:info:configure checking beecrypt/api.h presence... yes
583:info:configure checking for beecrypt/api.h... yes
584:info:configure checking neon/ne_session.h usability... yes
585:info:configure checking neon/ne_session.h presence... yes
586:info:configure checking for neon/ne_session.h... yes
587:info:configure checking for ne_session_create in -lneon... yes
588:info:configure checking for ne_get_response_header in -lneon... yes
589:info:configure checking for ne_send_request_chunk in -lneon... no
590:info:configure checking popt.h usability... yes
591:info:configure checking popt.h presence... yes
592:info:configure checking for popt.h... yes
593:info:configure checking for poptGetContext in -lpopt... yes
594:info:configure checking sqlite3.h usability... yes
595:info:configure checking sqlite3.h presence... yes
596:info:configure checking for sqlite3.h... yes
597:info:configure checking for sqlite3_open in -lsqlite... (cached) yes
598:info:configure checking locale.h usability... yes
599:info:configure checking locale.h presence... yes
600:info:configure checking for locale.h... yes
601:info:configure checking whether NLS is requested... no
602:info:configure checking for msgfmt... /opt/local/bin/msgfmt
603:info:configure checking for gmsgfmt... /opt/local/bin/msgfmt
604:info:configure checking for xgettext... /opt/local/bin/xgettext
605:info:configure checking for msgmerge... /opt/local/bin/msgmerge
606:info:configure checking for ld used by GCC... /Developer/usr/llvm-gcc-4.2/libexec/gcc/i686-apple-darwin11/4.2.1/ld
607:info:configure checking if the linker (/Developer/usr/llvm-gcc-4.2/libexec/gcc/i686-apple-darwin11/4.2.1/ld) is GNU ld... no
608:info:configure checking for shared library run path origin... done
609:info:configure checking for CFPreferencesCopyAppValue... yes
610:info:configure checking for CFLocaleCopyCurrent... yes
611:info:configure checking whether to use NLS... no
612:info:configure checking for ANSI C header files... (cached) yes
613:info:configure checking whether sys/types.h defines makedev... yes
614:info:configure checking for dirent.h that defines DIR... yes
615:info:configure checking for library containing opendir... none required
616:info:configure checking whether time.h and sys/time.h may both be included... yes
617:info:configure checking fcntl.h usability... yes
618:info:configure checking fcntl.h presence... yes
619:info:configure checking for fcntl.h... yes
620:info:configure checking getopt.h usability... yes
621:info:configure checking getopt.h presence... yes
622:info:configure checking for getopt.h... yes
623:info:configure checking grp.h usability... yes
624:info:configure checking grp.h presence... yes
625:info:configure checking for grp.h... yes
626:info:configure checking for memory.h... (cached) yes
627:info:configure checking netdb.h usability... yes
628:info:configure checking netdb.h presence... yes
629:info:configure checking for netdb.h... yes
630:info:configure checking pwd.h usability... yes
631:info:configure checking pwd.h presence... yes
632:info:configure checking for pwd.h... yes
633:info:configure checking utime.h usability... yes
634:info:configure checking utime.h presence... yes
635:info:configure checking for utime.h... yes
636:info:configure checking signal.h usability... yes
637:info:configure checking signal.h presence... yes
638:info:configure checking for signal.h... yes
639:info:configure checking sys/ipc.h usability... yes
640:info:configure checking sys/ipc.h presence... yes
641:info:configure checking for sys/ipc.h... yes
642:info:configure checking sys/socket.h usability... yes
643:info:configure checking sys/socket.h presence... yes
644:info:configure checking for sys/socket.h... yes
645:info:configure checking sys/select.h usability... yes
646:info:configure checking sys/select.h presence... yes
647:info:configure checking for sys/select.h... yes
648:info:configure checking for sys/types.h... (cached) yes
649:info:configure checking sys/stdtypes.h usability... no
650:info:configure checking sys/stdtypes.h presence... no
651:info:configure checking for sys/stdtypes.h... no
652:info:configure checking sys/mman.h usability... yes
653:info:configure checking sys/mman.h presence... yes
654:info:configure checking for sys/mman.h... yes
655:info:configure checking sys/resource.h usability... yes
656:info:configure checking sys/resource.h presence... yes
657:info:configure checking for sys/resource.h... yes
658:info:configure checking sys/utsname.h usability... yes
659:info:configure checking sys/utsname.h presence... yes
660:info:configure checking for sys/utsname.h... yes
661:info:configure checking sys/wait.h usability... yes
662:info:configure checking sys/wait.h presence... yes
663:info:configure checking for sys/wait.h... yes
664:info:configure checking netinet/in_systm.h usability... yes
665:info:configure checking netinet/in_systm.h presence... yes
666:info:configure checking for netinet/in_systm.h... yes
667:info:configure checking machine/types.h usability... yes
668:info:configure checking machine/types.h presence... yes
669:info:configure checking for machine/types.h... yes
670:info:configure checking mntent.h usability... no
671:info:configure checking mntent.h presence... no
672:info:configure checking for mntent.h... no
673:info:configure checking sys/mnttab.h usability... no
674:info:configure checking sys/mnttab.h presence... no
675:info:configure checking for sys/mnttab.h... no
676:info:configure checking sys/systemcfg.h usability... no
677:info:configure checking sys/systemcfg.h presence... no
678:info:configure checking for sys/systemcfg.h... no
679:info:configure checking sys/mount.h usability... yes
680:info:configure checking sys/mount.h presence... yes
681:info:configure checking for sys/mount.h... yes
682:info:configure checking sys/mntctl.h usability... no
683:info:configure checking sys/mntctl.h presence... no
684:info:configure checking for sys/mntctl.h... no
685:info:configure checking sys/param.h usability... yes
686:info:configure checking sys/param.h presence... yes
687:info:configure checking for sys/param.h... yes
688:info:configure checking sys/vmount.h usability... no
689:info:configure checking sys/vmount.h presence... no
690:info:configure checking for sys/vmount.h... no
691:info:configure checking bzlib.h usability... yes
692:info:configure checking bzlib.h presence... yes
693:info:configure checking for bzlib.h... yes
694:info:configure checking libio.h usability... no
695:info:configure checking libio.h presence... no
696:info:configure checking for libio.h... no
697:info:configure checking zlib.h usability... yes
698:info:configure checking zlib.h presence... yes
699:info:configure checking for zlib.h... yes
700:info:configure checking err.h usability... yes
701:info:configure checking err.h presence... yes
702:info:configure checking for err.h... yes
703:info:configure checking mcheck.h usability... no
704:info:configure checking mcheck.h presence... no
705:info:configure checking for mcheck.h... no
706:info:configure checking limits.h usability... yes
707:info:configure checking limits.h presence... yes
708:info:configure checking for limits.h... yes
709:info:configure checking libgen.h usability... yes
710:info:configure checking libgen.h presence... yes
711:info:configure checking for libgen.h... yes
712:info:configure checking float.h usability... yes
713:info:configure checking float.h presence... yes
714:info:configure checking for float.h... yes
715:info:configure checking glob.h usability... yes
716:info:configure checking glob.h presence... yes
717:info:configure checking for glob.h... yes
718:info:configure checking for struct statfs... in sys/statvfs.h
719:info:configure checking for f_bavail member in struct statfs... yes
720:info:configure checking if statfs() requires 4 arguments... no
721:info:configure checking for inline... inline
722:info:configure checking if <netdb.h> defines h_errno... yes
723:info:configure checking if <sys/stat.h> defines S_IFSOCK... yes
724:info:configure checking if <sys/stat.h> defines S_ISLNK... yes
725:info:configure checking if <sys/stat.h> defines S_ISSOCK... yes
726:info:configure checking if timezone is defined... yes
727:info:configure checking for mode_t... yes
728:info:configure checking for off_t... yes
729:info:configure checking for pid_t... yes
730:info:configure checking for size_t... yes
731:info:configure checking for working alloca.h... yes
732:info:configure checking for alloca... yes
733:info:configure checking for vprintf... yes
734:info:configure checking for _doprnt... no
735:info:configure checking for basename... yes
736:info:configure checking for getaddrinfo... yes
737:info:configure checking for getcwd... yes
738:info:configure checking for getnameinfo... yes
739:info:configure checking for getwd... yes
740:info:configure checking for inet_aton... yes
741:info:configure checking for mtrace... no
742:info:configure checking for putenv... yes
743:info:configure checking for realpath... yes
744:info:configure checking for setenv... yes
745:info:configure checking for stpcpy... yes
746:info:configure checking for stpncpy... yes
747:info:configure checking for strcspn... yes
748:info:configure checking for strdup... yes
749:info:configure checking for strndup... yes
750:info:configure checking for strerror... yes
751:info:configure checking for strtol... yes
752:info:configure checking for strtoul... yes
753:info:configure checking for strspn... yes
754:info:configure checking for strstr... yes
755:info:configure checking for __secure_getenv... no
756:info:configure checking for regcomp... yes
757:info:configure checking for ftok... yes
758:info:configure checking for mkstemp... yes
759:info:configure checking for doxygen... no
760:info:configure checking for setlocale... yes
761:info:configure checking for getpassphrase... no
762:info:configure checking for getmntent... no
763:info:configure checking for mntctl... no
764:info:configure checking for getmntinfo... yes
765:info:configure checking for lchown... yes
766:info:configure checking root's primary group... wheel
767:info:configure using ./autodeps/darwin.prov for automatic provides generation
768:info:configure using ./autodeps/darwin.req for automatic requires generation
769:info:configure configure: creating ./config.status
770:info:configure config.status: creating Doxyfile
771:info:configure config.status: creating Makefile
772:info:configure config.status: creating rpmrc
773:info:configure config.status: creating macros
774:info:configure config.status: creating platform
775:info:configure config.status: WARNING:  platform.in seems to ignore the --datarootdir setting
776:info:configure config.status: creating rpmpopt
777:info:configure config.status: creating rpm.spec
778:info:configure config.status: creating rpmio/Makefile
779:info:configure config.status: creating rpmdb/Makefile
780:info:configure config.status: creating lib/Makefile
781:info:configure config.status: creating build/Makefile
782:info:configure config.status: creating scripts/Makefile
783:info:configure config.status: creating scripts/brp-redhat
784:info:configure config.status: creating scripts/macros.perl
785:info:configure config.status: creating scripts/macros.php
786:info:configure config.status: creating scripts/macros.python
787:info:configure config.status: creating tools/Makefile
788:info:configure config.status: creating tests/Makefile
789:info:configure config.status: creating tests/rpmrc
790:info:configure config.status: creating tests/macros
791:info:configure config.status: creating tests/hello-test/Makefile
792:info:configure config.status: creating misc/Makefile
793:info:configure config.status: creating intl/Makefile
794:info:configure config.status: creating po/Makefile.in
795:info:configure config.status: creating doc/Makefile
796:info:configure config.status: creating doc/manual/Makefile
797:info:configure config.status: creating doc/fr/Makefile
798:info:configure config.status: creating doc/ja/Makefile
799:info:configure config.status: creating doc/ko/Makefile
800:info:configure config.status: creating doc/pl/Makefile
801:info:configure config.status: creating doc/ru/Makefile
802:info:configure config.status: creating doc/sk/Makefile
803:info:configure config.status: creating python/Makefile
804:info:configure config.status: creating python/rpm/Makefile
805:info:configure config.status: creating lua/Makefile
806:info:configure config.status: creating syck/Makefile
807:info:configure config.status: creating syck/lib/Makefile
808:info:configure config.status: creating wdj/Makefile
809:info:configure config.status: creating wnh/Makefile
810:info:configure config.status: creating config.h
811:info:configure config.status: executing depfiles commands
812:info:configure config.status: executing po-directories commands
813:info:configure config.status: creating po/POTFILES
814:info:configure config.status: creating po/Makefile
815:info:configure config.status: executing default commands
816:info:configure ./config.status: line 1511: popt/stamp-h.in: No such file or directory
817:info:configure Warning: -L../lib/ changed to -L/opt/local/var/macports/build/_opt_local_var_macports_sources_rsync.macports.org_release_ports_sysutils_rpm/rpm/work/rpm-4.4.9/perl/../lib/
818:info:configure Note (probably harmless): No library found for -lrpm
819:info:configure Writing Makefile for RPM
820:info:configure === configuring in zlib (/opt/local/var/macports/build/_opt_local_var_macports_sources_rsync.macports.org_release_ports_sysutils_rpm/rpm/work/rpm-4.4.9/zlib)
821:info:configure configure: running /bin/sh ./configure '--prefix=/opt/local'  '--disable-nls' '--without-javaglue' '--without-included-gettext' '--with-libintl-prefix=/opt/local' '--with-libiconv-prefix=/opt/local' '--mandir=/opt/local/share/man' '--infodir=/opt/local/share/info' '--with-python=2.4' '--with-perl=5.8' '--without-apidocs' '--sysconfdir=/opt/local/etc' '--disable-optimized' '--disable-aio' '--with-glob' '--enable-broken-chown' '--disable-rpath' 'CXX=/Developer/usr/bin/llvm-g++-4.2' 'CXXFLAGS=-O2 -arch x86_64' 'LDFLAGS=-L/opt/local/lib -arch x86_64' 'CPPFLAGS=-I/opt/local/include -I/opt/local/Library/Frameworks/Python.framework/Versions/2.4/include/python2.4' 'CC=/Developer/usr/bin/llvm-gcc-4.2' 'CFLAGS=-O2 -arch x86_64' 'FFLAGS=-O2 -m64' --cache-file=/dev/null --srcdir=.
822:info:configure checking build system type... i386-apple-darwin11.0.0
823:info:configure checking host system type... i386-apple-darwin11.0.0
824:info:configure checking target system type... i386-apple-darwin11.0.0
825:info:configure checking for a BSD-compatible install... /usr/bin/install -c
826:info:configure checking whether build environment is sane... yes
827:info:configure checking for a thread-safe mkdir -p... ./../install-sh -c -d
828:info:configure checking for gawk... no
829:info:configure checking for mawk... no
830:info:configure checking for nawk... no
831:info:configure checking for awk... awk
832:info:configure checking whether make sets $(MAKE)... yes
833:info:configure checking for gcc... /Developer/usr/bin/llvm-gcc-4.2
834:info:configure checking for C compiler default output file name... a.out
835:info:configure checking whether the C compiler works... yes
836:info:configure checking whether we are cross compiling... no
837:info:configure checking for suffix of executables...
838:info:configure checking for suffix of object files... o
839:info:configure checking whether we are using the GNU C compiler... yes
840:info:configure checking whether /Developer/usr/bin/llvm-gcc-4.2 accepts -g... yes
841:info:configure checking for /Developer/usr/bin/llvm-gcc-4.2 option to accept ISO C89... none needed
842:info:configure checking for style of include used by make... GNU
843:info:configure checking dependency style of /Developer/usr/bin/llvm-gcc-4.2... gcc3
844:info:configure checking for a sed that does not truncate output... /usr/bin/sed
845:info:configure checking for grep that handles long lines and -e... /usr/bin/grep
846:info:configure checking for egrep... /usr/bin/grep -E
847:info:configure checking for ld used by /Developer/usr/bin/llvm-gcc-4.2... /Developer/usr/llvm-gcc-4.2/libexec/gcc/i686-apple-darwin11/4.2.1/ld
848:info:configure checking if the linker (/Developer/usr/llvm-gcc-4.2/libexec/gcc/i686-apple-darwin11/4.2.1/ld) is GNU ld... no
849:info:configure checking for /Developer/usr/llvm-gcc-4.2/libexec/gcc/i686-apple-darwin11/4.2.1/ld option to reload object files... -r
850:info:configure checking for BSD-compatible nm... /usr/bin/nm
851:info:configure checking whether ln -s works... yes
852:info:configure checking how to recognise dependent libraries... pass_all
853:info:configure checking how to run the C preprocessor... /Developer/usr/bin/llvm-gcc-4.2 -E
854:info:configure checking for ANSI C header files... yes
855:info:configure checking for sys/types.h... yes
856:info:configure checking for sys/stat.h... yes
857:info:configure checking for stdlib.h... yes
858:info:configure checking for string.h... yes
859:info:configure checking for memory.h... yes
860:info:configure checking for strings.h... yes
861:info:configure checking for inttypes.h... yes
862:info:configure checking for stdint.h... yes
863:info:configure checking for unistd.h... yes
864:info:configure checking dlfcn.h usability... yes
865:info:configure checking dlfcn.h presence... yes
866:info:configure checking for dlfcn.h... yes
867:info:configure checking whether we are using the GNU C++ compiler... yes
868:info:configure checking whether /Developer/usr/bin/llvm-g++-4.2 accepts -g... yes
869:info:configure checking dependency style of /Developer/usr/bin/llvm-g++-4.2... gcc3
870:info:configure checking how to run the C++ preprocessor... /Developer/usr/bin/llvm-g++-4.2 -E
871:info:configure checking for g77... no
872:info:configure checking for xlf... no
873:info:configure checking for f77... no
874:info:configure checking for frt... no
875:info:configure checking for pgf77... no
876:info:configure checking for cf77... no
877:info:configure checking for fort77... no
878:info:configure checking for fl32... no
879:info:configure checking for af77... no
880:info:configure checking for xlf90... no
881:info:configure checking for f90... no
882:info:configure checking for pgf90... no
883:info:configure checking for pghpf... no
884:info:configure checking for epcf90... no
885:info:configure checking for gfortran... no
886:info:configure checking for g95... no
887:info:configure checking for xlf95... no
888:info:configure checking for f95... no
889:info:configure checking for fort... no
890:info:configure checking for ifort... no
891:info:configure checking for ifc... no
892:info:configure checking for efc... no
893:info:configure checking for pgf95... no
894:info:configure checking for lf95... no
895:info:configure checking for ftn... no
896:info:configure checking whether we are using the GNU Fortran 77 compiler... no
897:info:configure checking whether  accepts -g... no
898:info:configure checking the maximum length of command line arguments... 196608
899:info:configure checking command to parse /usr/bin/nm output from /Developer/usr/bin/llvm-gcc-4.2 object... ok
900:info:configure checking for objdir... .libs
901:info:configure checking for ar... ar
902:info:configure checking for ranlib... ranlib
903:info:configure checking for strip... strip
904:info:configure checking if /Developer/usr/bin/llvm-gcc-4.2 supports -fno-rtti -fno-exceptions... no
905:info:configure checking for /Developer/usr/bin/llvm-gcc-4.2 option to produce PIC... -fno-common
906:info:configure checking if /Developer/usr/bin/llvm-gcc-4.2 PIC flag -fno-common works... yes
907:info:configure checking if /Developer/usr/bin/llvm-gcc-4.2 static flag -static works... no
908:info:configure checking if /Developer/usr/bin/llvm-gcc-4.2 supports -c -o file.o... yes
909:info:configure checking whether the /Developer/usr/bin/llvm-gcc-4.2 linker (/Developer/usr/llvm-gcc-4.2/libexec/gcc/i686-apple-darwin11/4.2.1/ld) supports shared libraries... yes
910:info:configure checking dynamic linker characteristics... darwin11.0.0 dyld
911:info:configure checking how to hardcode library paths into programs... immediate
912:info:configure checking whether stripping libraries is possible... yes
913:info:configure checking if libtool supports shared libraries... yes
914:info:configure checking whether to build shared libraries... yes
915:info:configure checking whether to build static libraries... yes
916:info:configure configure: creating libtool
917:info:configure appending configuration tag "CXX" to libtool
918:info:configure checking for ld used by /Developer/usr/bin/llvm-g++-4.2... /Developer/usr/llvm-gcc-4.2/libexec/gcc/i686-apple-darwin11/4.2.1/ld
919:info:configure checking if the linker (/Developer/usr/llvm-gcc-4.2/libexec/gcc/i686-apple-darwin11/4.2.1/ld) is GNU ld... no
920:info:configure checking whether the /Developer/usr/bin/llvm-g++-4.2 linker (/Developer/usr/llvm-gcc-4.2/libexec/gcc/i686-apple-darwin11/4.2.1/ld) supports shared libraries... yes
921:info:configure checking for /Developer/usr/bin/llvm-g++-4.2 option to produce PIC... -fno-common
922:info:configure checking if /Developer/usr/bin/llvm-g++-4.2 PIC flag -fno-common works... yes
923:info:configure checking if /Developer/usr/bin/llvm-g++-4.2 static flag -static works... no
924:info:configure checking if /Developer/usr/bin/llvm-g++-4.2 supports -c -o file.o... yes
925:info:configure checking whether the /Developer/usr/bin/llvm-g++-4.2 linker (/Developer/usr/llvm-gcc-4.2/libexec/gcc/i686-apple-darwin11/4.2.1/ld) supports shared libraries... yes
926:info:configure checking dynamic linker characteristics... darwin11.0.0 dyld
927:info:configure checking how to hardcode library paths into programs... immediate
928:info:configure appending configuration tag "F77" to libtool
929:info:configure checking for special C compiler options needed for large files... no
930:info:configure checking for _FILE_OFFSET_BITS value needed for large files... no
931:info:configure checking for unistd.h... (cached) yes
932:info:configure checking errno.h usability... yes
933:info:configure checking errno.h presence... yes
934:info:configure checking for errno.h... yes
935:info:configure checking if mmap is available... no
936:info:configure configure: creating ./config.status
937:info:configure config.status: creating Doxyfile
938:info:configure config.status: creating Makefile
939:info:configure config.status: creating config.h
940:info:configure config.status: executing depfiles commands
941:info:configure config.status: executing default commands
942:info:configure === configuring in file (/opt/local/var/macports/build/_opt_local_var_macports_sources_rsync.macports.org_release_ports_sysutils_rpm/rpm/work/rpm-4.4.9/file)
943:info:configure configure: running /bin/sh ./configure '--prefix=/opt/local'  '--disable-nls' '--without-javaglue' '--without-included-gettext' '--with-libintl-prefix=/opt/local' '--with-libiconv-prefix=/opt/local' '--mandir=/opt/local/share/man' '--infodir=/opt/local/share/info' '--with-python=2.4' '--with-perl=5.8' '--without-apidocs' '--sysconfdir=/opt/local/etc' '--disable-optimized' '--disable-aio' '--with-glob' '--enable-broken-chown' '--disable-rpath' 'CXX=/Developer/usr/bin/llvm-g++-4.2' 'CXXFLAGS=-O2 -arch x86_64' 'LDFLAGS=-L/opt/local/lib -arch x86_64' 'CPPFLAGS=-I/opt/local/include -I/opt/local/Library/Frameworks/Python.framework/Versions/2.4/include/python2.4' 'CC=/Developer/usr/bin/llvm-gcc-4.2' 'CFLAGS=-O2 -arch x86_64' 'FFLAGS=-O2 -m64' --cache-file=/dev/null --srcdir=.
944:info:configure checking for a BSD-compatible install... /usr/bin/install -c
945:info:configure checking whether build environment is sane... yes
946:info:configure checking for a thread-safe mkdir -p... ./../install-sh -c -d
947:info:configure checking for gawk... no
948:info:configure checking for mawk... no
949:info:configure checking for nawk... no
950:info:configure checking for awk... awk
951:info:configure checking whether make sets $(MAKE)... yes
952:info:configure checking whether to enable maintainer-specific portions of Makefiles... no
953:info:configure checking for builtin ELF support... yes
954:info:configure checking for ELF core file support... yes
955:info:configure checking for file formats in man section 5... no
956:info:configure checking for gcc... /Developer/usr/bin/llvm-gcc-4.2
957:info:configure checking for C compiler default output file name... a.out
958:info:configure checking whether the C compiler works... yes
959:info:configure checking whether we are cross compiling... no
960:info:configure checking for suffix of executables...
961:info:configure checking for suffix of object files... o
962:info:configure checking whether we are using the GNU C compiler... yes
963:info:configure checking whether /Developer/usr/bin/llvm-gcc-4.2 accepts -g... yes
964:info:configure checking for /Developer/usr/bin/llvm-gcc-4.2 option to accept ISO C89... none needed
965:info:configure checking for style of include used by make... GNU
966:info:configure checking dependency style of /Developer/usr/bin/llvm-gcc-4.2... gcc3
967:info:configure checking for a BSD-compatible install... /usr/bin/install -c
968:info:configure checking whether ln -s works... yes
969:info:configure checking build system type... i386-apple-darwin11.0.0
970:info:configure checking host system type... i386-apple-darwin11.0.0
971:info:configure checking for a sed that does not truncate output... /usr/bin/sed
972:info:configure checking for grep that handles long lines and -e... /usr/bin/grep
973:info:configure checking for egrep... /usr/bin/grep -E
974:info:configure checking for ld used by /Developer/usr/bin/llvm-gcc-4.2... /Developer/usr/llvm-gcc-4.2/libexec/gcc/i686-apple-darwin11/4.2.1/ld
975:info:configure checking if the linker (/Developer/usr/llvm-gcc-4.2/libexec/gcc/i686-apple-darwin11/4.2.1/ld) is GNU ld... no
976:info:configure checking for /Developer/usr/llvm-gcc-4.2/libexec/gcc/i686-apple-darwin11/4.2.1/ld option to reload object files... -r
977:info:configure checking for BSD-compatible nm... /usr/bin/nm
978:info:configure checking how to recognise dependent libraries... pass_all
979:info:configure checking how to run the C preprocessor... /Developer/usr/bin/llvm-gcc-4.2 -E
980:info:configure checking for ANSI C header files... yes
981:info:configure checking for sys/types.h... yes
982:info:configure checking for sys/stat.h... yes
983:info:configure checking for stdlib.h... yes
984:info:configure checking for string.h... yes
985:info:configure checking for memory.h... yes
986:info:configure checking for strings.h... yes
987:info:configure checking for inttypes.h... yes
988:info:configure checking for stdint.h... yes
989:info:configure checking for unistd.h... yes
990:info:configure checking dlfcn.h usability... yes
991:info:configure checking dlfcn.h presence... yes
992:info:configure checking for dlfcn.h... yes
993:info:configure checking whether we are using the GNU C++ compiler... yes
994:info:configure checking whether /Developer/usr/bin/llvm-g++-4.2 accepts -g... yes
995:info:configure checking dependency style of /Developer/usr/bin/llvm-g++-4.2... gcc3
996:info:configure checking how to run the C++ preprocessor... /Developer/usr/bin/llvm-g++-4.2 -E
997:info:configure checking for g77... no
998:info:configure checking for xlf... no
999:info:configure checking for f77... no
1000:info:configure checking for frt... no
1001:info:configure checking for pgf77... no
1002:info:configure checking for cf77... no
1003:info:configure checking for fort77... no
1004:info:configure checking for fl32... no
1005:info:configure checking for af77... no
1006:info:configure checking for xlf90... no
1007:info:configure checking for f90... no
1008:info:configure checking for pgf90... no
1009:info:configure checking for pghpf... no
1010:info:configure checking for epcf90... no
1011:info:configure checking for gfortran... no
1012:info:configure checking for g95... no
1013:info:configure checking for xlf95... no
1014:info:configure checking for f95... no
1015:info:configure checking for fort... no
1016:info:configure checking for ifort... no
1017:info:configure checking for ifc... no
1018:info:configure checking for efc... no
1019:info:configure checking for pgf95... no
1020:info:configure checking for lf95... no
1021:info:configure checking for ftn... no
1022:info:configure checking whether we are using the GNU Fortran 77 compiler... no
1023:info:configure checking whether  accepts -g... no
1024:info:configure checking the maximum length of command line arguments... 196608
1025:info:configure checking command to parse /usr/bin/nm output from /Developer/usr/bin/llvm-gcc-4.2 object... ok
1026:info:configure checking for objdir... .libs
1027:info:configure checking for ar... ar
1028:info:configure checking for ranlib... ranlib
1029:info:configure checking for strip... strip
1030:info:configure checking if /Developer/usr/bin/llvm-gcc-4.2 supports -fno-rtti -fno-exceptions... no
1031:info:configure checking for /Developer/usr/bin/llvm-gcc-4.2 option to produce PIC... -fno-common
1032:info:configure checking if /Developer/usr/bin/llvm-gcc-4.2 PIC flag -fno-common works... yes
1033:info:configure checking if /Developer/usr/bin/llvm-gcc-4.2 static flag -static works... no
1034:info:configure checking if /Developer/usr/bin/llvm-gcc-4.2 supports -c -o file.o... yes
1035:info:configure checking whether the /Developer/usr/bin/llvm-gcc-4.2 linker (/Developer/usr/llvm-gcc-4.2/libexec/gcc/i686-apple-darwin11/4.2.1/ld) supports shared libraries... yes
1036:info:configure checking dynamic linker characteristics... darwin11.0.0 dyld
1037:info:configure checking how to hardcode library paths into programs... immediate
1038:info:configure checking whether stripping libraries is possible... yes
1039:info:configure checking if libtool supports shared libraries... yes
1040:info:configure checking whether to build shared libraries... yes
1041:info:configure checking whether to build static libraries... yes
1042:info:configure configure: creating libtool
1043:info:configure appending configuration tag "CXX" to libtool
1044:info:configure checking for ld used by /Developer/usr/bin/llvm-g++-4.2... /Developer/usr/llvm-gcc-4.2/libexec/gcc/i686-apple-darwin11/4.2.1/ld
1045:info:configure checking if the linker (/Developer/usr/llvm-gcc-4.2/libexec/gcc/i686-apple-darwin11/4.2.1/ld) is GNU ld... no
1046:info:configure checking whether the /Developer/usr/bin/llvm-g++-4.2 linker (/Developer/usr/llvm-gcc-4.2/libexec/gcc/i686-apple-darwin11/4.2.1/ld) supports shared libraries... yes
1047:info:configure checking for /Developer/usr/bin/llvm-g++-4.2 option to produce PIC... -fno-common
1048:info:configure checking if /Developer/usr/bin/llvm-g++-4.2 PIC flag -fno-common works... yes
1049:info:configure checking if /Developer/usr/bin/llvm-g++-4.2 static flag -static works... no
1050:info:configure checking if /Developer/usr/bin/llvm-g++-4.2 supports -c -o file.o... yes
1051:info:configure checking whether the /Developer/usr/bin/llvm-g++-4.2 linker (/Developer/usr/llvm-gcc-4.2/libexec/gcc/i686-apple-darwin11/4.2.1/ld) supports shared libraries... yes
1052:info:configure checking dynamic linker characteristics... darwin11.0.0 dyld
1053:info:configure checking how to hardcode library paths into programs... immediate
1054:info:configure appending configuration tag "F77" to libtool
1055:info:configure checking for ANSI C header files... (cached) yes
1056:info:configure checking whether sys/types.h defines makedev... yes
1057:info:configure checking for sys/wait.h that is POSIX.1 compatible... yes
1058:info:configure checking for stdint.h... (cached) yes
1059:info:configure checking fcntl.h usability... yes
1060:info:configure checking fcntl.h presence... yes
1061:info:configure checking for fcntl.h... yes
1062:info:configure checking locale.h usability... yes
1063:info:configure checking locale.h presence... yes
1064:info:configure checking for locale.h... yes
1065:info:configure checking for stdint.h... (cached) yes
1066:info:configure checking for inttypes.h... (cached) yes
1067:info:configure checking for unistd.h... (cached) yes
1068:info:configure checking getopt.h usability... yes
1069:info:configure checking getopt.h presence... yes
1070:info:configure checking for getopt.h... yes
1071:info:configure checking utime.h usability... yes
1072:info:configure checking utime.h presence... yes
1073:info:configure checking for utime.h... yes
1074:info:configure checking wchar.h usability... yes
1075:info:configure checking wchar.h presence... yes
1076:info:configure checking for wchar.h... yes
1077:info:configure checking wctype.h usability... yes
1078:info:configure checking wctype.h presence... yes
1079:info:configure checking for wctype.h... yes
1080:info:configure checking sys/mman.h usability... yes
1081:info:configure checking sys/mman.h presence... yes
1082:info:configure checking for sys/mman.h... yes
1083:info:configure checking for sys/stat.h... (cached) yes
1084:info:configure checking for sys/types.h... (cached) yes
1085:info:configure checking sys/utime.h usability... no
1086:info:configure checking sys/utime.h presence... no
1087:info:configure checking for sys/utime.h... no
1088:info:configure checking sys/time.h usability... yes
1089:info:configure checking sys/time.h presence... yes
1090:info:configure checking for sys/time.h... yes
1091:info:configure checking for an ANSI C-conforming const... yes
1092:info:configure checking for off_t... yes
1093:info:configure checking for size_t... yes
1094:info:configure checking for struct stat.st_rdev... yes
1095:info:configure checking whether struct tm is in sys/time.h or time.h... time.h
1096:info:configure checking for tm_zone in struct tm... yes
1097:info:configure checking for tzname... yes
1098:info:configure checking for tm_isdst in struct tm... yes
1099:info:configure checking for daylight... yes
1100:info:configure checking for special C compiler options needed for large files=
1101:info:configure ... no
1102:info:configure checking for _FILE_OFFSET_BITS value needed for large files... no
1103:info:configure checking for _LARGE_FILES value needed for large files... no
1104:info:configure checking for mbstate_t... yes
1105:info:configure checking for uint8_t... yes
1106:info:configure checking for uint16_t... yes
1107:info:configure checking for uint32_t... yes
1108:info:configure checking for int32_t... yes
1109:info:configure checking for long long... yes
1110:info:configure checking for uint64_t... yes
1111:info:configure checking size of uint8_t... 1
1112:info:configure checking size of uint16_t... 2
1113:info:configure checking size of uint32_t... 4
1114:info:configure checking size of uint64_t... 8
1115:info:configure checking for mmap... yes
1116:info:configure checking for strerror... yes
1117:info:configure checking for strndup... yes
1118:info:configure checking for strtoul... yes
1119:info:configure checking for mbrtowc... yes
1120:info:configure checking for mkstemp... yes
1121:info:configure checking for getopt_long... yes
1122:info:configure checking for utimes... yes
1123:info:configure checking for utime... yes
1124:info:configure checking for wcwidth... yes
1125:info:configure checking for snprintf... yes
1126:info:configure checking for vsnprintf... yes
1127:info:configure checking for gzopen in -lz... yes
1128:info:configure configure: creating ./config.status
1129:info:configure config.status: creating Makefile
1130:info:configure config.status: creating src/Makefile
1131:info:configure config.status: creating magic/Makefile
1132:info:configure config.status: creating doc/Makefile
1133:info:configure config.status: creating python/Makefile
1134:info:configure config.status: creating config.h
1135:info:configure config.status: executing depfiles commands
1136:info:configure === configuring in db3 (/opt/local/var/macports/build/_opt_local_var_macports_sources_rsync.macports.org_release_ports_sysutils_rpm/rpm/work/rpm-4.4.9/db3)
1137:info:configure configure: running /bin/sh ./configure '--prefix=/opt/local'  '--disable-nls' '--without-javaglue' '--without-included-gettext' '--with-libintl-prefix=/opt/local' '--with-libiconv-prefix=/opt/local' '--mandir=/opt/local/share/man' '--infodir=/opt/local/share/info' '--with-python=2.4' '--with-perl=5.8' '--without-apidocs' '--sysconfdir=/opt/local/etc' '--disable-optimized' '--disable-aio' '--with-glob' '--enable-broken-chown' '--disable-rpath' 'CXX=/Developer/usr/bin/llvm-g++-4.2' 'CXXFLAGS=-O2 -arch x86_64' 'LDFLAGS=-L/opt/local/lib -arch x86_64' 'CPPFLAGS=-I/opt/local/include -I/opt/local/Library/Frameworks/Python.framework/Versions/2.4/include/python2.4' 'CC=/Developer/usr/bin/llvm-gcc-4.2' 'CFLAGS=-O2 -arch x86_64' 'FFLAGS=-O2 -m64' --cache-file=/dev/null --srcdir=.
1138:info:configure checking build system type... i386-apple-darwin11.0.0
1139:info:configure checking host system type... i386-apple-darwin11.0.0
1140:info:configure checking if building in the top-level or dist directories... no
1141:info:configure checking if --disable-cryptography option specified... no
1142:info:configure checking if --disable-hash option specified... no
1143:info:configure checking if --disable-queue option specified... no
1144:info:configure checking if --disable-replication option specified... no
1145:info:configure checking if --disable-statistics option specified... no
1146:info:configure checking if --disable-verify option specified... no
1147:info:configure checking if --enable-compat185 option specified... no
1148:info:configure checking if --enable-cxx option specified... no
1149:info:configure checking if --enable-debug option specified... no
1150:info:configure checking if --enable-debug_rop option specified... no
1151:info:configure checking if --enable-debug_wop option specified... no
1152:info:configure checking if --enable-diagnostic option specified... no
1153:info:configure checking if --enable-dump185 option specified... no
1154:info:configure checking if --enable-java option specified... no
1155:info:configure checking if --enable-mingw option specified... no
1156:info:configure checking if --enable-o_direct option specified... no
1157:info:configure checking if --enable-posixmutexes option specified... no
1158:info:configure checking if --enable-pthread_api option specified... no
1159:info:configure checking if --enable-rpc option specified... yes
1160:info:configure checking if --enable-smallbuild option specified... no
1161:info:configure checking if --enable-tcl option specified... no
1162:info:configure checking if --enable-test option specified... no
1163:info:configure checking if --enable-uimutexes option specified... no
1164:info:configure checking if --enable-umrw option specified... no
1165:info:configure checking if --with-mutex=MUTEX option specified... no
1166:info:configure checking if --with-tcl=DIR option specified... no
1167:info:configure checking if --with-uniquename=NAME option specified... _rpmdb
1168:info:configure checking for ar... ar
1169:info:configure checking for chmod... chmod
1170:info:configure checking for cp... cp
1171:info:configure checking for ln... ln
1172:info:configure checking for mkdir... mkdir
1173:info:configure checking for ranlib... ranlib
1174:info:configure checking for rm... rm
1175:info:configure checking for rpcgen... rpcgen
1176:info:configure checking for sh... /bin/sh
1177:info:configure checking for strip... strip
1178:info:configure checking for a BSD-compatible install... /usr/bin/install -c
1179:info:configure checking for C compiler default output file name... a.out
1180:info:configure checking whether the C compiler works... yes
1181:info:configure checking whether we are cross compiling... no
1182:info:configure checking for suffix of executables...
1183:info:configure checking for suffix of object files... o
1184:info:configure checking whether we are using the GNU C compiler... yes
1185:info:configure checking whether /Developer/usr/bin/llvm-gcc-4.2 accepts -g... yes
1186:info:configure checking for /Developer/usr/bin/llvm-gcc-4.2 option to accept ISO C89... none needed
1187:info:configure checking for an ANSI C-conforming const... yes
1188:info:configure checking whether we are using gcc version 2.96... no
1189:info:configure checking whether g++ requires -fhandle-exceptions... no
1190:info:configure checking for a sed that does not truncate output... /usr/bin/sed
1191:info:configure checking for grep that handles long lines and -e... /usr/bin/grep
1192:info:configure checking for egrep... /usr/bin/grep -E
1193:info:configure checking for ld used by /Developer/usr/bin/llvm-gcc-4.2... /Developer/usr/llvm-gcc-4.2/libexec/gcc/i686-apple-darwin11/4.2.1/ld
1194:info:configure checking if the linker (/Developer/usr/llvm-gcc-4.2/libexec/gcc/i686-apple-darwin11/4.2.1/ld) is GNU ld... no
1195:info:configure checking for /Developer/usr/llvm-gcc-4.2/libexec/gcc/i686-apple-darwin11/4.2.1/ld option to reload object files... -r
1196:info:configure checking for BSD-compatible nm... /usr/bin/nm
1197:info:configure checking whether ln -s works... yes
1198:info:configure checking how to recognise dependent libraries... pass_all
1199:info:configure checking how to run the C preprocessor... /Developer/usr/bin/llvm-gcc-4.2 -E
1200:info:configure checking for ANSI C header files... yes
1201:info:configure checking for sys/types.h... yes
1202:info:configure checking for sys/stat.h... yes
1203:info:configure checking for stdlib.h... yes
1204:info:configure checking for string.h... yes
1205:info:configure checking for memory.h... yes
1206:info:configure checking for strings.h... yes
1207:info:configure checking for inttypes.h... yes
1208:info:configure checking for stdint.h... yes
1209:info:configure checking for unistd.h... yes
1210:info:configure checking dlfcn.h usability... yes
1211:info:configure checking dlfcn.h presence... yes
1212:info:configure checking for dlfcn.h... yes
1213:info:configure checking how to run the C++ preprocessor... /Developer/usr/bin/llvm-g++-4.2 -E
1214:info:configure checking for g77... no
1215:info:configure checking for f77... no
1216:info:configure checking for xlf... no
1217:info:configure checking for frt... no
1218:info:configure checking for pgf77... no
1219:info:configure checking for cf77... no
1220:info:configure checking for fort77... no
1221:info:configure checking for fl32... no
1222:info:configure checking for af77... no
1223:info:configure checking for f90... no
1224:info:configure checking for xlf90... no
1225:info:configure checking for pgf90... no
1226:info:configure checking for pghpf... no
1227:info:configure checking for epcf90... no
1228:info:configure checking for gfortran... no
1229:info:configure checking for g95... no
1230:info:configure checking for f95... no
1231:info:configure checking for fort... no
1232:info:configure checking for xlf95... no
1233:info:configure checking for ifort... no
1234:info:configure checking for ifc... no
1235:info:configure checking for efc... no
1236:info:configure checking for pgf95... no
1237:info:configure checking for lf95... no
1238:info:configure checking for ftn... no
1239:info:configure checking whether we are using the GNU Fortran 77 compiler... no
1240:info:configure checking whether  accepts -g... no
1241:info:configure checking the maximum length of command line arguments... 196608
1242:info:configure checking command to parse /usr/bin/nm output from /Developer/usr/bin/llvm-gcc-4.2 object... ok
1243:info:configure checking for objdir... .libs
1244:info:configure checking for ar... (cached) ar
1245:info:configure checking for ranlib... (cached) ranlib
1246:info:configure checking for strip... (cached) strip
1247:info:configure checking if /Developer/usr/bin/llvm-gcc-4.2 supports -fno-rtti -fno-exceptions... no
1248:info:configure checking for /Developer/usr/bin/llvm-gcc-4.2 option to produce PIC... -fno-common
1249:info:configure checking if /Developer/usr/bin/llvm-gcc-4.2 PIC flag -fno-common works... yes
1250:info:configure checking if /Developer/usr/bin/llvm-gcc-4.2 static flag -static works... no
1251:info:configure checking if /Developer/usr/bin/llvm-gcc-4.2 supports -c -o file.o... yes
1252:info:configure checking whether the /Developer/usr/bin/llvm-gcc-4.2 linker (/Developer/usr/llvm-gcc-4.2/libexec/gcc/i686-apple-darwin11/4.2.1/ld) supports shared libraries... yes
1253:info:configure checking dynamic linker characteristics... darwin11.0.0 dyld
1254:info:configure checking how to hardcode library paths into programs... immediate
1255:info:configure checking whether stripping libraries is possible... yes
1256:info:configure checking if libtool supports shared libraries... yes
1257:info:configure checking whether to build shared libraries... yes
1258:info:configure checking whether to build static libraries... yes
1259:info:configure configure: creating libtool
1260:info:configure appending configuration tag "CXX" to libtool
1261:info:configure checking whether the /Developer/usr/bin/llvm-g++-4.2 linker (/Developer/usr/llvm-gcc-4.2/libexec/gcc/i686-apple-darwin11/4.2.1/ld) supports shared libraries... no
1262:info:configure checking for /Developer/usr/bin/llvm-g++-4.2 option to produce PIC...
1263:info:configure checking if /Developer/usr/bin/llvm-g++-4.2 static flag  works... yes
1264:info:configure checking if /Developer/usr/bin/llvm-g++-4.2 supports -c -o file.o... yes
1265:info:configure checking whether the /Developer/usr/bin/llvm-g++-4.2 linker (/Developer/usr/llvm-gcc-4.2/libexec/gcc/i686-apple-darwin11/4.2.1/ld) supports shared libraries... no
1266:info:configure checking dynamic linker characteristics... darwin11.0.0 dyld
1267:info:configure checking how to hardcode library paths into programs... immediate
1268:info:configure appending configuration tag "F77" to libtool
1269:info:configure checking SOSUFFIX from libtool... .dylib
1270:info:configure checking MODSUFFIX from libtool... .so
1271:info:configure checking JMODSUFFIX from libtool... .jnilib
1272:info:configure checking whether stat file-mode macros are broken... no
1273:info:configure checking whether time.h and sys/time.h may both be included... yes
1274:info:configure checking for dirent.h that defines DIR... yes
1275:info:configure checking for library containing opendir... none required
1276:info:configure checking sys/select.h usability... yes
1277:info:configure checking sys/select.h presence... yes
1278:info:configure checking for sys/select.h... yes
1279:info:configure checking sys/time.h usability... yes
1280:info:configure checking sys/time.h presence... yes
1281:info:configure checking for sys/time.h... yes
1282:info:configure checking sys/fcntl.h usability... yes
1283:info:configure checking sys/fcntl.h presence... yes
1284:info:configure checking for sys/fcntl.h... yes
1285:info:configure checking for struct stat.st_blksize... yes
1286:info:configure checking for inttypes.h... (cached) yes
1287:info:configure checking for stdint.h... (cached) yes
1288:info:configure checking stddef.h usability... yes
1289:info:configure checking stddef.h presence... yes
1290:info:configure checking for stddef.h... yes
1291:info:configure checking for unistd.h... (cached) yes
1292:info:configure checking for off_t... yes
1293:info:configure checking for size_t... yes
1294:info:configure checking for char... yes
1295:info:configure checking size of char... 1
1296:info:configure checking for unsigned char... yes
1297:info:configure checking size of unsigned char... 1
1298:info:configure checking for short... yes
1299:info:configure checking size of short... 2
1300:info:configure checking for unsigned short... yes
1301:info:configure checking size of unsigned short... 2
1302:info:configure checking for int... yes
1303:info:configure checking size of int... 4
1304:info:configure checking for unsigned int... yes
1305:info:configure checking size of unsigned int... 4
1306:info:configure checking for long... yes
1307:info:configure checking size of long... 8
1308:info:configure checking for unsigned long... yes
1309:info:configure checking size of unsigned long... 8
1310:info:configure checking for long long... yes
1311:info:configure checking size of long long... 8
1312:info:configure checking for unsigned long long... yes
1313:info:configure checking size of unsigned long long... 8
1314:info:configure checking for size_t... (cached) yes
1315:info:configure checking size of size_t... 8
1316:info:configure checking for char *... yes
1317:info:configure checking size of char *... 8
1318:info:configure checking for u_char... yes
1319:info:configure checking for u_short... yes
1320:info:configure checking for u_int... yes
1321:info:configure checking for u_long... yes
1322:info:configure checking for u_int8_t... yes
1323:info:configure checking for u_int16_t... yes
1324:info:configure checking for int16_t... yes
1325:info:configure checking for u_int32_t... yes
1326:info:configure checking for int32_t... yes
1327:info:configure checking for u_int64_t... yes
1328:info:configure checking for int64_t... yes
1329:info:configure checking for ssize_t... yes
1330:info:configure checking for uintmax_t... yes
1331:info:configure checking for uintptr_t... yes
1332:info:configure checking for ANSI C exit success/failure values... yes
1333:info:configure checking for mutexes... POSIX/pthreads/library
1334:info:configure checking for main in -lpthread... yes
1335:info:configure checking for library containing fdatasync... none required
1336:info:configure checking for main in -lm... yes
1337:info:configure checking for main in -lnsl... no
1338:info:configure checking for main in -lpthread... (cached) yes
1339:info:configure checking for main in -lsocket... no
1340:info:configure checking for abort... yes
1341:info:configure checking for atoi... yes
1342:info:configure checking for atol... yes
1343:info:configure checking for getcwd... yes
1344:info:configure checking for getenv... yes
1345:info:configure checking for getopt... yes
1346:info:configure checking for isalpha... yes
1347:info:configure checking for isdigit... yes
1348:info:configure checking for isprint... yes
1349:info:configure checking for isspace... yes
1350:info:configure checking for memcmp... yes
1351:info:configure checking for memcpy... yes
1352:info:configure checking for memmove... yes
1353:info:configure checking for printf... yes
1354:info:configure checking for raise... yes
1355:info:configure checking for rand... yes
1356:info:configure checking for strcasecmp... yes
1357:info:configure checking for strcat... yes
1358:info:configure checking for strchr... yes
1359:info:configure checking for strdup... yes
1360:info:configure checking for strerror... yes
1361:info:configure checking for strncat... yes
1362:info:configure checking for strncmp... yes
1363:info:configure checking for strrchr... yes
1364:info:configure checking for strsep... yes
1365:info:configure checking for strtol... yes
1366:info:configure checking for strtoul... yes
1367:info:configure checking for _fstati64... no
1368:info:configure checking for clock_gettime... no
1369:info:configure checking for directio... no
1370:info:configure checking for fchmod... yes
1371:info:configure checking for fcntl... yes
1372:info:configure checking for fdatasync... yes
1373:info:configure checking for getaddrinfo... yes
1374:info:configure checking for getrusage... yes
1375:info:configure checking for gettimeofday... yes
1376:info:configure checking for getuid... yes
1377:info:configure checking for mprotect... yes
1378:info:configure checking for pstat_getdynamic... no
1379:info:configure checking for pthread_yield... no
1380:info:configure checking for sched_yield... yes
1381:info:configure checking for select... yes
1382:info:configure checking for sigaction... yes
1383:info:configure checking for snprintf... yes
1384:info:configure checking for stat... yes
1385:info:configure checking for strftime... yes
1386:info:configure checking for sysconf... yes
1387:info:configure checking for vsnprintf... yes
1388:info:configure checking for yield... no
1389:info:configure checking for ftruncate... yes
1390:info:configure checking for ctime_r... yes
1391:info:configure checking for 2 or 3 argument version of ctime_r... 2-argument
1392:info:configure checking for pread... yes
1393:info:configure checking for pwrite... yes
1394:info:configure checking for fcntl/F_SETFD... yes
1395:info:configure checking for special C compiler options needed for large files... no
1396:info:configure checking for _FILE_OFFSET_BITS value needed for large files... no
1397:info:configure checking for _LARGE_FILES value needed for large files... no
1398:info:configure checking for mlock... yes
1399:info:configure checking for munlock... yes
1400:info:configure checking for mmap... yes
1401:info:configure checking for munmap... yes
1402:info:configure checking for shmget... yes
1403:info:configure checking "rpcgen -C" build of db_server.h... yes
1404:info:configure checking for svc_run... yes
1405:info:configure checking for 64-bit integral type support for sequences... yes
1406:info:configure configure: creating ./config.status
1407:info:configure config.status: creating Makefile
1408:info:configure config.status: creating db_cxx.h
1409:info:configure config.status: creating db_int.h
1410:info:configure config.status: creating clib_port.h
1411:info:configure config.status: creating include.tcl
1412:info:configure config.status: creating db.h
1413:info:configure config.status: creating db_int_def.h
1414:info:configure config.status: creating db_config.h
1415:debug:build build phase started at Tue Jul 26 00:47:15 EDT 2011
1416:notice:build --->  Building rpm
1417:debug:build Executing org.macports.build (rpm)
1418:debug:build Environment: CPATH='/opt/local/include' CC_PRINT_OPTIONS_FILE='/opt/local/var/macports/build/_opt_local_var_macports_sources_rsync.macports.org_release_ports_sysutils_rpm/rpm/work/.CC_PRINT_OPTIONS' LIBRARY_PATH='/opt/local/lib' CC_PRINT_OPTIONS='YES' MACOSX_DEPLOYMENT_TARGET='10.7'
1419:debug:build Assembled command: 'cd "/opt/local/var/macports/build/_opt_local_var_macports_sources_rsync.macports.org_release_ports_sysutils_rpm/rpm/work/rpm-4.4.9" && /usr/bin/gnumake -w all'
1420:debug:build Executing command line:  cd "/opt/local/var/macports/build/_opt_local_var_macports_sources_rsync.macports.org_release_ports_sysutils_rpm/rpm/work/rpm-4.4.9" && /usr/bin/gnumake -w all
1421:info:build gnumake: Entering directory `/opt/local/var/macports/build/_opt_local_var_macports_sources_rsync.macports.org_release_ports_sysutils_rpm/rpm/work/rpm-4.4.9'
1422:info:build /usr/bin/gnumake  all-recursive
1423:info:build gnumake[1]: Entering directory `/opt/local/var/macports/build/_opt_local_var_macports_sources_rsync.macports.org_release_ports_sysutils_rpm/rpm/work/rpm-4.4.9'
1424:info:build Making all in po
1425:info:build gnumake[2]: Entering directory `/opt/local/var/macports/build/_opt_local_var_macports_sources_rsync.macports.org_release_ports_sysutils_rpm/rpm/work/rpm-4.4.9/po'
1426:info:build gnumake[2]: Nothing to be done for `all'.
1427:info:build gnumake[2]: Leaving directory `/opt/local/var/macports/build/_opt_local_var_macports_sources_rsync.macports.org_release_ports_sysutils_rpm/rpm/work/rpm-4.4.9/po'
1428:info:build Making all in misc
1429:info:build gnumake[2]: Entering directory `/opt/local/var/macports/build/_opt_local_var_macports_sources_rsync.macports.org_release_ports_sysutils_rpm/rpm/work/rpm-4.4.9/misc'
1430:info:build /Developer/usr/bin/llvm-gcc-4.2 -DHAVE_CONFIG_H -I. -I.. -I. -I..  -I../zlib -I/opt/local/include  -I/opt/local/include -I/opt/local/Library/Frameworks/Python.framework/Versions/2.4/include/python2.4  -O2 -arch x86_64 -fPIC -DPIC -D_GNU_SOURCE -D_REENTRANT -Wall -Wpointer-arith -Wstrict-prototypes -Wmissing-prototypes -Wno-char-subscripts -MT glob.o -MD -MP -MF .deps/glob.Tpo -c -o glob.o glob.c
1431:info:build glob.c:51:1: warning: "__alloca" redefined
1432:info:build In file included from /usr/include/stdlib.h:67,
1433:info:build                  from ../system.h:148,
1434:info:build                  from glob.c:47:
1435:info:build /usr/include/alloca.h:44:1: warning: this is the location of the previous definition
1436:info:build mv -f .deps/glob.Tpo .deps/glob.Po
1437:info:build /Developer/usr/bin/llvm-gcc-4.2 -DHAVE_CONFIG_H -I. -I.. -I. -I..  -I../zlib -I/opt/local/include  -I/opt/local/include -I/opt/local/Library/Frameworks/Python.framework/Versions/2.4/include/python2.4  -O2 -arch x86_64 -fPIC -DPIC -D_GNU_SOURCE -D_REENTRANT -Wall -Wpointer-arith -Wstrict-prototypes -Wmissing-prototypes -Wno-char-subscripts -MT fnmatch.o -MD -MP -MF .deps/fnmatch.Tpo -c -o fnmatch.o fnmatch.c
1438:info:build fnmatch.c: In function ‘__strchrnul’:
1439:info:build fnmatch.c:38: warning: pointer targets in assignment differ in signedness
1440:info:build fnmatch.c: At top level:
1441:info:build fnmatch.c:243: warning: function declaration isn’t a prototype
1442:info:build mv -f .deps/fnmatch.Tpo .deps/fnmatch.Po
1443:info:build rm -f libmisc.a
1444:info:build ar cru libmisc.a  glob.o fnmatch.o
1445:info:build ranlib libmisc.a
1446:info:build gnumake[2]: Leaving directory `/opt/local/var/macports/build/_opt_local_var_macports_sources_rsync.macports.org_release_ports_sysutils_rpm/rpm/work/rpm-4.4.9/misc'
1447:info:build Making all in zlib
1448:info:build gnumake[2]: Entering directory `/opt/local/var/macports/build/_opt_local_var_macports_sources_rsync.macports.org_release_ports_sysutils_rpm/rpm/work/rpm-4.4.9/zlib'
1449:info:build /usr/bin/gnumake  all-am
1450:info:build gnumake[3]: Entering directory `/opt/local/var/macports/build/_opt_local_var_macports_sources_rsync.macports.org_release_ports_sysutils_rpm/rpm/work/rpm-4.4.9/zlib'
1451:info:build /bin/sh ./libtool --tag=CC   --mode=compile /Developer/usr/bin/llvm-gcc-4.2 -DHAVE_CONFIG_H -I.   -I/opt/local/include -I/opt/local/Library/Frameworks/Python.framework/Versions/2.4/include/python2.4  -DWITH_RSYNC_PAD -O3 -fomit-frame-pointer -Wall -Wpointer-arith -Wstrict-prototypes -Wmissing-prototypes -Wno-char-subscripts -DHAS_snprintf -DHAS_snprintf -MT adler32.lo -MD -MP -MF .deps/adler32.Tpo -c -o adler32.lo adler32.c
1452:info:build mkdir .libs
1453:info:build  /Developer/usr/bin/llvm-gcc-4.2 -DHAVE_CONFIG_H -I. -I/opt/local/include -I/opt/local/Library/Frameworks/Python.framework/Versions/2.4/include/python2.4 -DWITH_RSYNC_PAD -O3 -fomit-frame-pointer -Wall -Wpointer-arith -Wstrict-prototypes -Wmissing-prototypes -Wno-char-subscripts -DHAS_snprintf -DHAS_snprintf -MT adler32.lo -MD -MP -MF .deps/adler32.Tpo -c adler32.c  -fno-common -DPIC -o .libs/adler32.o
1454:info:build  /Developer/usr/bin/llvm-gcc-4.2 -DHAVE_CONFIG_H -I. -I/opt/local/include -I/opt/local/Library/Frameworks/Python.framework/Versions/2.4/include/python2.4 -DWITH_RSYNC_PAD -O3 -fomit-frame-pointer -Wall -Wpointer-arith -Wstrict-prototypes -Wmissing-prototypes -Wno-char-subscripts -DHAS_snprintf -DHAS_snprintf -MT adler32.lo -MD -MP -MF .deps/adler32.Tpo -c adler32.c -o adler32.o >/dev/null 2>&1
1455:info:build mv -f .deps/adler32.Tpo .deps/adler32.Plo
1456:info:build /bin/sh ./libtool --tag=CC   --mode=compile /Developer/usr/bin/llvm-gcc-4.2 -DHAVE_CONFIG_H -I.   -I/opt/local/include -I/opt/local/Library/Frameworks/Python.framework/Versions/2.4/include/python2.4  -DWITH_RSYNC_PAD -O3 -fomit-frame-pointer -Wall -Wpointer-arith -Wstrict-prototypes -Wmissing-prototypes -Wno-char-subscripts -DHAS_snprintf -DHAS_snprintf -MT compress.lo -MD -MP -MF .deps/compress.Tpo -c -o compress.lo compress.c
1457:info:build  /Developer/usr/bin/llvm-gcc-4.2 -DHAVE_CONFIG_H -I. -I/opt/local/include -I/opt/local/Library/Frameworks/Python.framework/Versions/2.4/include/python2.4 -DWITH_RSYNC_PAD -O3 -fomit-frame-pointer -Wall -Wpointer-arith -Wstrict-prototypes -Wmissing-prototypes -Wno-char-subscripts -DHAS_snprintf -DHAS_snprintf -MT compress.lo -MD -MP -MF .deps/compress.Tpo -c compress.c  -fno-common -DPIC -o .libs/compress.o
1458:info:build  /Developer/usr/bin/llvm-gcc-4.2 -DHAVE_CONFIG_H -I. -I/opt/local/include -I/opt/local/Library/Frameworks/Python.framework/Versions/2.4/include/python2.4 -DWITH_RSYNC_PAD -O3 -fomit-frame-pointer -Wall -Wpointer-arith -Wstrict-prototypes -Wmissing-prototypes -Wno-char-subscripts -DHAS_snprintf -DHAS_snprintf -MT compress.lo -MD -MP -MF .deps/compress.Tpo -c compress.c -o compress.o >/dev/null 2>&1
1459:info:build mv -f .deps/compress.Tpo .deps/compress.Plo
1460:info:build /bin/sh ./libtool --tag=CC   --mode=compile /Developer/usr/bin/llvm-gcc-4.2 -DHAVE_CONFIG_H -I.   -I/opt/local/include -I/opt/local/Library/Frameworks/Python.framework/Versions/2.4/include/python2.4  -DWITH_RSYNC_PAD -O3 -fomit-frame-pointer -Wall -Wpointer-arith -Wstrict-prototypes -Wmissing-prototypes -Wno-char-subscripts -DHAS_snprintf -DHAS_snprintf -MT crc32.lo -MD -MP -MF .deps/crc32.Tpo -c -o crc32.lo crc32.c
1461:info:build  /Developer/usr/bin/llvm-gcc-4.2 -DHAVE_CONFIG_H -I. -I/opt/local/include -I/opt/local/Library/Frameworks/Python.framework/Versions/2.4/include/python2.4 -DWITH_RSYNC_PAD -O3 -fomit-frame-pointer -Wall -Wpointer-arith -Wstrict-prototypes -Wmissing-prototypes -Wno-char-subscripts -DHAS_snprintf -DHAS_snprintf -MT crc32.lo -MD -MP -MF .deps/crc32.Tpo -c crc32.c  -fno-common -DPIC -o .libs/crc32.o
1462:info:build  /Developer/usr/bin/llvm-gcc-4.2 -DHAVE_CONFIG_H -I. -I/opt/local/include -I/opt/local/Library/Frameworks/Python.framework/Versions/2.4/include/python2.4 -DWITH_RSYNC_PAD -O3 -fomit-frame-pointer -Wall -Wpointer-arith -Wstrict-prototypes -Wmissing-prototypes -Wno-char-subscripts -DHAS_snprintf -DHAS_snprintf -MT crc32.lo -MD -MP -MF .deps/crc32.Tpo -c crc32.c -o crc32.o >/dev/null 2>&1
1463:info:build mv -f .deps/crc32.Tpo .deps/crc32.Plo
1464:info:build /bin/sh ./libtool --tag=CC   --mode=compile /Developer/usr/bin/llvm-gcc-4.2 -DHAVE_CONFIG_H -I.   -I/opt/local/include -I/opt/local/Library/Frameworks/Python.framework/Versions/2.4/include/python2.4  -DWITH_RSYNC_PAD -O3 -fomit-frame-pointer -Wall -Wpointer-arith -Wstrict-prototypes -Wmissing-prototypes -Wno-char-subscripts -DHAS_snprintf -DHAS_snprintf -MT deflate.lo -MD -MP -MF .deps/deflate.Tpo -c -o deflate.lo deflate.c
1465:info:build  /Developer/usr/bin/llvm-gcc-4.2 -DHAVE_CONFIG_H -I. -I/opt/local/include -I/opt/local/Library/Frameworks/Python.framework/Versions/2.4/include/python2.4 -DWITH_RSYNC_PAD -O3 -fomit-frame-pointer -Wall -Wpointer-arith -Wstrict-prototypes -Wmissing-prototypes -Wno-char-subscripts -DHAS_snprintf -DHAS_snprintf -MT deflate.lo -MD -MP -MF .deps/deflate.Tpo -c deflate.c  -fno-common -DPIC -o .libs/deflate.o
1466:info:build  /Developer/usr/bin/llvm-gcc-4.2 -DHAVE_CONFIG_H -I. -I/opt/local/include -I/opt/local/Library/Frameworks/Python.framework/Versions/2.4/include/python2.4 -DWITH_RSYNC_PAD -O3 -fomit-frame-pointer -Wall -Wpointer-arith -Wstrict-prototypes -Wmissing-prototypes -Wno-char-subscripts -DHAS_snprintf -DHAS_snprintf -MT deflate.lo -MD -MP -MF .deps/deflate.Tpo -c deflate.c -o deflate.o >/dev/null 2>&1
1467:info:build mv -f .deps/deflate.Tpo .deps/deflate.Plo
1468:info:build /bin/sh ./libtool --tag=CC   --mode=compile /Developer/usr/bin/llvm-gcc-4.2 -DHAVE_CONFIG_H -I.   -I/opt/local/include -I/opt/local/Library/Frameworks/Python.framework/Versions/2.4/include/python2.4  -DWITH_RSYNC_PAD -O3 -fomit-frame-pointer -Wall -Wpointer-arith -Wstrict-prototypes -Wmissing-prototypes -Wno-char-subscripts -DHAS_snprintf -DHAS_snprintf -MT gzio.lo -MD -MP -MF .deps/gzio.Tpo -c -o gzio.lo gzio.c
1469:info:build  /Developer/usr/bin/llvm-gcc-4.2 -DHAVE_CONFIG_H -I. -I/opt/local/include -I/opt/local/Library/Frameworks/Python.framework/Versions/2.4/include/python2.4 -DWITH_RSYNC_PAD -O3 -fomit-frame-pointer -Wall -Wpointer-arith -Wstrict-prototypes -Wmissing-prototypes -Wno-char-subscripts -DHAS_snprintf -DHAS_snprintf -MT gzio.lo -MD -MP -MF .deps/gzio.Tpo -c gzio.c  -fno-common -DPIC -o .libs/gzio.o
1470:info:build  /Developer/usr/bin/llvm-gcc-4.2 -DHAVE_CONFIG_H -I. -I/opt/local/include -I/opt/local/Library/Frameworks/Python.framework/Versions/2.4/include/python2.4 -DWITH_RSYNC_PAD -O3 -fomit-frame-pointer -Wall -Wpointer-arith -Wstrict-prototypes -Wmissing-prototypes -Wno-char-subscripts -DHAS_snprintf -DHAS_snprintf -MT gzio.lo -MD -MP -MF .deps/gzio.Tpo -c gzio.c -o gzio.o >/dev/null 2>&1
1471:info:build mv -f .deps/gzio.Tpo .deps/gzio.Plo
1472:info:build /bin/sh ./libtool --tag=CC   --mode=compile /Developer/usr/bin/llvm-gcc-4.2 -DHAVE_CONFIG_H -I.   -I/opt/local/include -I/opt/local/Library/Frameworks/Python.framework/Versions/2.4/include/python2.4  -DWITH_RSYNC_PAD -O3 -fomit-frame-pointer -Wall -Wpointer-arith -Wstrict-prototypes -Wmissing-prototypes -Wno-char-subscripts -DHAS_snprintf -DHAS_snprintf -MT infback.lo -MD -MP -MF .deps/infback.Tpo -c -o infback.lo infback.c
1473:info:build  /Developer/usr/bin/llvm-gcc-4.2 -DHAVE_CONFIG_H -I. -I/opt/local/include -I/opt/local/Library/Frameworks/Python.framework/Versions/2.4/include/python2.4 -DWITH_RSYNC_PAD -O3 -fomit-frame-pointer -Wall -Wpointer-arith -Wstrict-prototypes -Wmissing-prototypes -Wno-char-subscripts -DHAS_snprintf -DHAS_snprintf -MT infback.lo -MD -MP -MF .deps/infback.Tpo -c infback.c  -fno-common -DPIC -o .libs/infback.o
1474:info:build  /Developer/usr/bin/llvm-gcc-4.2 -DHAVE_CONFIG_H -I. -I/opt/local/include -I/opt/local/Library/Frameworks/Python.framework/Versions/2.4/include/python2.4 -DWITH_RSYNC_PAD -O3 -fomit-frame-pointer -Wall -Wpointer-arith -Wstrict-prototypes -Wmissing-prototypes -Wno-char-subscripts -DHAS_snprintf -DHAS_snprintf -MT infback.lo -MD -MP -MF .deps/infback.Tpo -c infback.c -o infback.o >/dev/null 2>&1
1475:info:build mv -f .deps/infback.Tpo .deps/infback.Plo
1476:info:build /bin/sh ./libtool --tag=CC   --mode=compile /Developer/usr/bin/llvm-gcc-4.2 -DHAVE_CONFIG_H -I.   -I/opt/local/include -I/opt/local/Library/Frameworks/Python.framework/Versions/2.4/include/python2.4  -DWITH_RSYNC_PAD -O3 -fomit-frame-pointer -Wall -Wpointer-arith -Wstrict-prototypes -Wmissing-prototypes -Wno-char-subscripts -DHAS_snprintf -DHAS_snprintf -MT inffast.lo -MD -MP -MF .deps/inffast.Tpo -c -o inffast.lo inffast.c
1477:info:build  /Developer/usr/bin/llvm-gcc-4.2 -DHAVE_CONFIG_H -I. -I/opt/local/include -I/opt/local/Library/Frameworks/Python.framework/Versions/2.4/include/python2.4 -DWITH_RSYNC_PAD -O3 -fomit-frame-pointer -Wall -Wpointer-arith -Wstrict-prototypes -Wmissing-prototypes -Wno-char-subscripts -DHAS_snprintf -DHAS_snprintf -MT inffast.lo -MD -MP -MF .deps/inffast.Tpo -c inffast.c  -fno-common -DPIC -o .libs/inffast.o
1478:info:build  /Developer/usr/bin/llvm-gcc-4.2 -DHAVE_CONFIG_H -I. -I/opt/local/include -I/opt/local/Library/Frameworks/Python.framework/Versions/2.4/include/python2.4 -DWITH_RSYNC_PAD -O3 -fomit-frame-pointer -Wall -Wpointer-arith -Wstrict-prototypes -Wmissing-prototypes -Wno-char-subscripts -DHAS_snprintf -DHAS_snprintf -MT inffast.lo -MD -MP -MF .deps/inffast.Tpo -c inffast.c -o inffast.o >/dev/null 2>&1
1479:info:build mv -f .deps/inffast.Tpo .deps/inffast.Plo
1480:info:build /bin/sh ./libtool --tag=CC   --mode=compile /Developer/usr/bin/llvm-gcc-4.2 -DHAVE_CONFIG_H -I.   -I/opt/local/include -I/opt/local/Library/Frameworks/Python.framework/Versions/2.4/include/python2.4  -DWITH_RSYNC_PAD -O3 -fomit-frame-pointer -Wall -Wpointer-arith -Wstrict-prototypes -Wmissing-prototypes -Wno-char-subscripts -DHAS_snprintf -DHAS_snprintf -MT inflate.lo -MD -MP -MF .deps/inflate.Tpo -c -o inflate.lo inflate.c
1481:info:build  /Developer/usr/bin/llvm-gcc-4.2 -DHAVE_CONFIG_H -I. -I/opt/local/include -I/opt/local/Library/Frameworks/Python.framework/Versions/2.4/include/python2.4 -DWITH_RSYNC_PAD -O3 -fomit-frame-pointer -Wall -Wpointer-arith -Wstrict-prototypes -Wmissing-prototypes -Wno-char-subscripts -DHAS_snprintf -DHAS_snprintf -MT inflate.lo -MD -MP -MF .deps/inflate.Tpo -c inflate.c  -fno-common -DPIC -o .libs/inflate.o
1482:info:build  /Developer/usr/bin/llvm-gcc-4.2 -DHAVE_CONFIG_H -I. -I/opt/local/include -I/opt/local/Library/Frameworks/Python.framework/Versions/2.4/include/python2.4 -DWITH_RSYNC_PAD -O3 -fomit-frame-pointer -Wall -Wpointer-arith -Wstrict-prototypes -Wmissing-prototypes -Wno-char-subscripts -DHAS_snprintf -DHAS_snprintf -MT inflate.lo -MD -MP -MF .deps/inflate.Tpo -c inflate.c -o inflate.o >/dev/null 2>&1
1483:info:build mv -f .deps/inflate.Tpo .deps/inflate.Plo
1484:info:build /bin/sh ./libtool --tag=CC   --mode=compile /Developer/usr/bin/llvm-gcc-4.2 -DHAVE_CONFIG_H -I.   -I/opt/local/include -I/opt/local/Library/Frameworks/Python.framework/Versions/2.4/include/python2.4  -DWITH_RSYNC_PAD -O3 -fomit-frame-pointer -Wall -Wpointer-arith -Wstrict-prototypes -Wmissing-prototypes -Wno-char-subscripts -DHAS_snprintf -DHAS_snprintf -MT inftrees.lo -MD -MP -MF .deps/inftrees.Tpo -c -o inftrees.lo inftrees.c
1485:info:build  /Developer/usr/bin/llvm-gcc-4.2 -DHAVE_CONFIG_H -I. -I/opt/local/include -I/opt/local/Library/Frameworks/Python.framework/Versions/2.4/include/python2.4 -DWITH_RSYNC_PAD -O3 -fomit-frame-pointer -Wall -Wpointer-arith -Wstrict-prototypes -Wmissing-prototypes -Wno-char-subscripts -DHAS_snprintf -DHAS_snprintf -MT inftrees.lo -MD -MP -MF .deps/inftrees.Tpo -c inftrees.c  -fno-common -DPIC -o .libs/inftrees.o
1486:info:build  /Developer/usr/bin/llvm-gcc-4.2 -DHAVE_CONFIG_H -I. -I/opt/local/include -I/opt/local/Library/Frameworks/Python.framework/Versions/2.4/include/python2.4 -DWITH_RSYNC_PAD -O3 -fomit-frame-pointer -Wall -Wpointer-arith -Wstrict-prototypes -Wmissing-prototypes -Wno-char-subscripts -DHAS_snprintf -DHAS_snprintf -MT inftrees.lo -MD -MP -MF .deps/inftrees.Tpo -c inftrees.c -o inftrees.o >/dev/null 2>&1
1487:info:build mv -f .deps/inftrees.Tpo .deps/inftrees.Plo
1488:info:build /bin/sh ./libtool --tag=CC   --mode=compile /Developer/usr/bin/llvm-gcc-4.2 -DHAVE_CONFIG_H -I.   -I/opt/local/include -I/opt/local/Library/Frameworks/Python.framework/Versions/2.4/include/python2.4  -DWITH_RSYNC_PAD -O3 -fomit-frame-pointer -Wall -Wpointer-arith -Wstrict-prototypes -Wmissing-prototypes -Wno-char-subscripts -DHAS_snprintf -DHAS_snprintf -MT trees.lo -MD -MP -MF .deps/trees.Tpo -c -o trees.lo trees.c
1489:info:build  /Developer/usr/bin/llvm-gcc-4.2 -DHAVE_CONFIG_H -I. -I/opt/local/include -I/opt/local/Library/Frameworks/Python.framework/Versions/2.4/include/python2.4 -DWITH_RSYNC_PAD -O3 -fomit-frame-pointer -Wall -Wpointer-arith -Wstrict-prototypes -Wmissing-prototypes -Wno-char-subscripts -DHAS_snprintf -DHAS_snprintf -MT trees.lo -MD -MP -MF .deps/trees.Tpo -c trees.c  -fno-common -DPIC -o .libs/trees.o
1490:info:build  /Developer/usr/bin/llvm-gcc-4.2 -DHAVE_CONFIG_H -I. -I/opt/local/include -I/opt/local/Library/Frameworks/Python.framework/Versions/2.4/include/python2.4 -DWITH_RSYNC_PAD -O3 -fomit-frame-pointer -Wall -Wpointer-arith -Wstrict-prototypes -Wmissing-prototypes -Wno-char-subscripts -DHAS_snprintf -DHAS_snprintf -MT trees.lo -MD -MP -MF .deps/trees.Tpo -c trees.c -o trees.o >/dev/null 2>&1
1491:info:build mv -f .deps/trees.Tpo .deps/trees.Plo
1492:info:build /bin/sh ./libtool --tag=CC   --mode=compile /Developer/usr/bin/llvm-gcc-4.2 -DHAVE_CONFIG_H -I.   -I/opt/local/include -I/opt/local/Library/Frameworks/Python.framework/Versions/2.4/include/python2.4  -DWITH_RSYNC_PAD -O3 -fomit-frame-pointer -Wall -Wpointer-arith -Wstrict-prototypes -Wmissing-prototypes -Wno-char-subscripts -DHAS_snprintf -DHAS_snprintf -MT uncompr.lo -MD -MP -MF .deps/uncompr.Tpo -c -o uncompr.lo uncompr.c
1493:info:build  /Developer/usr/bin/llvm-gcc-4.2 -DHAVE_CONFIG_H -I. -I/opt/local/include -I/opt/local/Library/Frameworks/Python.framework/Versions/2.4/include/python2.4 -DWITH_RSYNC_PAD -O3 -fomit-frame-pointer -Wall -Wpointer-arith -Wstrict-prototypes -Wmissing-prototypes -Wno-char-subscripts -DHAS_snprintf -DHAS_snprintf -MT uncompr.lo -MD -MP -MF .deps/uncompr.Tpo -c uncompr.c  -fno-common -DPIC -o .libs/uncompr.o
1494:info:build  /Developer/usr/bin/llvm-gcc-4.2 -DHAVE_CONFIG_H -I. -I/opt/local/include -I/opt/local/Library/Frameworks/Python.framework/Versions/2.4/include/python2.4 -DWITH_RSYNC_PAD -O3 -fomit-frame-pointer -Wall -Wpointer-arith -Wstrict-prototypes -Wmissing-prototypes -Wno-char-subscripts -DHAS_snprintf -DHAS_snprintf -MT uncompr.lo -MD -MP -MF .deps/uncompr.Tpo -c uncompr.c -o uncompr.o >/dev/null 2>&1
1495:info:build mv -f .deps/uncompr.Tpo .deps/uncompr.Plo
1496:info:build /bin/sh ./libtool --tag=CC   --mode=compile /Developer/usr/bin/llvm-gcc-4.2 -DHAVE_CONFIG_H -I.   -I/opt/local/include -I/opt/local/Library/Frameworks/Python.framework/Versions/2.4/include/python2.4  -DWITH_RSYNC_PAD -O3 -fomit-frame-pointer -Wall -Wpointer-arith -Wstrict-prototypes -Wmissing-prototypes -Wno-char-subscripts -DHAS_snprintf -DHAS_snprintf -MT zutil.lo -MD -MP -MF .deps/zutil.Tpo -c -o zutil.lo zutil.c
1497:info:build  /Developer/usr/bin/llvm-gcc-4.2 -DHAVE_CONFIG_H -I. -I/opt/local/include -I/opt/local/Library/Frameworks/Python.framework/Versions/2.4/include/python2.4 -DWITH_RSYNC_PAD -O3 -fomit-frame-pointer -Wall -Wpointer-arith -Wstrict-prototypes -Wmissing-prototypes -Wno-char-subscripts -DHAS_snprintf -DHAS_snprintf -MT zutil.lo -MD -MP -MF .deps/zutil.Tpo -c zutil.c  -fno-common -DPIC -o .libs/zutil.o
1498:info:build  /Developer/usr/bin/llvm-gcc-4.2 -DHAVE_CONFIG_H -I. -I/opt/local/include -I/opt/local/Library/Frameworks/Python.framework/Versions/2.4/include/python2.4 -DWITH_RSYNC_PAD -O3 -fomit-frame-pointer -Wall -Wpointer-arith -Wstrict-prototypes -Wmissing-prototypes -Wno-char-subscripts -DHAS_snprintf -DHAS_snprintf -MT zutil.lo -MD -MP -MF .deps/zutil.Tpo -c zutil.c -o zutil.o >/dev/null 2>&1
1499:info:build mv -f .deps/zutil.Tpo .deps/zutil.Plo
1500:info:build /bin/sh ./libtool --tag=CC   --mode=link /Developer/usr/bin/llvm-gcc-4.2  -DWITH_RSYNC_PAD -O3 -fomit-frame-pointer -Wall -Wpointer-arith -Wstrict-prototypes -Wmissing-prototypes -Wno-char-subscripts -DHAS_snprintf -DHAS_snprintf  -L/opt/local/lib -arch x86_64 -o libz.la  adler32.lo compress.lo crc32.lo deflate.lo gzio.lo infback.lo inffast.lo inflate.lo inftrees.lo trees.lo uncompr.lo zutil.lo 
1501:info:build ar cru .libs/libz.a .libs/adler32.o .libs/compress.o .libs/crc32.o .libs/deflate.o .libs/gzio.o .libs/infback.o .libs/inffast.o .libs/inflate.o .libs/inftrees.o .libs/trees.o .libs/uncompr.o .libs/zutil.o
1502:info:build ranlib .libs/libz.a
1503:info:build creating libz.la
1504:info:build (cd .libs && rm -f libz.la && ln -s ../libz.la libz.la)
1505:info:build /Developer/usr/bin/llvm-gcc-4.2 -DHAVE_CONFIG_H -I.   -I/opt/local/include -I/opt/local/Library/Frameworks/Python.framework/Versions/2.4/include/python2.4  -DWITH_RSYNC_PAD -O3 -fomit-frame-pointer -Wall -Wpointer-arith -Wstrict-prototypes -Wmissing-prototypes -Wno-char-subscripts -DHAS_snprintf -DHAS_snprintf -MT example.o -MD -MP -MF .deps/example.Tpo -c -o example.o example.c
1506:info:build mv -f .deps/example.Tpo .deps/example.Po
1507:info:build /bin/sh ./libtool --tag=CC   --mode=link /Developer/usr/bin/llvm-gcc-4.2  -DWITH_RSYNC_PAD -O3 -fomit-frame-pointer -Wall -Wpointer-arith -Wstrict-prototypes -Wmissing-prototypes -Wno-char-subscripts -DHAS_snprintf -DHAS_snprintf .libs/libz.a -L/opt/local/lib -arch x86_64 -o example example.o 
1508:info:build /Developer/usr/bin/llvm-gcc-4.2 -DWITH_RSYNC_PAD -O3 -fomit-frame-pointer -Wall -Wpointer-arith -Wstrict-prototypes -Wmissing-prototypes -Wno-char-subscripts -DHAS_snprintf -DHAS_snprintf -arch x86_64 -o example example.o  .libs/libz.a -L/opt/local/lib 
1509:info:build /Developer/usr/bin/llvm-gcc-4.2 -DHAVE_CONFIG_H -I.   -I/opt/local/include -I/opt/local/Library/Frameworks/Python.framework/Versions/2.4/include/python2.4  -DWITH_RSYNC_PAD -O3 -fomit-frame-pointer -Wall -Wpointer-arith -Wstrict-prototypes -Wmissing-prototypes -Wno-char-subscripts -DHAS_snprintf -DHAS_snprintf -MT minigzip.o -MD -MP -MF .deps/minigzip.Tpo -c -o minigzip.o minigzip.c
1510:info:build mv -f .deps/minigzip.Tpo .deps/minigzip.Po
1511:info:build /bin/sh ./libtool --tag=CC   --mode=link /Developer/usr/bin/llvm-gcc-4.2  -DWITH_RSYNC_PAD -O3 -fomit-frame-pointer -Wall -Wpointer-arith -Wstrict-prototypes -Wmissing-prototypes -Wno-char-subscripts -DHAS_snprintf -DHAS_snprintf .libs/libz.a -L/opt/local/lib -arch x86_64 -o minigzip minigzip.o 
1512:info:build /Developer/usr/bin/llvm-gcc-4.2 -DWITH_RSYNC_PAD -O3 -fomit-frame-pointer -Wall -Wpointer-arith -Wstrict-prototypes -Wmissing-prototypes -Wno-char-subscripts -DHAS_snprintf -DHAS_snprintf -arch x86_64 -o minigzip minigzip.o  .libs/libz.a -L/opt/local/lib 
1513:info:build gnumake[3]: Leaving directory `/opt/local/var/macports/build/_opt_local_var_macports_sources_rsync.macports.org_release_ports_sysutils_rpm/rpm/work/rpm-4.4.9/zlib'
1514:info:build gnumake[2]: Leaving directory `/opt/local/var/macports/build/_opt_local_var_macports_sources_rsync.macports.org_release_ports_sysutils_rpm/rpm/work/rpm-4.4.9/zlib'
1515:info:build Making all in file
1516:info:build gnumake[2]: Entering directory `/opt/local/var/macports/build/_opt_local_var_macports_sources_rsync.macports.org_release_ports_sysutils_rpm/rpm/work/rpm-4.4.9/file'
1517:info:build /usr/bin/gnumake  all-recursive
1518:info:build gnumake[3]: Entering directory `/opt/local/var/macports/build/_opt_local_var_macports_sources_rsync.macports.org_release_ports_sysutils_rpm/rpm/work/rpm-4.4.9/file'
1519:info:build Making all in src
1520:info:build gnumake[4]: Entering directory `/opt/local/var/macports/build/_opt_local_var_macports_sources_rsync.macports.org_release_ports_sysutils_rpm/rpm/work/rpm-4.4.9/file/src'
1521:info:build /usr/bin/gnumake  all-am
1522:info:build gnumake[5]: Entering directory `/opt/local/var/macports/build/_opt_local_var_macports_sources_rsync.macports.org_release_ports_sysutils_rpm/rpm/work/rpm-4.4.9/file/src'
1523:info:build /bin/sh ../libtool --tag=CC   --mode=compile /Developer/usr/bin/llvm-gcc-4.2 -DHAVE_CONFIG_H -I. -I.. -I../.. -I../../zlib -DMAGIC='"/opt/local/lib/rpm/magic"' -DHAVE_LIBZ=1 -I/opt/local/include -I/opt/local/Library/Frameworks/Python.framework/Versions/2.4/include/python2.4  -O2 -arch x86_64 -MT magic.lo -MD -MP -MF .deps/magic.Tpo -c -o magic.lo magic.c
1524:info:build mkdir .libs
1525:info:build  /Developer/usr/bin/llvm-gcc-4.2 -DHAVE_CONFIG_H -I. -I.. -I../.. -I../../zlib -DMAGIC=\"/opt/local/lib/rpm/magic\" -DHAVE_LIBZ=1 -I/opt/local/include -I/opt/local/Library/Frameworks/Python.framework/Versions/2.4/include/python2.4 -O2 -arch x86_64 -MT magic.lo -MD -MP -MF .deps/magic.Tpo -c magic.c  -fno-common -DPIC -o .libs/magic.o
1526:info:build  /Developer/usr/bin/llvm-gcc-4.2 -DHAVE_CONFIG_H -I. -I.. -I../.. -I../../zlib -DMAGIC=\"/opt/local/lib/rpm/magic\" -DHAVE_LIBZ=1 -I/opt/local/include -I/opt/local/Library/Frameworks/Python.framework/Versions/2.4/include/python2.4 -O2 -arch x86_64 -MT magic.lo -MD -MP -MF .deps/magic.Tpo -c magic.c -o magic.o >/dev/null 2>&1
1527:info:build mv -f .deps/magic.Tpo .deps/magic.Plo
1528:info:build /bin/sh ../libtool --tag=CC   --mode=compile /Developer/usr/bin/llvm-gcc-4.2 -DHAVE_CONFIG_H -I. -I.. -I../.. -I../../zlib -DMAGIC='"/opt/local/lib/rpm/magic"' -DHAVE_LIBZ=1 -I/opt/local/include -I/opt/local/Library/Frameworks/Python.framework/Versions/2.4/include/python2.4  -O2 -arch x86_64 -MT apprentice.lo -MD -MP -MF .deps/apprentice.Tpo -c -o apprentice.lo apprentice.c
1529:info:build  /Developer/usr/bin/llvm-gcc-4.2 -DHAVE_CONFIG_H -I. -I.. -I../.. -I../../zlib -DMAGIC=\"/opt/local/lib/rpm/magic\" -DHAVE_LIBZ=1 -I/opt/local/include -I/opt/local/Library/Frameworks/Python.framework/Versions/2.4/include/python2.4 -O2 -arch x86_64 -MT apprentice.lo -MD -MP -MF .deps/apprentice.Tpo -c apprentice.c  -fno-common -DPIC -o .libs/apprentice.o
1530:info:build  /Developer/usr/bin/llvm-gcc-4.2 -DHAVE_CONFIG_H -I. -I.. -I../.. -I../../zlib -DMAGIC=\"/opt/local/lib/rpm/magic\" -DHAVE_LIBZ=1 -I/opt/local/include -I/opt/local/Library/Frameworks/Python.framework/Versions/2.4/include/python2.4 -O2 -arch x86_64 -MT apprentice.lo -MD -MP -MF .deps/apprentice.Tpo -c apprentice.c -o apprentice.o >/dev/null 2>&1
1531:info:build mv -f .deps/apprentice.Tpo .deps/apprentice.Plo
1532:info:build /bin/sh ../libtool --tag=CC   --mode=compile /Developer/usr/bin/llvm-gcc-4.2 -DHAVE_CONFIG_H -I. -I.. -I../.. -I../../zlib -DMAGIC='"/opt/local/lib/rpm/magic"' -DHAVE_LIBZ=1 -I/opt/local/include -I/opt/local/Library/Frameworks/Python.framework/Versions/2.4/include/python2.4  -O2 -arch x86_64 -MT softmagic.lo -MD -MP -MF .deps/softmagic.Tpo -c -o softmagic.lo softmagic.c
1533:info:build  /Developer/usr/bin/llvm-gcc-4.2 -DHAVE_CONFIG_H -I. -I.. -I../.. -I../../zlib -DMAGIC=\"/opt/local/lib/rpm/magic\" -DHAVE_LIBZ=1 -I/opt/local/include -I/opt/local/Library/Frameworks/Python.framework/Versions/2.4/include/python2.4 -O2 -arch x86_64 -MT softmagic.lo -MD -MP -MF .deps/softmagic.Tpo -c softmagic.c  -fno-common -DPIC -o .libs/softmagic.o
1534:info:build  /Developer/usr/bin/llvm-gcc-4.2 -DHAVE_CONFIG_H -I. -I.. -I../.. -I../../zlib -DMAGIC=\"/opt/local/lib/rpm/magic\" -DHAVE_LIBZ=1 -I/opt/local/include -I/opt/local/Library/Frameworks/Python.framework/Versions/2.4/include/python2.4 -O2 -arch x86_64 -MT softmagic.lo -MD -MP -MF .deps/softmagic.Tpo -c softmagic.c -o softmagic.o >/dev/null 2>&1
1535:info:build mv -f .deps/softmagic.Tpo .deps/softmagic.Plo
1536:info:build /bin/sh ../libtool --tag=CC   --mode=compile /Developer/usr/bin/llvm-gcc-4.2 -DHAVE_CONFIG_H -I. -I.. -I../.. -I../../zlib -DMAGIC='"/opt/local/lib/rpm/magic"' -DHAVE_LIBZ=1 -I/opt/local/include -I/opt/local/Library/Frameworks/Python.framework/Versions/2.4/include/python2.4  -O2 -arch x86_64 -MT ascmagic.lo -MD -MP -MF .deps/ascmagic.Tpo -c -o ascmagic.lo ascmagic.c
1537:info:build  /Developer/usr/bin/llvm-gcc-4.2 -DHAVE_CONFIG_H -I. -I.. -I../.. -I../../zlib -DMAGIC=\"/opt/local/lib/rpm/magic\" -DHAVE_LIBZ=1 -I/opt/local/include -I/opt/local/Library/Frameworks/Python.framework/Versions/2.4/include/python2.4 -O2 -arch x86_64 -MT ascmagic.lo -MD -MP -MF .deps/ascmagic.Tpo -c ascmagic.c  -fno-common -DPIC -o .libs/ascmagic.o
1538:info:build  /Developer/usr/bin/llvm-gcc-4.2 -DHAVE_CONFIG_H -I. -I.. -I../.. -I../../zlib -DMAGIC=\"/opt/local/lib/rpm/magic\" -DHAVE_LIBZ=1 -I/opt/local/include -I/opt/local/Library/Frameworks/Python.framework/Versions/2.4/include/python2.4 -O2 -arch x86_64 -MT ascmagic.lo -MD -MP -MF .deps/ascmagic.Tpo -c ascmagic.c -o ascmagic.o >/dev/null 2>&1
1539:info:build mv -f .deps/ascmagic.Tpo .deps/ascmagic.Plo
1540:info:build /bin/sh ../libtool --tag=CC   --mode=compile /Developer/usr/bin/llvm-gcc-4.2 -DHAVE_CONFIG_H -I. -I.. -I../.. -I../../zlib -DMAGIC='"/opt/local/lib/rpm/magic"' -DHAVE_LIBZ=1 -I/opt/local/include -I/opt/local/Library/Frameworks/Python.framework/Versions/2.4/include/python2.4  -O2 -arch x86_64 -MT compress.lo -MD -MP -MF .deps/compress.Tpo -c -o compress.lo compress.c
1541:info:build  /Developer/usr/bin/llvm-gcc-4.2 -DHAVE_CONFIG_H -I. -I.. -I../.. -I../../zlib -DMAGIC=\"/opt/local/lib/rpm/magic\" -DHAVE_LIBZ=1 -I/opt/local/include -I/opt/local/Library/Frameworks/Python.framework/Versions/2.4/include/python2.4 -O2 -arch x86_64 -MT compress.lo -MD -MP -MF .deps/compress.Tpo -c compress.c  -fno-common -DPIC -o .libs/compress.o
1542:info:build  /Developer/usr/bin/llvm-gcc-4.2 -DHAVE_CONFIG_H -I. -I.. -I../.. -I../../zlib -DMAGIC=\"/opt/local/lib/rpm/magic\" -DHAVE_LIBZ=1 -I/opt/local/include -I/opt/local/Library/Frameworks/Python.framework/Versions/2.4/include/python2.4 -O2 -arch x86_64 -MT compress.lo -MD -MP -MF .deps/compress.Tpo -c compress.c -o compress.o >/dev/null 2>&1
1543:info:build mv -f .deps/compress.Tpo .deps/compress.Plo
1544:info:build /bin/sh ../libtool --tag=CC   --mode=compile /Developer/usr/bin/llvm-gcc-4.2 -DHAVE_CONFIG_H -I. -I.. -I../.. -I../../zlib -DMAGIC='"/opt/local/lib/rpm/magic"' -DHAVE_LIBZ=1 -I/opt/local/include -I/opt/local/Library/Frameworks/Python.framework/Versions/2.4/include/python2.4  -O2 -arch x86_64 -MT is_tar.lo -MD -MP -MF .deps/is_tar.Tpo -c -o is_tar.lo is_tar.c
1545:info:build  /Developer/usr/bin/llvm-gcc-4.2 -DHAVE_CONFIG_H -I. -I.. -I../.. -I../../zlib -DMAGIC=\"/opt/local/lib/rpm/magic\" -DHAVE_LIBZ=1 -I/opt/local/include -I/opt/local/Library/Frameworks/Python.framework/Versions/2.4/include/python2.4 -O2 -arch x86_64 -MT is_tar.lo -MD -MP -MF .deps/is_tar.Tpo -c is_tar.c  -fno-common -DPIC -o .libs/is_tar.o
1546:info:build  /Developer/usr/bin/llvm-gcc-4.2 -DHAVE_CONFIG_H -I. -I.. -I../.. -I../../zlib -DMAGIC=\"/opt/local/lib/rpm/magic\" -DHAVE_LIBZ=1 -I/opt/local/include -I/opt/local/Library/Frameworks/Python.framework/Versions/2.4/include/python2.4 -O2 -arch x86_64 -MT is_tar.lo -MD -MP -MF .deps/is_tar.Tpo -c is_tar.c -o is_tar.o >/dev/null 2>&1
1547:info:build mv -f .deps/is_tar.Tpo .deps/is_tar.Plo
1548:info:build /bin/sh ../libtool --tag=CC   --mode=compile /Developer/usr/bin/llvm-gcc-4.2 -DHAVE_CONFIG_H -I. -I.. -I../.. -I../../zlib -DMAGIC='"/opt/local/lib/rpm/magic"' -DHAVE_LIBZ=1 -I/opt/local/include -I/opt/local/Library/Frameworks/Python.framework/Versions/2.4/include/python2.4  -O2 -arch x86_64 -MT readelf.lo -MD -MP -MF .deps/readelf.Tpo -c -o readelf.lo readelf.c
1549:info:build  /Developer/usr/bin/llvm-gcc-4.2 -DHAVE_CONFIG_H -I. -I.. -I../.. -I../../zlib -DMAGIC=\"/opt/local/lib/rpm/magic\" -DHAVE_LIBZ=1 -I/opt/local/include -I/opt/local/Library/Frameworks/Python.framework/Versions/2.4/include/python2.4 -O2 -arch x86_64 -MT readelf.lo -MD -MP -MF .deps/readelf.Tpo -c readelf.c  -fno-common -DPIC -o .libs/readelf.o
1550:info:build  /Developer/usr/bin/llvm-gcc-4.2 -DHAVE_CONFIG_H -I. -I.. -I../.. -I../../zlib -DMAGIC=\"/opt/local/lib/rpm/magic\" -DHAVE_LIBZ=1 -I/opt/local/include -I/opt/local/Library/Frameworks/Python.framework/Versions/2.4/include/python2.4 -O2 -arch x86_64 -MT readelf.lo -MD -MP -MF .deps/readelf.Tpo -c readelf.c -o readelf.o >/dev/null 2>&1
1551:info:build mv -f .deps/readelf.Tpo .deps/readelf.Plo
1552:info:build /bin/sh ../libtool --tag=CC   --mode=compile /Developer/usr/bin/llvm-gcc-4.2 -DHAVE_CONFIG_H -I. -I.. -I../.. -I../../zlib -DMAGIC='"/opt/local/lib/rpm/magic"' -DHAVE_LIBZ=1 -I/opt/local/include -I/opt/local/Library/Frameworks/Python.framework/Versions/2.4/include/python2.4  -O2 -arch x86_64 -MT print.lo -MD -MP -MF .deps/print.Tpo -c -o print.lo print.c
1553:info:build  /Developer/usr/bin/llvm-gcc-4.2 -DHAVE_CONFIG_H -I. -I.. -I../.. -I../../zlib -DMAGIC=\"/opt/local/lib/rpm/magic\" -DHAVE_LIBZ=1 -I/opt/local/include -I/opt/local/Library/Frameworks/Python.framework/Versions/2.4/include/python2.4 -O2 -arch x86_64 -MT print.lo -MD -MP -MF .deps/print.Tpo -c print.c  -fno-common -DPIC -o .libs/print.o
1554:info:build print.c: In function 'file_mdump':
1555:info:build print.c:55: warning: format '%zu' expects type 'size_t', but argument 3 has type 'uint32_t'
1556:info:build print.c:55: warning: format '%zu' expects type 'size_t', but argument 3 has type 'uint32_t'
1557:info:build  /Developer/usr/bin/llvm-gcc-4.2 -DHAVE_CONFIG_H -I. -I.. -I../.. -I../../zlib -DMAGIC=\"/opt/local/lib/rpm/magic\" -DHAVE_LIBZ=1 -I/opt/local/include -I/opt/local/Library/Frameworks/Python.framework/Versions/2.4/include/python2.4 -O2 -arch x86_64 -MT print.lo -MD -MP -MF .deps/print.Tpo -c print.c -o print.o >/dev/null 2>&1
1558:info:build mv -f .deps/print.Tpo .deps/print.Plo
1559:info:build /bin/sh ../libtool --tag=CC   --mode=compile /Developer/usr/bin/llvm-gcc-4.2 -DHAVE_CONFIG_H -I. -I.. -I../.. -I../../zlib -DMAGIC='"/opt/local/lib/rpm/magic"' -DHAVE_LIBZ=1 -I/opt/local/include -I/opt/local/Library/Frameworks/Python.framework/Versions/2.4/include/python2.4  -O2 -arch x86_64 -MT fsmagic.lo -MD -MP -MF .deps/fsmagic.Tpo -c -o fsmagic.lo fsmagic.c
1560:info:build  /Developer/usr/bin/llvm-gcc-4.2 -DHAVE_CONFIG_H -I. -I.. -I../.. -I../../zlib -DMAGIC=\"/opt/local/lib/rpm/magic\" -DHAVE_LIBZ=1 -I/opt/local/include -I/opt/local/Library/Frameworks/Python.framework/Versions/2.4/include/python2.4 -O2 -arch x86_64 -MT fsmagic.lo -MD -MP -MF .deps/fsmagic.Tpo -c fsmagic.c  -fno-common -DPIC -o .libs/fsmagic.o
1561:info:build  /Developer/usr/bin/llvm-gcc-4.2 -DHAVE_CONFIG_H -I. -I.. -I../.. -I../../zlib -DMAGIC=\"/opt/local/lib/rpm/magic\" -DHAVE_LIBZ=1 -I/opt/local/include -I/opt/local/Library/Frameworks/Python.framework/Versions/2.4/include/python2.4 -O2 -arch x86_64 -MT fsmagic.lo -MD -MP -MF .deps/fsmagic.Tpo -c fsmagic.c -o fsmagic.o >/dev/null 2>&1
1562:info:build mv -f .deps/fsmagic.Tpo .deps/fsmagic.Plo
1563:info:build /bin/sh ../libtool --tag=CC   --mode=compile /Developer/usr/bin/llvm-gcc-4.2 -DHAVE_CONFIG_H -I. -I.. -I../.. -I../../zlib -DMAGIC='"/opt/local/lib/rpm/magic"' -DHAVE_LIBZ=1 -I/opt/local/include -I/opt/local/Library/Frameworks/Python.framework/Versions/2.4/include/python2.4  -O2 -arch x86_64 -MT funcs.lo -MD -MP -MF .deps/funcs.Tpo -c -o funcs.lo funcs.c
1564:info:build  /Developer/usr/bin/llvm-gcc-4.2 -DHAVE_CONFIG_H -I. -I.. -I../.. -I../../zlib -DMAGIC=\"/opt/local/lib/rpm/magic\" -DHAVE_LIBZ=1 -I/opt/local/include -I/opt/local/Library/Frameworks/Python.framework/Versions/2.4/include/python2.4 -O2 -arch x86_64 -MT funcs.lo -MD -MP -MF .deps/funcs.Tpo -c funcs.c  -fno-common -DPIC -o .libs/funcs.o
1565:info:build  /Developer/usr/bin/llvm-gcc-4.2 -DHAVE_CONFIG_H -I. -I.. -I../.. -I../../zlib -DMAGIC=\"/opt/local/lib/rpm/magic\" -DHAVE_LIBZ=1 -I/opt/local/include -I/opt/local/Library/Frameworks/Python.framework/Versions/2.4/include/python2.4 -O2 -arch x86_64 -MT funcs.lo -MD -MP -MF .deps/funcs.Tpo -c funcs.c -o funcs.o >/dev/null 2>&1
1566:info:build mv -f .deps/funcs.Tpo .deps/funcs.Plo
1567:info:build /bin/sh ../libtool --tag=CC   --mode=compile /Developer/usr/bin/llvm-gcc-4.2 -DHAVE_CONFIG_H -I. -I.. -I../.. -I../../zlib -DMAGIC='"/opt/local/lib/rpm/magic"' -DHAVE_LIBZ=1 -I/opt/local/include -I/opt/local/Library/Frameworks/Python.framework/Versions/2.4/include/python2.4  -O2 -arch x86_64 -MT apptype.lo -MD -MP -MF .deps/apptype.Tpo -c -o apptype.lo apptype.c
1568:info:build  /Developer/usr/bin/llvm-gcc-4.2 -DHAVE_CONFIG_H -I. -I.. -I../.. -I../../zlib -DMAGIC=\"/opt/local/lib/rpm/magic\" -DHAVE_LIBZ=1 -I/opt/local/include -I/opt/local/Library/Frameworks/Python.framework/Versions/2.4/include/python2.4 -O2 -arch x86_64 -MT apptype.lo -MD -MP -MF .deps/apptype.Tpo -c apptype.c  -fno-common -DPIC -o .libs/apptype.o
1569:info:build  /Developer/usr/bin/llvm-gcc-4.2 -DHAVE_CONFIG_H -I. -I.. -I../.. -I../../zlib -DMAGIC=\"/opt/local/lib/rpm/magic\" -DHAVE_LIBZ=1 -I/opt/local/include -I/opt/local/Library/Frameworks/Python.framework/Versions/2.4/include/python2.4 -O2 -arch x86_64 -MT apptype.lo -MD -MP -MF .deps/apptype.Tpo -c apptype.c -o apptype.o >/dev/null 2>&1
1570:info:build mv -f .deps/apptype.Tpo .deps/apptype.Plo
1571:info:build /bin/sh ../libtool --tag=CC   --mode=link /Developer/usr/bin/llvm-gcc-4.2  -O2 -arch x86_64 -no-undefined -version-info 1:0:0 -L/opt/local/lib -arch x86_64 -o libmagic.la  magic.lo apprentice.lo softmagic.lo ascmagic.lo compress.lo is_tar.lo readelf.lo print.lo fsmagic.lo funcs.lo apptype.lo  -lz
1572:info:build libtool: link: warning: `-version-info/-version-number' is ignored for convenience libraries
1573:info:build ar cru .libs/libmagic.a .libs/magic.o .libs/apprentice.o .libs/softmagic.o .libs/ascmagic.o .libs/compress.o .libs/is_tar.o .libs/readelf.o .libs/print.o .libs/fsmagic.o .libs/funcs.o .libs/apptype.o
1574:info:build /usr/bin/ranlib: file: .libs/libmagic.a(apptype.o) has no symbols
1575:info:build ranlib .libs/libmagic.a
1576:info:build ranlib: file: .libs/libmagic.a(apptype.o) has no symbols
1577:info:build creating libmagic.la
1578:info:build (cd .libs && rm -f libmagic.la && ln -s ../libmagic.la libmagic.la)
1579:info:build /Developer/usr/bin/llvm-gcc-4.2 -DHAVE_CONFIG_H -I. -I.. -I../.. -I../../zlib -DMAGIC='"/opt/local/lib/rpm/magic"' -DHAVE_LIBZ=1 -I/opt/local/include -I/opt/local/Library/Frameworks/Python.framework/Versions/2.4/include/python2.4  -O2 -arch x86_64 -MT file.o -MD -MP -MF .deps/file.Tpo -c -o file.o file.c
1580:info:build mv -f .deps/file.Tpo .deps/file.Po
1581:info:build /bin/sh ../libtool --tag=CC   --mode=link /Developer/usr/bin/llvm-gcc-4.2  -O2 -arch x86_64 -L../../zlib  -L/opt/local/lib -arch x86_64 -o file file.o libmagic.la -lz
1582:info:build /Developer/usr/bin/llvm-gcc-4.2 -O2 -arch x86_64 -arch x86_64 -o file file.o  -L/opt/local/var/macports/build/_opt_local_var_macports_sources_rsync.macports.org_release_ports_sysutils_rpm/rpm/work/rpm-4.4.9/zlib -L/opt/local/lib ./.libs/libmagic.a /opt/local/var/macports/build/_opt_local_var_macports_sources_rsync.macports.org_release_ports_sysutils_rpm/rpm/work/rpm-4.4.9/zlib/.libs/libz.a 
1583:info:build gnumake[5]: Leaving directory `/opt/local/var/macports/build/_opt_local_var_macports_sources_rsync.macports.org_release_ports_sysutils_rpm/rpm/work/rpm-4.4.9/file/src'
1584:info:build gnumake[4]: Leaving directory `/opt/local/var/macports/build/_opt_local_var_macports_sources_rsync.macports.org_release_ports_sysutils_rpm/rpm/work/rpm-4.4.9/file/src'
1585:info:build Making all in magic
1586:info:build gnumake[4]: Entering directory `/opt/local/var/macports/build/_opt_local_var_macports_sources_rsync.macports.org_release_ports_sysutils_rpm/rpm/work/rpm-4.4.9/file/magic'
1587:info:build cat ./Header ./Localstuff > magic
1588:info:build for frag in Magdir/acorn Magdir/adi Magdir/adventure Magdir/allegro Magdir/alliant Magdir/alpha Magdir/amanda Magdir/amigaos Magdir/animation Magdir/apl Magdir/apple Magdir/applix Magdir/archive Magdir/asterix Magdir/att3b Magdir/audio Magdir/basis Magdir/bflt Magdir/blender Magdir/blit Magdir/bout Magdir/bsdi Magdir/btsnoop Magdir/cad Magdir/cafebabe Magdir/c-lang Magdir/c64 Magdir/cddb Magdir/chord Magdir/cisco Magdir/citrus Magdir/claris Magdir/clipper Magdir/cracklib Magdir/spec Magdir/commands Magdir/communications Magdir/compress Magdir/console Magdir/convex Magdir/ctags Magdir/dact Magdir/database Magdir/diamond Magdir/diff Magdir/digital Magdir/dolby Magdir/dump Magdir/editors Magdir/elf Magdir/encore Magdir/epoc Magdir/esri Magdir/fcs Magdir/filesystems Magdir/flash Magdir/fonts Magdir/frame Magdir/freebsd Magdir/fsav Magdir/games Magdir/geos Magdir/gcc Magdir/gimp Magdir/gnu Magdir/grace Magdir/gringotts Magdir/hitachi-sh Magdir/hp Magdir/human68k Magdir/ibm370 Magdir/ibm6000 Magdir/iff Magdir/images Magdir/intel Magdir/interleaf Magdir/island Magdir/ispell Magdir/java Magdir/jpeg Magdir/karma Magdir/lecter Magdir/lex Magdir/lif Magdir/linux Magdir/lisp Magdir/mach Magdir/macintosh Magdir/magic Magdir/mail.news Magdir/maple Magdir/mathematica Magdir/matroska Magdir/mcrypt Magdir/mime Magdir/mips Magdir/mirage Magdir/misctools Magdir/mkid Magdir/mlssa Magdir/mmdf Magdir/modem Magdir/motorola Magdir/msdos Magdir/msvc Magdir/mup Magdir/natinst Magdir/ncr Magdir/netbsd Magdir/netscape Magdir/news Magdir/nitpicker Magdir/ocaml Magdir/octave Magdir/olf Magdir/os2 Magdir/os400 Magdir/os9 Magdir/osf1 Magdir/palm Magdir/parix Magdir/pbm Magdir/pdf Magdir/pdp Magdir/perl Magdir/pgp Magdir/pkgadd Magdir/plan9 Magdir/plus5 Magdir/policy Magdir/printer Magdir/project Magdir/psdbms Magdir/psion Magdir/pulsar Magdir/pyramid Magdir/python Magdir/revision Magdir/riff Magdir/rpm Magdir/rtf Magdir/sc Magdir/sccs Magdir/sendmail Magdir/sequent Magdir/sgi Magdir/sgml Magdir/sharc Magdir/sinclair Magdir/sketch Magdir/smalltalk Magdir/sniffer Magdir/dyadic Magdir/scientific Magdir/softquad Magdir/spectrum Magdir/sql Magdir/sun Magdir/sysex Magdir/teapot Magdir/terminfo Magdir/tex Magdir/tgif Magdir/ti-8x Magdir/timezone Magdir/troff Magdir/tuxedo Magdir/typeset Magdir/unknown Magdir/unicode Magdir/uuencode Magdir/varied.out Magdir/varied.script Magdir/vax Magdir/vicar Magdir/virtutech Magdir/visx Magdir/vms Magdir/vmware Magdir/vorbis Magdir/vxl Magdir/wordprocessors Magdir/xdelta Magdir/xenix Magdir/xo65 Magdir/xwindows Magdir/zilog Magdir/zyxel; do \
1589:info:build       if test -f ./$frag; then \
1590:info:build         f=./$frag; \
1591:info:build       else \
1592:info:build         f=$frag; \
1593:info:build       fi; \
1594:info:build           cat $f; \
1595:info:build     done >> magic
1596:info:build ../src/file -C -m magic
1597:info:build magic, 1651: Warning escaped tab found, use \t instead
1598:info:build magic, 2742: Warning escaped tab found, use \t instead
1599:info:build magic, 2743: Warning escaped tab found, use \t instead
1600:info:build magic, 8444: Warning incomplete escape
1601:info:build magic, 9944: Warning escaped tab found, use \t instead
1602:info:build ../src/file -C -m ./magic.mime
1603:info:build gnumake[4]: Leaving directory `/opt/local/var/macports/build/_opt_local_var_macports_sources_rsync.macports.org_release_ports_sysutils_rpm/rpm/work/rpm-4.4.9/file/magic'
1604:info:build Making all in doc
1605:info:build gnumake[4]: Entering directory `/opt/local/var/macports/build/_opt_local_var_macports_sources_rsync.macports.org_release_ports_sysutils_rpm/rpm/work/rpm-4.4.9/file/doc'
1606:info:build gnumake[4]: Nothing to be done for `all'.
1607:info:build gnumake[4]: Leaving directory `/opt/local/var/macports/build/_opt_local_var_macports_sources_rsync.macports.org_release_ports_sysutils_rpm/rpm/work/rpm-4.4.9/file/doc'
1608:info:build Making all in python
1609:info:build gnumake[4]: Entering directory `/opt/local/var/macports/build/_opt_local_var_macports_sources_rsync.macports.org_release_ports_sysutils_rpm/rpm/work/rpm-4.4.9/file/python'
1610:info:build gnumake[4]: Nothing to be done for `all'.
1611:info:build gnumake[4]: Leaving directory `/opt/local/var/macports/build/_opt_local_var_macports_sources_rsync.macports.org_release_ports_sysutils_rpm/rpm/work/rpm-4.4.9/file/python'
1612:info:build gnumake[4]: Entering directory `/opt/local/var/macports/build/_opt_local_var_macports_sources_rsync.macports.org_release_ports_sysutils_rpm/rpm/work/rpm-4.4.9/file'
1613:info:build gnumake[4]: Nothing to be done for `all-am'.
1614:info:build gnumake[4]: Leaving directory `/opt/local/var/macports/build/_opt_local_var_macports_sources_rsync.macports.org_release_ports_sysutils_rpm/rpm/work/rpm-4.4.9/file'
1615:info:build gnumake[3]: Leaving directory `/opt/local/var/macports/build/_opt_local_var_macports_sources_rsync.macports.org_release_ports_sysutils_rpm/rpm/work/rpm-4.4.9/file'
1616:info:build gnumake[2]: Leaving directory `/opt/local/var/macports/build/_opt_local_var_macports_sources_rsync.macports.org_release_ports_sysutils_rpm/rpm/work/rpm-4.4.9/file'
1617:info:build Making all in db3
1618:info:build gnumake[2]: Entering directory `/opt/local/var/macports/build/_opt_local_var_macports_sources_rsync.macports.org_release_ports_sysutils_rpm/rpm/work/rpm-4.4.9/db3'
1619:info:build /bin/sh ./libtool --mode=compile /Developer/usr/bin/llvm-gcc-4.2 -c -I. -I./../db/dist/.. -I/opt/local/include -O2 -arch x86_64 -fPIC -DPIC -D_GNU_SOURCE -D_REENTRANT -Wall -Wpointer-arith -Wstrict-prototypes -Wmissing-prototypes -Wno-char-subscripts  ../db/dist/../mutex/mut_pthread.c
1620:info:build mkdir .libs
1621:info:build  /Developer/usr/bin/llvm-gcc-4.2 -c -I. -I./../db/dist/.. -I/opt/local/include -O2 -arch x86_64 -fPIC -DPIC -D_GNU_SOURCE -D_REENTRANT -Wall -Wpointer-arith -Wstrict-prototypes -Wmissing-prototypes -Wno-char-subscripts ../db/dist/../mutex/mut_pthread.c  -fno-common -DPIC -o .libs/mut_pthread.o
1622:info:build ../db/dist/../mutex/mut_pthread.c: In function '__db_pthread_mutex_init_rpmdb':
1623:info:build ../db/dist/../mutex/mut_pthread.c:77: warning: implicit declaration of function 'pthread_mutexattr_setrobust_np'
1624:info:build ../db/dist/../mutex/mut_pthread.c:77: error: 'PTHREAD_MUTEX_ROBUST_NP' undeclared (first use in this function)
1625:info:build ../db/dist/../mutex/mut_pthread.c:77: error: (Each undeclared identifier is reported only once
1626:info:build ../db/dist/../mutex/mut_pthread.c:77: error: for each function it appears in.)
1627:info:build ../db/dist/../mutex/mut_pthread.c: In function '__db_pthread_mutex_lock_rpmdb':
1628:info:build ../db/dist/../mutex/mut_pthread.c:207: warning: implicit declaration of function 'pthread_mutex_consistent_np'
1629:info:build gnumake[2]: *** [mut_pthread.lo] Error 1
1630:info:build gnumake[2]: Leaving directory `/opt/local/var/macports/build/_opt_local_var_macports_sources_rsync.macports.org_release_ports_sysutils_rpm/rpm/work/rpm-4.4.9/db3'
1631:info:build gnumake[1]: *** [all-recursive] Error 1
1632:info:build gnumake[1]: Leaving directory `/opt/local/var/macports/build/_opt_local_var_macports_sources_rsync.macports.org_release_ports_sysutils_rpm/rpm/work/rpm-4.4.9'
1633:info:build gnumake: *** [all] Error 2
1634:info:build gnumake: Leaving directory `/opt/local/var/macports/build/_opt_local_var_macports_sources_rsync.macports.org_release_ports_sysutils_rpm/rpm/work/rpm-4.4.9'
1635:info:build shell command " cd "/opt/local/var/macports/build/_opt_local_var_macports_sources_rsync.macports.org_release_ports_sysutils_rpm/rpm/work/rpm-4.4.9" && /usr/bin/gnumake -w all " returned error 2
1636:error:build Target org.macports.build returned: shell command failed (see log for details)
1637:debug:build Backtrace: shell command failed (see log for details)
1638    while executing
1639"command_exec build"
1640    (procedure "portbuild::build_main" line 8)
1641    invoked from within
1642"$procedure $targetname"
1643:info:build Warning: the following items did not execute (for rpm): org.macports.activate org.macports.build org.macports.destroot org.macports.install
1644:notice:build Log for rpm is at: /opt/local/var/macports/logs/_opt_local_var_macports_sources_rsync.macports.org_release_ports_sysutils_rpm/rpm/main.log