Ticket #30428: main.3.log

File main.3.log, 94.0 KB (added by tristan.klocke@…, 7 years ago)

build error on lion (10.7)

Line 
1version:1
2:debug:main epoch: in tree: 0 installed: 0
3:debug:main pkgconfig 0.26_0 exists in the ports tree
4:debug:main pkgconfig 0.26_0  is the latest installed
5:debug:main pkgconfig 0.26_0 +universal is active
6:debug:main Merging existing variants '+universal' into variants
7:debug:main new fully merged portvariants: universal +
8:debug:main Changing to port directory: /opt/local/var/macports/sources/rsync.macports.org/release/tarballs/ports/devel/pkgconfig
9:debug:main OS darwin/11.0.0 (Mac OS X 10.7) arch i386
10:debug:main org.macports.load registered provides 'load', a pre-existing procedure. Target override will not be provided
11:debug:main org.macports.unload registered provides 'unload', a pre-existing procedure. Target override will not be provided
12:debug:main org.macports.distfiles registered provides 'distfiles', a pre-existing procedure. Target override will not be provided
13:debug:main adding the default universal variant
14:debug:main Reading variant descriptions from /opt/local/var/macports/sources/rsync.macports.org/release/tarballs/ports/_resources/port1.0/variant_descriptions.conf
15:debug:main Executing variant universal provides universal
16:debug:main No need to upgrade! pkgconfig 0.26_0 >= pkgconfig 0.26_0
17:debug:main epoch: in tree: 0 installed: 0
18:debug:main glib2 2.28.8_0 exists in the ports tree
19:debug:main glib2 2.28.8_0  is the latest installed
20:debug:main glib2 2.28.8_0 +universal is active
21:debug:main Merging existing variants '+universal' into variants
22:debug:main new fully merged portvariants: universal +
23:debug:main Changing to port directory: /opt/local/var/macports/sources/rsync.macports.org/release/tarballs/ports/devel/glib2
24:debug:main OS darwin/11.0.0 (Mac OS X 10.7) arch i386
25:debug:main org.macports.load registered provides 'load', a pre-existing procedure. Target override will not be provided
26:debug:main org.macports.unload registered provides 'unload', a pre-existing procedure. Target override will not be provided
27:debug:main org.macports.distfiles registered provides 'distfiles', a pre-existing procedure. Target override will not be provided
28:debug:main Using group file /opt/local/var/macports/sources/rsync.macports.org/release/tarballs/ports/_resources/port1.0/group/archcheck-1.0.tcl
29:debug:main adding the default universal variant
30:debug:main Reading variant descriptions from /opt/local/var/macports/sources/rsync.macports.org/release/tarballs/ports/_resources/port1.0/variant_descriptions.conf
31:debug:main Executing variant universal provides universal
32:debug:main No need to upgrade! glib2 2.28.8_0 >= glib2 2.28.8_0
33:debug:main epoch: in tree: 0 installed: 0
34:debug:main gettext 0.18.1.1_2 exists in the ports tree
35:debug:main gettext 0.18.1.1_2  is the latest installed
36:debug:main gettext 0.18.1.1_2 +universal is active
37:debug:main Merging existing variants '+universal' into variants
38:debug:main new fully merged portvariants: universal +
39:debug:main Changing to port directory: /opt/local/var/macports/sources/rsync.macports.org/release/tarballs/ports/devel/gettext
40:debug:main OS darwin/11.0.0 (Mac OS X 10.7) arch i386
41:debug:main org.macports.load registered provides 'load', a pre-existing procedure. Target override will not be provided
42:debug:main org.macports.unload registered provides 'unload', a pre-existing procedure. Target override will not be provided
43:debug:main org.macports.distfiles registered provides 'distfiles', a pre-existing procedure. Target override will not be provided
44:debug:main Using group file /opt/local/var/macports/sources/rsync.macports.org/release/tarballs/ports/_resources/port1.0/group/muniversal-1.0.tcl
45:debug:main Reading variant descriptions from /opt/local/var/macports/sources/rsync.macports.org/release/tarballs/ports/_resources/port1.0/variant_descriptions.conf
46:debug:main Using group file /opt/local/var/macports/sources/rsync.macports.org/release/tarballs/ports/_resources/port1.0/group/archcheck-1.0.tcl
47:debug:main universal variant already exists, so not adding the default one
48:debug:main Executing variant universal provides universal
49:debug:main No need to upgrade! gettext 0.18.1.1_2 >= gettext 0.18.1.1_2
50:debug:main epoch: in tree: 0 installed: 0
51:debug:main libiconv 1.13.1_0 exists in the ports tree
52:debug:main libiconv 1.13.1_0  is the latest installed
53:debug:main libiconv 1.13.1_0 +universal is active
54:debug:main Merging existing variants '+universal' into variants
55:debug:main new fully merged portvariants: universal +
56:debug:main Changing to port directory: /opt/local/var/macports/sources/rsync.macports.org/release/tarballs/ports/textproc/libiconv
57:debug:main OS darwin/11.0.0 (Mac OS X 10.7) arch i386
58:debug:main org.macports.load registered provides 'load', a pre-existing procedure. Target override will not be provided
59:debug:main org.macports.unload registered provides 'unload', a pre-existing procedure. Target override will not be provided
60:debug:main org.macports.distfiles registered provides 'distfiles', a pre-existing procedure. Target override will not be provided
61:debug:main Using group file /opt/local/var/macports/sources/rsync.macports.org/release/tarballs/ports/_resources/port1.0/group/muniversal-1.0.tcl
62:debug:main Reading variant descriptions from /opt/local/var/macports/sources/rsync.macports.org/release/tarballs/ports/_resources/port1.0/variant_descriptions.conf
63:debug:main universal variant already exists, so not adding the default one
64:debug:main Executing variant universal provides universal
65:debug:main No need to upgrade! libiconv 1.13.1_0 >= libiconv 1.13.1_0
66:debug:main epoch: in tree: 0 installed: 0
67:debug:main ncurses 5.9_0 exists in the ports tree
68:debug:main ncurses 5.9_0  is the latest installed
69:debug:main ncurses 5.9_0 +universal is active
70:debug:main Merging existing variants '+universal' into variants
71:debug:main new fully merged portvariants: universal +
72:debug:main Changing to port directory: /opt/local/var/macports/sources/rsync.macports.org/release/tarballs/ports/devel/ncurses
73:debug:main OS darwin/11.0.0 (Mac OS X 10.7) arch i386
74:debug:main org.macports.load registered provides 'load', a pre-existing procedure. Target override will not be provided
75:debug:main org.macports.unload registered provides 'unload', a pre-existing procedure. Target override will not be provided
76:debug:main org.macports.distfiles registered provides 'distfiles', a pre-existing procedure. Target override will not be provided
77:debug:main adding the default universal variant
78:debug:main Reading variant descriptions from /opt/local/var/macports/sources/rsync.macports.org/release/tarballs/ports/_resources/port1.0/variant_descriptions.conf
79:debug:main Executing variant universal provides universal
80:debug:main No need to upgrade! ncurses 5.9_0 >= ncurses 5.9_0
81:debug:main epoch: in tree: 0 installed: 0
82:debug:main expat 2.0.1_1 exists in the ports tree
83:debug:main expat 2.0.1_1  is the latest installed
84:debug:main expat 2.0.1_1 +universal is active
85:debug:main Merging existing variants '+universal' into variants
86:debug:main new fully merged portvariants: universal +
87:debug:main Changing to port directory: /opt/local/var/macports/sources/rsync.macports.org/release/tarballs/ports/textproc/expat
88:debug:main OS darwin/11.0.0 (Mac OS X 10.7) arch i386
89:debug:main org.macports.load registered provides 'load', a pre-existing procedure. Target override will not be provided
90:debug:main org.macports.unload registered provides 'unload', a pre-existing procedure. Target override will not be provided
91:debug:main org.macports.distfiles registered provides 'distfiles', a pre-existing procedure. Target override will not be provided
92:debug:main adding the default universal variant
93:debug:main Reading variant descriptions from /opt/local/var/macports/sources/rsync.macports.org/release/tarballs/ports/_resources/port1.0/variant_descriptions.conf
94:debug:main Executing variant universal provides universal
95:debug:main No need to upgrade! expat 2.0.1_1 >= expat 2.0.1_1
96:debug:main epoch: in tree: 0 installed: 0
97:debug:main zlib 1.2.5_0 exists in the ports tree
98:debug:main zlib 1.2.5_0  is the latest installed
99:debug:main zlib 1.2.5_0 +universal is active
100:debug:main Merging existing variants '+universal' into variants
101:debug:main new fully merged portvariants: universal +
102:debug:main Changing to port directory: /opt/local/var/macports/sources/rsync.macports.org/release/tarballs/ports/archivers/zlib
103:debug:main OS darwin/11.0.0 (Mac OS X 10.7) arch i386
104:debug:main org.macports.load registered provides 'load', a pre-existing procedure. Target override will not be provided
105:debug:main org.macports.unload registered provides 'unload', a pre-existing procedure. Target override will not be provided
106:debug:main org.macports.distfiles registered provides 'distfiles', a pre-existing procedure. Target override will not be provided
107:debug:main Using group file /opt/local/var/macports/sources/rsync.macports.org/release/tarballs/ports/_resources/port1.0/group/xcodeversion-1.0.tcl
108:debug:main adding the default universal variant
109:debug:main Reading variant descriptions from /opt/local/var/macports/sources/rsync.macports.org/release/tarballs/ports/_resources/port1.0/variant_descriptions.conf
110:debug:main Executing variant universal provides universal
111:debug:main No need to upgrade! zlib 1.2.5_0 >= zlib 1.2.5_0
112:debug:main epoch: in tree: 0 installed: 0
113:debug:main perl5 5.12.3_1 exists in the ports tree
114:debug:main perl5 5.12.3_1 +perl5_12 is the latest installed
115:debug:main perl5 5.12.3_1 +perl5_12 is active
116:debug:main Merging existing variants '+perl5_12' into variants
117:debug:main new fully merged portvariants: perl5_12 +
118:debug:main Changing to port directory: /opt/local/var/macports/sources/rsync.macports.org/release/tarballs/ports/lang/perl5
119:debug:main OS darwin/11.0.0 (Mac OS X 10.7) arch i386
120:debug:main org.macports.load registered provides 'load', a pre-existing procedure. Target override will not be provided
121:debug:main org.macports.unload registered provides 'unload', a pre-existing procedure. Target override will not be provided
122:debug:main org.macports.distfiles registered provides 'distfiles', a pre-existing procedure. Target override will not be provided
123:debug:main universal_variant is false, so not adding the default universal variant
124:debug:main Executing variant perl5_12 provides perl5_12
125:debug:main No need to upgrade! perl5 5.12.3_1 >= perl5 5.12.3_1
126:debug:main epoch: in tree: 0 installed: 0
127:debug:main perl5.12 5.12.3_1 exists in the ports tree
128:debug:main perl5.12 5.12.3_1  is the latest installed
129:debug:main perl5.12 5.12.3_1 +universal is active
130:debug:main Merging existing variants '+universal' into variants
131:debug:main new fully merged portvariants: universal +
132:debug:main Changing to port directory: /opt/local/var/macports/sources/rsync.macports.org/release/tarballs/ports/lang/perl5.12
133:debug:main OS darwin/11.0.0 (Mac OS X 10.7) arch i386
134:debug:main org.macports.load registered provides 'load', a pre-existing procedure. Target override will not be provided
135:debug:main org.macports.unload registered provides 'unload', a pre-existing procedure. Target override will not be provided
136:debug:main org.macports.distfiles registered provides 'distfiles', a pre-existing procedure. Target override will not be provided
137:debug:main adding the default universal variant
138:debug:main Reading variant descriptions from /opt/local/var/macports/sources/rsync.macports.org/release/tarballs/ports/_resources/port1.0/variant_descriptions.conf
139:debug:main Executing variant universal provides universal
140:debug:main No need to upgrade! perl5.12 5.12.3_1 >= perl5.12 5.12.3_1
141:debug:main Found Dependency: path: /opt/local/lib/pkgconfig filename: fuse.pc regex: ^fuse.pc$
142:debug:main epoch: in tree: 0 installed: 0
143:debug:main fuse4x 0.8.8_1 exists in the ports tree
144:debug:main fuse4x 0.8.8_1  is the latest installed
145:debug:main fuse4x 0.8.8_1  is active
146:debug:main Merging existing variants '' into variants
147:debug:main new fully merged portvariants:
148:debug:main Changing to port directory: /opt/local/var/macports/sources/rsync.macports.org/release/tarballs/ports/fuse/fuse4x
149:debug:main OS darwin/11.0.0 (Mac OS X 10.7) arch i386
150:debug:main org.macports.load registered provides 'load', a pre-existing procedure. Target override will not be provided
151:debug:main org.macports.unload registered provides 'unload', a pre-existing procedure. Target override will not be provided
152:debug:main org.macports.distfiles registered provides 'distfiles', a pre-existing procedure. Target override will not be provided
153:debug:main adding the default universal variant
154:debug:main Reading variant descriptions from /opt/local/var/macports/sources/rsync.macports.org/release/tarballs/ports/_resources/port1.0/variant_descriptions.conf
155:debug:main No need to upgrade! fuse4x 0.8.8_1 >= fuse4x 0.8.8_1
156:debug:main epoch: in tree: 0 installed: 0
157:debug:main fuse4x-kext 0.8.8_0 exists in the ports tree
158:debug:main fuse4x-kext 0.8.8_0 +universal is the latest installed
159:debug:main fuse4x-kext 0.8.8_0 +universal is active
160:debug:main Merging existing variants '+universal' into variants
161:debug:main new fully merged portvariants: universal +
162:debug:main Changing to port directory: /opt/local/var/macports/sources/rsync.macports.org/release/tarballs/ports/fuse/fuse4x-kext
163:debug:main OS darwin/11.0.0 (Mac OS X 10.7) arch i386
164:debug:main org.macports.load registered provides 'load', a pre-existing procedure. Target override will not be provided
165:debug:main org.macports.unload registered provides 'unload', a pre-existing procedure. Target override will not be provided
166:debug:main org.macports.distfiles registered provides 'distfiles', a pre-existing procedure. Target override will not be provided
167:debug:main Using group file /opt/local/var/macports/sources/rsync.macports.org/release/tarballs/ports/_resources/port1.0/group/xcode-1.0.tcl
168:debug:main Re-registering default for use_configure
169:debug:main Re-registering default for universal_variant
170:debug:main Re-registering default for build.pre_args
171:debug:main Re-registering default for build.target
172:debug:main Re-registering default for destroot.pre_args
173:debug:main Re-registering default for destroot.target
174:debug:main Re-registering default for destroot.destdir
175:debug:main adding the default universal variant
176:debug:main Reading variant descriptions from /opt/local/var/macports/sources/rsync.macports.org/release/tarballs/ports/_resources/port1.0/variant_descriptions.conf
177:debug:main Executing variant universal provides universal
178:debug:main No need to upgrade! fuse4x-kext 0.8.8_0 >= fuse4x-kext 0.8.8_0
179:msg:main --->  Computing dependencies for ntfs-3g:info:main .:debug:main Searching for dependency: pkgconfig
180:debug:main Found Dependency: receipt exists for pkgconfig
181:debug:main Searching for dependency: macfuse
182:debug:main Didn't find receipt, going to depspec regex for: macfuse
183:debug:main Found Dependency: path: /opt/local/lib/pkgconfig filename: fuse.pc regex: ^fuse.pc$
184:debug:main Found Dependency: path: /opt/local/lib/pkgconfig filename: fuse.pc regex: ^fuse.pc$
185:msg:main
186:debug:main Executing org.macports.main (ntfs-3g)
187:debug:main changing euid/egid - current euid: 0 - current egid: 0
188:debug:main egid changed to: 501
189:debug:main euid changed to: 502
190:debug:archivefetch archivefetch phase started at Sun Jul 31 12:08:43 CEST 2011
191:msg:archivefetch --->  Fetching archive for ntfs-3g
192:debug:archivefetch Executing org.macports.archivefetch (ntfs-3g)
193:debug:archivefetch Can't run archivefetch on this port without elevated privileges. Escalating privileges back to root.
194:debug:archivefetch euid changed to: 0. egid changed to: 0.
195:debug:archivefetch changing euid/egid - current euid: 0 - current egid: 0
196:debug:archivefetch egid changed to: 501
197:debug:archivefetch euid changed to: 502
198:info:archivefetch --->  ntfs-3g-2011.4.12_2.darwin_11.x86_64.tbz2 doesn't seem to exist in /opt/local/var/macports/software/ntfs-3g
199:debug:archivefetch Privilege de-escalation not attempted as not running as root.
200:debug:fetch fetch phase started at Sun Jul 31 12:08:43 CEST 2011
201:notice:fetch --->  Fetching ntfs-3g
202:debug:fetch Can't run fetch on this port without elevated privileges. Escalating privileges back to root.
203:debug:fetch euid changed to: 0. egid changed to: 0.
204:debug:fetch changing euid/egid - current euid: 0 - current egid: 0
205:debug:fetch egid changed to: 501
206:debug:fetch euid changed to: 502
207:debug:fetch Executing org.macports.fetch (ntfs-3g)
208:info:fetch --->  ntfs-3g_ntfsprogs-2011.4.12.tgz doesn't seem to exist in /opt/local/var/macports/distfiles/ntfs-3g
209:debug:fetch Pinging tuxera.com...
210:debug:fetch Pinging distfiles.macports.org...
211:debug:fetch Pinging aarnet.au.distfiles.macports.org...
212:debug:fetch Pinging her.gr.distfiles.macports.org...
213:debug:fetch Pinging lil.fr.distfiles.macports.org...
214:debug:fetch Pinging sea.us.distfiles.macports.org...
215:debug:fetch Pinging ykf.ca.distfiles.macports.org...
216:debug:fetch tuxera.com ping time is 117.726
217:debug:fetch distfiles.macports.org ping time is 317.685
218:debug:fetch aarnet.au.distfiles.macports.org ping time is 423.675
219:debug:fetch her.gr.distfiles.macports.org ping time is 199.633
220:debug:fetch lil.fr.distfiles.macports.org ping time is 180.982
221:debug:fetch sea.us.distfiles.macports.org ping time is 10000
222:debug:fetch ykf.ca.distfiles.macports.org ping time is 297.038
223:notice:fetch --->  Attempting to fetch ntfs-3g_ntfsprogs-2011.4.12.tgz from http://tuxera.com/opensource/
224:debug:fetch Privilege de-escalation not attempted as not running as root.
225:debug:checksum checksum phase started at Sun Jul 31 12:08:51 CEST 2011
226:notice:checksum --->  Verifying checksum(s) for ntfs-3g
227:debug:checksum Executing org.macports.checksum (ntfs-3g)
228:info:checksum --->  Checksumming ntfs-3g_ntfsprogs-2011.4.12.tgz
229:debug:checksum Correct (md5) checksum for ntfs-3g_ntfsprogs-2011.4.12.tgz
230:debug:checksum Correct (sha1) checksum for ntfs-3g_ntfsprogs-2011.4.12.tgz
231:debug:checksum Correct (rmd160) checksum for ntfs-3g_ntfsprogs-2011.4.12.tgz
232:debug:checksum Privilege de-escalation not attempted as not running as root.
233:debug:extract extract phase started at Sun Jul 31 12:08:51 CEST 2011
234:notice:extract --->  Extracting ntfs-3g
235:debug:extract Executing org.macports.extract (ntfs-3g)
236:info:extract --->  Extracting ntfs-3g_ntfsprogs-2011.4.12.tgz
237:debug:extract setting option extract.args to '/opt/local/var/macports/distfiles/ntfs-3g/ntfs-3g_ntfsprogs-2011.4.12.tgz'
238:debug:extract Environment: CPATH='/opt/local/include' CC_PRINT_OPTIONS_FILE='/opt/local/var/macports/build/_opt_local_var_macports_sources_rsync.macports.org_release_tarballs_ports_fuse_ntfs-3g/ntfs-3g/work/.CC_PRINT_OPTIONS' LIBRARY_PATH='/opt/local/lib' CC_PRINT_OPTIONS='YES' MACOSX_DEPLOYMENT_TARGET='10.7'
239:debug:extract Assembled command: 'cd "/opt/local/var/macports/build/_opt_local_var_macports_sources_rsync.macports.org_release_tarballs_ports_fuse_ntfs-3g/ntfs-3g/work" && /usr/bin/gzip -dc '/opt/local/var/macports/distfiles/ntfs-3g/ntfs-3g_ntfsprogs-2011.4.12.tgz' | /usr/bin/gnutar --no-same-owner -xf -'
240:debug:extract Executing command line:  cd "/opt/local/var/macports/build/_opt_local_var_macports_sources_rsync.macports.org_release_tarballs_ports_fuse_ntfs-3g/ntfs-3g/work" && /usr/bin/gzip -dc '/opt/local/var/macports/distfiles/ntfs-3g/ntfs-3g_ntfsprogs-2011.4.12.tgz' | /usr/bin/gnutar --no-same-owner -xf -
241:debug:extract euid/egid changed to: 0/0
242:debug:extract chowned /opt/local/var/macports/build/_opt_local_var_macports_sources_rsync.macports.org_release_tarballs_ports_fuse_ntfs-3g/ntfs-3g/work to macports
243:debug:extract euid/egid changed to: 502/501
244:debug:extract Privilege de-escalation not attempted as not running as root.
245:debug:patch patch phase started at Sun Jul 31 12:08:51 CEST 2011
246:debug:patch Executing org.macports.patch (ntfs-3g)
247:debug:patch Privilege de-escalation not attempted as not running as root.
248:debug:configure configure phase started at Sun Jul 31 12:08:51 CEST 2011
249:notice:configure --->  Configuring ntfs-3g
250:debug:configure Using compiler 'Mac OS X llvm-gcc 4.2'
251:debug:configure Executing org.macports.configure (ntfs-3g)
252:debug:configure Environment: CPATH='/opt/local/include' CFLAGS='-pipe -O2 -arch x86_64' CPPFLAGS='-I/opt/local/include' CXXFLAGS='-pipe -O2 -arch x86_64' LIBRARY_PATH='/opt/local/lib' MACOSX_DEPLOYMENT_TARGET='10.7' CXX='/Developer/usr/bin/llvm-g++-4.2' CC_PRINT_OPTIONS_FILE='/opt/local/var/macports/build/_opt_local_var_macports_sources_rsync.macports.org_release_tarballs_ports_fuse_ntfs-3g/ntfs-3g/work/.CC_PRINT_OPTIONS' F90FLAGS='-pipe -O2 -m64' LDFLAGS='-L/opt/local/lib -framework CoreFoundation -lintl -arch x86_64' OBJC='/Developer/usr/bin/llvm-gcc-4.2' FCFLAGS='-pipe -O2 -m64' INSTALL='/usr/bin/install -c' OBJCFLAGS='-pipe -O2 -arch x86_64' FFLAGS='-pipe -O2 -m64' CC_PRINT_OPTIONS='YES' CC='/Developer/usr/bin/llvm-gcc-4.2'
253:debug:configure Assembled command: 'cd "/opt/local/var/macports/build/_opt_local_var_macports_sources_rsync.macports.org_release_tarballs_ports_fuse_ntfs-3g/ntfs-3g/work/ntfs-3g_ntfsprogs-2011.4.12" && ./configure --prefix=/opt/local --exec-prefix=/opt/local --with-fuse=external'
254:debug:configure Executing command line:  cd "/opt/local/var/macports/build/_opt_local_var_macports_sources_rsync.macports.org_release_tarballs_ports_fuse_ntfs-3g/ntfs-3g/work/ntfs-3g_ntfsprogs-2011.4.12" && ./configure --prefix=/opt/local --exec-prefix=/opt/local --with-fuse=external
255:info:configure checking build system type... i386-apple-darwin11.0.0
256:info:configure checking host system type... i386-apple-darwin11.0.0
257:info:configure checking target system type... i386-apple-darwin11.0.0
258:info:configure checking for a BSD-compatible install... /usr/bin/install -c
259:info:configure checking whether build environment is sane... yes
260:info:configure checking for a thread-safe mkdir -p... ./install-sh -c -d
261:info:configure checking for gawk... no
262:info:configure checking for mawk... no
263:info:configure checking for nawk... no
264:info:configure checking for awk... awk
265:info:configure checking whether make sets $(MAKE)... yes
266:info:configure checking whether to enable maintainer-specific portions of Makefiles... no
267:info:configure checking for C compiler default output file name... a.out
268:info:configure checking whether the C compiler works... yes
269:info:configure checking whether we are cross compiling... no
270:info:configure checking for suffix of executables...
271:info:configure checking for suffix of object files... o
272:info:configure checking whether we are using the GNU C compiler... yes
273:info:configure checking whether /Developer/usr/bin/llvm-gcc-4.2 accepts -g... yes
274:info:configure checking for /Developer/usr/bin/llvm-gcc-4.2 option to accept ISO C89... none needed
275:info:configure checking for style of include used by make... GNU
276:info:configure checking dependency style of /Developer/usr/bin/llvm-gcc-4.2... gcc3
277:info:configure checking whether ln -s works... yes
278:info:configure checking whether /Developer/usr/bin/llvm-gcc-4.2 and cc understand -c and -o together... yes
279:info:configure checking for a sed that does not truncate output... /opt/local/bin/gsed
280:info:configure checking for grep that handles long lines and -e... /usr/bin/grep
281:info:configure checking for egrep... /usr/bin/grep -E
282:info:configure checking for ld used by /Developer/usr/bin/llvm-gcc-4.2... /Developer/usr/llvm-gcc-4.2/libexec/gcc/i686-apple-darwin11/4.2.1/ld
283:info:configure checking if the linker (/Developer/usr/llvm-gcc-4.2/libexec/gcc/i686-apple-darwin11/4.2.1/ld) is GNU ld... no
284:info:configure checking for /Developer/usr/llvm-gcc-4.2/libexec/gcc/i686-apple-darwin11/4.2.1/ld option to reload object files... -r
285:info:configure checking for BSD-compatible nm... /usr/bin/nm
286:info:configure checking how to recognize dependent libraries... pass_all
287:info:configure checking how to run the C preprocessor... /Developer/usr/bin/llvm-gcc-4.2 -E
288:info:configure checking for ANSI C header files... yes
289:info:configure checking for sys/types.h... yes
290:info:configure checking for sys/stat.h... yes
291:info:configure checking for stdlib.h... yes
292:info:configure checking for string.h... yes
293:info:configure checking for memory.h... yes
294:info:configure checking for strings.h... yes
295:info:configure checking for inttypes.h... yes
296:info:configure checking for stdint.h... yes
297:info:configure checking for unistd.h... yes
298:info:configure checking dlfcn.h usability... yes
299:info:configure checking dlfcn.h presence... yes
300:info:configure checking for dlfcn.h... yes
301:info:configure checking whether we are using the GNU C++ compiler... yes
302:info:configure checking whether /Developer/usr/bin/llvm-g++-4.2 accepts -g... yes
303:info:configure checking dependency style of /Developer/usr/bin/llvm-g++-4.2... gcc3
304:info:configure checking how to run the C++ preprocessor... /Developer/usr/bin/llvm-g++-4.2 -E
305:info:configure checking for g77... no
306:info:configure checking for xlf... no
307:info:configure checking for f77... no
308:info:configure checking for frt... no
309:info:configure checking for pgf77... no
310:info:configure checking for cf77... no
311:info:configure checking for fort77... no
312:info:configure checking for fl32... no
313:info:configure checking for af77... no
314:info:configure checking for xlf90... no
315:info:configure checking for f90... no
316:info:configure checking for pgf90... no
317:info:configure checking for pghpf... no
318:info:configure checking for epcf90... no
319:info:configure checking for gfortran... no
320:info:configure checking for g95... no
321:info:configure checking for xlf95... no
322:info:configure checking for f95... no
323:info:configure checking for fort... no
324:info:configure checking for ifort... no
325:info:configure checking for ifc... no
326:info:configure checking for efc... no
327:info:configure checking for pgf95... no
328:info:configure checking for lf95... no
329:info:configure checking for ftn... no
330:info:configure checking whether we are using the GNU Fortran 77 compiler... no
331:info:configure checking whether  accepts -g... no
332:info:configure checking the maximum length of command line arguments... 196608
333:info:configure checking command to parse /usr/bin/nm output from /Developer/usr/bin/llvm-gcc-4.2 object... ok
334:info:configure checking for objdir... .libs
335:info:configure checking for ar... ar
336:info:configure checking for ranlib... ranlib
337:info:configure checking for strip... strip
338:info:configure checking for dsymutil... dsymutil
339:info:configure checking for nmedit... nmedit
340:info:configure checking for -single_module linker flag... yes
341:info:configure checking for -exported_symbols_list linker flag... yes
342:info:configure checking if /Developer/usr/bin/llvm-gcc-4.2 supports -fno-rtti -fno-exceptions... no
343:info:configure checking for /Developer/usr/bin/llvm-gcc-4.2 option to produce PIC... -fno-common
344:info:configure checking if /Developer/usr/bin/llvm-gcc-4.2 PIC flag -fno-common works... yes
345:info:configure checking if /Developer/usr/bin/llvm-gcc-4.2 static flag -static works... no
346:info:configure checking if /Developer/usr/bin/llvm-gcc-4.2 supports -c -o file.o... yes
347:info:configure checking whether the /Developer/usr/bin/llvm-gcc-4.2 linker (/Developer/usr/llvm-gcc-4.2/libexec/gcc/i686-apple-darwin11/4.2.1/ld) supports shared libraries... yes
348:info:configure checking dynamic linker characteristics... darwin11.0.0 dyld
349:info:configure checking how to hardcode library paths into programs... immediate
350:info:configure checking whether stripping libraries is possible... yes
351:info:configure checking if libtool supports shared libraries... yes
352:info:configure checking whether to build shared libraries... yes
353:info:configure checking whether to build static libraries... yes
354:info:configure configure: creating libtool
355:info:configure appending configuration tag "CXX" to libtool
356:info:configure checking for ld used by /Developer/usr/bin/llvm-g++-4.2... /Developer/usr/llvm-gcc-4.2/libexec/gcc/i686-apple-darwin11/4.2.1/ld
357:info:configure checking if the linker (/Developer/usr/llvm-gcc-4.2/libexec/gcc/i686-apple-darwin11/4.2.1/ld) is GNU ld... no
358:info:configure checking whether the /Developer/usr/bin/llvm-g++-4.2 linker (/Developer/usr/llvm-gcc-4.2/libexec/gcc/i686-apple-darwin11/4.2.1/ld) supports shared libraries... yes
359:info:configure checking for /Developer/usr/bin/llvm-g++-4.2 option to produce PIC... -fno-common
360:info:configure checking if /Developer/usr/bin/llvm-g++-4.2 PIC flag -fno-common works... yes
361:info:configure checking if /Developer/usr/bin/llvm-g++-4.2 static flag -static works... no
362:info:configure checking if /Developer/usr/bin/llvm-g++-4.2 supports -c -o file.o... yes
363:info:configure checking whether the /Developer/usr/bin/llvm-g++-4.2 linker (/Developer/usr/llvm-gcc-4.2/libexec/gcc/i686-apple-darwin11/4.2.1/ld) supports shared libraries... yes
364:info:configure checking dynamic linker characteristics... darwin11.0.0 dyld
365:info:configure (cached) (cached) checking how to hardcode library paths into programs... immediate
366:info:configure appending configuration tag "F77" to libtool
367:info:configure checking for a BSD-compatible install... /usr/bin/install -c
368:info:configure checking for pkg-config... /opt/local/bin/pkg-config
369:info:configure checking pkg-config is at least version 0.9.0... yes
370:info:configure checking for mv... /bin/mv
371:info:configure checking for rm... /bin/rm
372:info:configure checking for sed... /opt/local/bin/gsed
373:info:configure checking for ldconfig... true
374:info:configure checking Windows OS... no
375:info:configure checking fuse compatibility... external
376:info:configure checking for FUSE_MODULE... yes
377:info:configure checking uuid/uuid.h usability... yes
378:info:configure checking uuid/uuid.h presence... yes
379:info:configure checking for uuid/uuid.h... yes
380:info:configure checking for uuid_generate in -luuid... yes
381:info:configure checking for ANSI C header files... (cached) yes
382:info:configure checking ctype.h usability... yes
383:info:configure checking ctype.h presence... yes
384:info:configure checking for ctype.h... yes
385:info:configure checking fcntl.h usability... yes
386:info:configure checking fcntl.h presence... yes
387:info:configure checking for fcntl.h... yes
388:info:configure checking libgen.h usability... yes
389:info:configure checking libgen.h presence... yes
390:info:configure checking for libgen.h... yes
391:info:configure checking libintl.h usability... yes
392:info:configure checking libintl.h presence... yes
393:info:configure checking for libintl.h... yes
394:info:configure checking limits.h usability... yes
395:info:configure checking limits.h presence... yes
396:info:configure checking for limits.h... yes
397:info:configure checking locale.h usability... yes
398:info:configure checking locale.h presence... yes
399:info:configure checking for locale.h... yes
400:info:configure checking mntent.h usability... no
401:info:configure checking mntent.h presence... no
402:info:configure checking for mntent.h... no
403:info:configure checking stddef.h usability... yes
404:info:configure checking stddef.h presence... yes
405:info:configure checking for stddef.h... yes
406:info:configure checking for stdint.h... (cached) yes
407:info:configure checking for stdlib.h... (cached) yes
408:info:configure checking stdio.h usability... yes
409:info:configure checking stdio.h presence... yes
410:info:configure checking for stdio.h... yes
411:info:configure checking stdarg.h usability... yes
412:info:configure checking stdarg.h presence... yes
413:info:configure checking for stdarg.h... yes
414:info:configure checking for string.h... (cached) yes
415:info:configure checking for strings.h... (cached) yes
416:info:configure checking errno.h usability... yes
417:info:configure checking errno.h presence... yes
418:info:configure checking for errno.h... yes
419:info:configure checking time.h usability... yes
420:info:configure checking time.h presence... yes
421:info:configure checking for time.h... yes
422:info:configure checking for unistd.h... (cached) yes
423:info:configure checking utime.h usability... yes
424:info:configure checking utime.h presence... yes
425:info:configure checking for utime.h... yes
426:info:configure checking wchar.h usability... yes
427:info:configure checking wchar.h presence... yes
428:info:configure checking for wchar.h... yes
429:info:configure checking getopt.h usability... yes
430:info:configure checking getopt.h presence... yes
431:info:configure checking for getopt.h... yes
432:info:configure checking features.h usability... no
433:info:configure checking features.h presence... no
434:info:configure checking for features.h... no
435:info:configure checking endian.h usability... no
436:info:configure checking endian.h presence... no
437:info:configure checking for endian.h... no
438:info:configure checking byteswap.h usability... no
439:info:configure checking byteswap.h presence... no
440:info:configure checking for byteswap.h... no
441:info:configure checking sys/byteorder.h usability... no
442:info:configure checking sys/byteorder.h presence... no
443:info:configure checking for sys/byteorder.h... no
444:info:configure checking sys/endian.h usability... no
445:info:configure checking sys/endian.h presence... no
446:info:configure checking for sys/endian.h... no
447:info:configure checking sys/param.h usability... yes
448:info:configure checking sys/param.h presence... yes
449:info:configure checking for sys/param.h... yes
450:info:configure checking sys/ioctl.h usability... yes
451:info:configure checking sys/ioctl.h presence... yes
452:info:configure checking for sys/ioctl.h... yes
453:info:configure checking sys/mkdev.h usability... no
454:info:configure checking sys/mkdev.h presence... no
455:info:configure checking for sys/mkdev.h... no
456:info:configure checking sys/mount.h usability... yes
457:info:configure checking sys/mount.h presence... yes
458:info:configure checking for sys/mount.h... yes
459:info:configure checking for sys/stat.h... (cached) yes
460:info:configure checking for sys/types.h... (cached) yes
461:info:configure checking sys/vfs.h usability... no
462:info:configure checking sys/vfs.h presence... no
463:info:configure checking for sys/vfs.h... no
464:info:configure checking sys/statvfs.h usability... yes
465:info:configure checking sys/statvfs.h presence... yes
466:info:configure checking for sys/statvfs.h... yes
467:info:configure checking sys/sysmacros.h usability... no
468:info:configure checking sys/sysmacros.h presence... no
469:info:configure checking for sys/sysmacros.h... no
470:info:configure checking linux/major.h usability... no
471:info:configure checking linux/major.h presence... no
472:info:configure checking for linux/major.h... no
473:info:configure checking linux/fd.h usability... no
474:info:configure checking linux/fd.h presence... no
475:info:configure checking for linux/fd.h... no
476:info:configure checking linux/hdreg.h usability... no
477:info:configure checking linux/hdreg.h presence... no
478:info:configure checking for linux/hdreg.h... no
479:info:configure checking machine/endian.h usability... yes
480:info:configure checking machine/endian.h presence... yes
481:info:configure checking for machine/endian.h... yes
482:info:configure checking windows.h usability... no
483:info:configure checking windows.h presence... no
484:info:configure checking for windows.h... no
485:info:configure checking syslog.h usability... yes
486:info:configure checking syslog.h presence... yes
487:info:configure checking for syslog.h... yes
488:info:configure checking pwd.h usability... yes
489:info:configure checking pwd.h presence... yes
490:info:configure checking for pwd.h... yes
491:info:configure checking for stdbool.h that conforms to C99... no
492:info:configure checking for _Bool... yes
493:info:configure checking whether byte ordering is bigendian... no
494:info:configure checking for an ANSI C-conforming const... yes
495:info:configure checking for inline... inline
496:info:configure checking for off_t... yes
497:info:configure checking for size_t... yes
498:info:configure checking for struct stat.st_blocks... yes
499:info:configure checking for struct stat.st_rdev... yes
500:info:configure checking for struct stat.st_atim... no
501:info:configure checking for struct stat.st_atimespec... yes
502:info:configure checking for struct stat.st_atimensec... no
503:info:configure checking CoreFoundation/CoreFoundation.h usability... yes
504:info:configure checking CoreFoundation/CoreFoundation.h presence... yes
505:info:configure checking for CoreFoundation/CoreFoundation.h... yes
506:info:configure checking for library containing getmntent... no
507:info:configure checking whether mbrtowc and mbstate_t are properly declared... yes
508:info:configure checking for working memcmp... yes
509:info:configure checking whether lstat dereferences a symlink specified with a trailing slash... no
510:info:configure checking whether stat accepts an empty string... no
511:info:configure checking for strftime... yes
512:info:configure checking for utime.h... (cached) yes
513:info:configure checking whether utime accepts a null argument... yes
514:info:configure checking for vprintf... yes
515:info:configure checking for _doprnt... no
516:info:configure checking for atexit... yes
517:info:configure checking for basename... yes
518:info:configure checking for daemon... yes
519:info:configure checking for dup2... yes
520:info:configure checking for fdatasync... yes
521:info:configure checking for ffs... yes
522:info:configure checking for getopt_long... yes
523:info:configure checking for hasmntopt... no
524:info:configure checking for mbsinit... yes
525:info:configure checking for memmove... yes
526:info:configure checking for memset... yes
527:info:configure checking for realpath... yes
528:info:configure checking for regcomp... yes
529:info:configure checking for setlocale... yes
530:info:configure checking for setxattr... yes
531:info:configure checking for strcasecmp... yes
532:info:configure checking for strchr... yes
533:info:configure checking for strdup... yes
534:info:configure checking for strerror... yes
535:info:configure checking for strnlen... yes
536:info:configure checking for strsep... yes
537:info:configure checking for strtol... yes
538:info:configure checking for strtoul... yes
539:info:configure checking for sysconf... yes
540:info:configure checking for utime... yes
541:info:configure checking for utimensat... no
542:info:configure checking for gettimeofday... yes
543:info:configure checking for clock_gettime... no
544:info:configure checking for fork... yes
545:info:configure checking for special C compiler options needed for large files... no
546:info:configure checking for _FILE_OFFSET_BITS value needed for large files... no
547:info:configure configure: creating ./config.status
548:info:configure config.status: creating Makefile
549:info:configure config.status: creating include/Makefile
550:info:configure config.status: creating include/fuse-lite/Makefile
551:info:configure config.status: creating include/ntfs-3g/Makefile
552:info:configure config.status: creating libfuse-lite/Makefile
553:info:configure config.status: creating libntfs-3g/Makefile
554:info:configure config.status: creating libntfs-3g/libntfs-3g.pc
555:info:configure config.status: creating libntfs-3g/libntfs-3g.script.so
556:info:configure config.status: creating ntfsprogs/Makefile
557:info:configure config.status: creating ntfsprogs/mkntfs.8
558:info:configure config.status: creating ntfsprogs/ntfscat.8
559:info:configure config.status: creating ntfsprogs/ntfsclone.8
560:info:configure config.status: creating ntfsprogs/ntfscluster.8
561:info:configure config.status: creating ntfsprogs/ntfscmp.8
562:info:configure config.status: creating ntfsprogs/ntfscp.8
563:info:configure config.status: creating ntfsprogs/ntfsfix.8
564:info:configure config.status: creating ntfsprogs/ntfsinfo.8
565:info:configure config.status: creating ntfsprogs/ntfslabel.8
566:info:configure config.status: creating ntfsprogs/ntfsls.8
567:info:configure config.status: creating ntfsprogs/ntfsprogs.8
568:info:configure config.status: creating ntfsprogs/ntfsresize.8
569:info:configure config.status: creating ntfsprogs/ntfsundelete.8
570:info:configure config.status: creating src/Makefile
571:info:configure config.status: creating src/ntfs-3g.8
572:info:configure config.status: creating src/ntfs-3g.probe.8
573:info:configure config.status: creating src/ntfs-3g.usermap.8
574:info:configure config.status: creating src/ntfs-3g.secaudit.8
575:info:configure config.status: creating config.h
576:info:configure config.status: executing depfiles commands
577:info:configure ****************************************************************************
578:info:configure * WARNING  WARNING  WARNING  WARNING  WARNING  WARNING  WARNING  WARNING   *
579:info:configure * The FUSE user space binaries were NOT installed with root directory      *
580:info:configure * executable prefix. This means that automounting NTFS volumes during boot *
581:info:configure * could fail. This can be fixed the below way by reinstalling FUSE using   *
582:info:configure * the right 'configure' option during FUSE compilation:                    *
583:info:configure *       ./configure --exec-prefix=/                                        *
584:info:configure *       make && sudo make install                                          *
585:info:configure * WARNING  WARNING  WARNING  WARNING  WARNING  WARNING  WARNING  WARNING   *
586:info:configure ****************************************************************************
587:info:configure You can type now 'make' to build ntfs-3g.
588:debug:configure Privilege de-escalation not attempted as not running as root.
589:debug:build build phase started at Sun Jul 31 12:09:22 CEST 2011
590:notice:build --->  Building ntfs-3g
591:debug:build Executing org.macports.build (ntfs-3g)
592:debug:build Environment: CPATH='/opt/local/include' CC_PRINT_OPTIONS_FILE='/opt/local/var/macports/build/_opt_local_var_macports_sources_rsync.macports.org_release_tarballs_ports_fuse_ntfs-3g/ntfs-3g/work/.CC_PRINT_OPTIONS' LIBRARY_PATH='/opt/local/lib' CC_PRINT_OPTIONS='YES' MACOSX_DEPLOYMENT_TARGET='10.7'
593:debug:build Assembled command: 'cd "/opt/local/var/macports/build/_opt_local_var_macports_sources_rsync.macports.org_release_tarballs_ports_fuse_ntfs-3g/ntfs-3g/work/ntfs-3g_ntfsprogs-2011.4.12" && /usr/bin/make -j2 -w all'
594:debug:build Executing command line:  cd "/opt/local/var/macports/build/_opt_local_var_macports_sources_rsync.macports.org_release_tarballs_ports_fuse_ntfs-3g/ntfs-3g/work/ntfs-3g_ntfsprogs-2011.4.12" && /usr/bin/make -j2 -w all
595:info:build make: Entering directory `/opt/local/var/macports/build/_opt_local_var_macports_sources_rsync.macports.org_release_tarballs_ports_fuse_ntfs-3g/ntfs-3g/work/ntfs-3g_ntfsprogs-2011.4.12'
596:info:build /usr/bin/make  all-recursive
597:info:build make[1]: Entering directory `/opt/local/var/macports/build/_opt_local_var_macports_sources_rsync.macports.org_release_tarballs_ports_fuse_ntfs-3g/ntfs-3g/work/ntfs-3g_ntfsprogs-2011.4.12'
598:info:build Making all in include
599:info:build make[2]: Entering directory `/opt/local/var/macports/build/_opt_local_var_macports_sources_rsync.macports.org_release_tarballs_ports_fuse_ntfs-3g/ntfs-3g/work/ntfs-3g_ntfsprogs-2011.4.12/include'
600:info:build Making all in ntfs-3g
601:info:build make[3]: Entering directory `/opt/local/var/macports/build/_opt_local_var_macports_sources_rsync.macports.org_release_tarballs_ports_fuse_ntfs-3g/ntfs-3g/work/ntfs-3g_ntfsprogs-2011.4.12/include/ntfs-3g'
602:info:build make[3]: Nothing to be done for `all'.
603:info:build make[3]: Leaving directory `/opt/local/var/macports/build/_opt_local_var_macports_sources_rsync.macports.org_release_tarballs_ports_fuse_ntfs-3g/ntfs-3g/work/ntfs-3g_ntfsprogs-2011.4.12/include/ntfs-3g'
604:info:build Making all in fuse-lite
605:info:build make[3]: Entering directory `/opt/local/var/macports/build/_opt_local_var_macports_sources_rsync.macports.org_release_tarballs_ports_fuse_ntfs-3g/ntfs-3g/work/ntfs-3g_ntfsprogs-2011.4.12/include/fuse-lite'
606:info:build make[3]: Nothing to be done for `all'.
607:info:build make[3]: Leaving directory `/opt/local/var/macports/build/_opt_local_var_macports_sources_rsync.macports.org_release_tarballs_ports_fuse_ntfs-3g/ntfs-3g/work/ntfs-3g_ntfsprogs-2011.4.12/include/fuse-lite'
608:info:build make[3]: Entering directory `/opt/local/var/macports/build/_opt_local_var_macports_sources_rsync.macports.org_release_tarballs_ports_fuse_ntfs-3g/ntfs-3g/work/ntfs-3g_ntfsprogs-2011.4.12/include'
609:info:build make[3]: Nothing to be done for `all-am'.
610:info:build make[3]: Leaving directory `/opt/local/var/macports/build/_opt_local_var_macports_sources_rsync.macports.org_release_tarballs_ports_fuse_ntfs-3g/ntfs-3g/work/ntfs-3g_ntfsprogs-2011.4.12/include'
611:info:build make[2]: Leaving directory `/opt/local/var/macports/build/_opt_local_var_macports_sources_rsync.macports.org_release_tarballs_ports_fuse_ntfs-3g/ntfs-3g/work/ntfs-3g_ntfsprogs-2011.4.12/include'
612:info:build Making all in libfuse-lite
613:info:build make[2]: Entering directory `/opt/local/var/macports/build/_opt_local_var_macports_sources_rsync.macports.org_release_tarballs_ports_fuse_ntfs-3g/ntfs-3g/work/ntfs-3g_ntfsprogs-2011.4.12/libfuse-lite'
614:info:build make[2]: Nothing to be done for `all'.
615:info:build make[2]: Leaving directory `/opt/local/var/macports/build/_opt_local_var_macports_sources_rsync.macports.org_release_tarballs_ports_fuse_ntfs-3g/ntfs-3g/work/ntfs-3g_ntfsprogs-2011.4.12/libfuse-lite'
616:info:build Making all in libntfs-3g
617:info:build make[2]: Entering directory `/opt/local/var/macports/build/_opt_local_var_macports_sources_rsync.macports.org_release_tarballs_ports_fuse_ntfs-3g/ntfs-3g/work/ntfs-3g_ntfsprogs-2011.4.12/libntfs-3g'
618:info:build /bin/sh ../libtool --tag=CC   --mode=compile /Developer/usr/bin/llvm-gcc-4.2 -DHAVE_CONFIG_H -I. -I..   -I/opt/local/include  -I../include/ntfs-3g -pipe -O2 -arch x86_64 -Wall -MT libntfs_3g_la-acls.lo -MD -MP -MF .deps/libntfs_3g_la-acls.Tpo -c -o libntfs_3g_la-acls.lo `test -f 'acls.c' || echo './'`acls.c
619:info:build /bin/sh ../libtool --tag=CC   --mode=compile /Developer/usr/bin/llvm-gcc-4.2 -DHAVE_CONFIG_H -I. -I..   -I/opt/local/include  -I../include/ntfs-3g -pipe -O2 -arch x86_64 -Wall -MT libntfs_3g_la-attrib.lo -MD -MP -MF .deps/libntfs_3g_la-attrib.Tpo -c -o libntfs_3g_la-attrib.lo `test -f 'attrib.c' || echo './'`attrib.c
620:info:build mkdir .libs
621:info:build mkdir .libs
622:info:build mkdir: .libs: File exists
623:info:build  /Developer/usr/bin/llvm-gcc-4.2 -DHAVE_CONFIG_H -I. -I.. -I/opt/local/include -I../include/ntfs-3g -pipe -O2 -arch x86_64 -Wall -MT libntfs_3g_la-attrib.lo -MD -MP -MF .deps/libntfs_3g_la-attrib.Tpo -c attrib.c  -fno-common -DPIC -o .libs/libntfs_3g_la-attrib.o
624:info:build  /Developer/usr/bin/llvm-gcc-4.2 -DHAVE_CONFIG_H -I. -I.. -I/opt/local/include -I../include/ntfs-3g -pipe -O2 -arch x86_64 -Wall -MT libntfs_3g_la-acls.lo -MD -MP -MF .deps/libntfs_3g_la-acls.Tpo -c acls.c  -fno-common -DPIC -o .libs/libntfs_3g_la-acls.o
625:info:build  /Developer/usr/bin/llvm-gcc-4.2 -DHAVE_CONFIG_H -I. -I.. -I/opt/local/include -I../include/ntfs-3g -pipe -O2 -arch x86_64 -Wall -MT libntfs_3g_la-acls.lo -MD -MP -MF .deps/libntfs_3g_la-acls.Tpo -c acls.c -o libntfs_3g_la-acls.o >/dev/null 2>&1
626:info:build mv -f .deps/libntfs_3g_la-acls.Tpo .deps/libntfs_3g_la-acls.Plo
627:info:build /bin/sh ../libtool --tag=CC   --mode=compile /Developer/usr/bin/llvm-gcc-4.2 -DHAVE_CONFIG_H -I. -I..   -I/opt/local/include  -I../include/ntfs-3g -pipe -O2 -arch x86_64 -Wall -MT libntfs_3g_la-attrlist.lo -MD -MP -MF .deps/libntfs_3g_la-attrlist.Tpo -c -o libntfs_3g_la-attrlist.lo `test -f 'attrlist.c' || echo './'`attrlist.c
628:info:build  /Developer/usr/bin/llvm-gcc-4.2 -DHAVE_CONFIG_H -I. -I.. -I/opt/local/include -I../include/ntfs-3g -pipe -O2 -arch x86_64 -Wall -MT libntfs_3g_la-attrib.lo -MD -MP -MF .deps/libntfs_3g_la-attrib.Tpo -c attrib.c -o libntfs_3g_la-attrib.o >/dev/null 2>&1
629:info:build  /Developer/usr/bin/llvm-gcc-4.2 -DHAVE_CONFIG_H -I. -I.. -I/opt/local/include -I../include/ntfs-3g -pipe -O2 -arch x86_64 -Wall -MT libntfs_3g_la-attrlist.lo -MD -MP -MF .deps/libntfs_3g_la-attrlist.Tpo -c attrlist.c  -fno-common -DPIC -o .libs/libntfs_3g_la-attrlist.o
630:info:build  /Developer/usr/bin/llvm-gcc-4.2 -DHAVE_CONFIG_H -I. -I.. -I/opt/local/include -I../include/ntfs-3g -pipe -O2 -arch x86_64 -Wall -MT libntfs_3g_la-attrlist.lo -MD -MP -MF .deps/libntfs_3g_la-attrlist.Tpo -c attrlist.c -o libntfs_3g_la-attrlist.o >/dev/null 2>&1
631:info:build mv -f .deps/libntfs_3g_la-attrlist.Tpo .deps/libntfs_3g_la-attrlist.Plo
632:info:build /bin/sh ../libtool --tag=CC   --mode=compile /Developer/usr/bin/llvm-gcc-4.2 -DHAVE_CONFIG_H -I. -I..   -I/opt/local/include  -I../include/ntfs-3g -pipe -O2 -arch x86_64 -Wall -MT libntfs_3g_la-bitmap.lo -MD -MP -MF .deps/libntfs_3g_la-bitmap.Tpo -c -o libntfs_3g_la-bitmap.lo `test -f 'bitmap.c' || echo './'`bitmap.c
633:info:build  /Developer/usr/bin/llvm-gcc-4.2 -DHAVE_CONFIG_H -I. -I.. -I/opt/local/include -I../include/ntfs-3g -pipe -O2 -arch x86_64 -Wall -MT libntfs_3g_la-bitmap.lo -MD -MP -MF .deps/libntfs_3g_la-bitmap.Tpo -c bitmap.c  -fno-common -DPIC -o .libs/libntfs_3g_la-bitmap.o
634:info:build  /Developer/usr/bin/llvm-gcc-4.2 -DHAVE_CONFIG_H -I. -I.. -I/opt/local/include -I../include/ntfs-3g -pipe -O2 -arch x86_64 -Wall -MT libntfs_3g_la-bitmap.lo -MD -MP -MF .deps/libntfs_3g_la-bitmap.Tpo -c bitmap.c -o libntfs_3g_la-bitmap.o >/dev/null 2>&1
635:info:build mv -f .deps/libntfs_3g_la-attrib.Tpo .deps/libntfs_3g_la-attrib.Plo
636:info:build /bin/sh ../libtool --tag=CC   --mode=compile /Developer/usr/bin/llvm-gcc-4.2 -DHAVE_CONFIG_H -I. -I..   -I/opt/local/include  -I../include/ntfs-3g -pipe -O2 -arch x86_64 -Wall -MT libntfs_3g_la-bootsect.lo -MD -MP -MF .deps/libntfs_3g_la-bootsect.Tpo -c -o libntfs_3g_la-bootsect.lo `test -f 'bootsect.c' || echo './'`bootsect.c
637:info:build mv -f .deps/libntfs_3g_la-bitmap.Tpo .deps/libntfs_3g_la-bitmap.Plo
638:info:build /bin/sh ../libtool --tag=CC   --mode=compile /Developer/usr/bin/llvm-gcc-4.2 -DHAVE_CONFIG_H -I. -I..   -I/opt/local/include  -I../include/ntfs-3g -pipe -O2 -arch x86_64 -Wall -MT libntfs_3g_la-cache.lo -MD -MP -MF .deps/libntfs_3g_la-cache.Tpo -c -o libntfs_3g_la-cache.lo `test -f 'cache.c' || echo './'`cache.c
639:info:build  /Developer/usr/bin/llvm-gcc-4.2 -DHAVE_CONFIG_H -I. -I.. -I/opt/local/include -I../include/ntfs-3g -pipe -O2 -arch x86_64 -Wall -MT libntfs_3g_la-bootsect.lo -MD -MP -MF .deps/libntfs_3g_la-bootsect.Tpo -c bootsect.c  -fno-common -DPIC -o .libs/libntfs_3g_la-bootsect.o
640:info:build  /Developer/usr/bin/llvm-gcc-4.2 -DHAVE_CONFIG_H -I. -I.. -I/opt/local/include -I../include/ntfs-3g -pipe -O2 -arch x86_64 -Wall -MT libntfs_3g_la-cache.lo -MD -MP -MF .deps/libntfs_3g_la-cache.Tpo -c cache.c  -fno-common -DPIC -o .libs/libntfs_3g_la-cache.o
641:info:build  /Developer/usr/bin/llvm-gcc-4.2 -DHAVE_CONFIG_H -I. -I.. -I/opt/local/include -I../include/ntfs-3g -pipe -O2 -arch x86_64 -Wall -MT libntfs_3g_la-bootsect.lo -MD -MP -MF .deps/libntfs_3g_la-bootsect.Tpo -c bootsect.c -o libntfs_3g_la-bootsect.o >/dev/null 2>&1
642:info:build  /Developer/usr/bin/llvm-gcc-4.2 -DHAVE_CONFIG_H -I. -I.. -I/opt/local/include -I../include/ntfs-3g -pipe -O2 -arch x86_64 -Wall -MT libntfs_3g_la-cache.lo -MD -MP -MF .deps/libntfs_3g_la-cache.Tpo -c cache.c -o libntfs_3g_la-cache.o >/dev/null 2>&1
643:info:build mv -f .deps/libntfs_3g_la-bootsect.Tpo .deps/libntfs_3g_la-bootsect.Plo
644:info:build /bin/sh ../libtool --tag=CC   --mode=compile /Developer/usr/bin/llvm-gcc-4.2 -DHAVE_CONFIG_H -I. -I..   -I/opt/local/include  -I../include/ntfs-3g -pipe -O2 -arch x86_64 -Wall -MT libntfs_3g_la-collate.lo -MD -MP -MF .deps/libntfs_3g_la-collate.Tpo -c -o libntfs_3g_la-collate.lo `test -f 'collate.c' || echo './'`collate.c
645:info:build mv -f .deps/libntfs_3g_la-cache.Tpo .deps/libntfs_3g_la-cache.Plo
646:info:build /bin/sh ../libtool --tag=CC   --mode=compile /Developer/usr/bin/llvm-gcc-4.2 -DHAVE_CONFIG_H -I. -I..   -I/opt/local/include  -I../include/ntfs-3g -pipe -O2 -arch x86_64 -Wall -MT libntfs_3g_la-compat.lo -MD -MP -MF .deps/libntfs_3g_la-compat.Tpo -c -o libntfs_3g_la-compat.lo `test -f 'compat.c' || echo './'`compat.c
647:info:build  /Developer/usr/bin/llvm-gcc-4.2 -DHAVE_CONFIG_H -I. -I.. -I/opt/local/include -I../include/ntfs-3g -pipe -O2 -arch x86_64 -Wall -MT libntfs_3g_la-collate.lo -MD -MP -MF .deps/libntfs_3g_la-collate.Tpo -c collate.c  -fno-common -DPIC -o .libs/libntfs_3g_la-collate.o
648:info:build  /Developer/usr/bin/llvm-gcc-4.2 -DHAVE_CONFIG_H -I. -I.. -I/opt/local/include -I../include/ntfs-3g -pipe -O2 -arch x86_64 -Wall -MT libntfs_3g_la-collate.lo -MD -MP -MF .deps/libntfs_3g_la-collate.Tpo -c collate.c -o libntfs_3g_la-collate.o >/dev/null 2>&1
649:info:build mv -f .deps/libntfs_3g_la-collate.Tpo .deps/libntfs_3g_la-collate.Plo
650:info:build /bin/sh ../libtool --tag=CC   --mode=compile /Developer/usr/bin/llvm-gcc-4.2 -DHAVE_CONFIG_H -I. -I..   -I/opt/local/include  -I../include/ntfs-3g -pipe -O2 -arch x86_64 -Wall -MT libntfs_3g_la-compress.lo -MD -MP -MF .deps/libntfs_3g_la-compress.Tpo -c -o libntfs_3g_la-compress.lo `test -f 'compress.c' || echo './'`compress.c
651:info:build  /Developer/usr/bin/llvm-gcc-4.2 -DHAVE_CONFIG_H -I. -I.. -I/opt/local/include -I../include/ntfs-3g -pipe -O2 -arch x86_64 -Wall -MT libntfs_3g_la-compat.lo -MD -MP -MF .deps/libntfs_3g_la-compat.Tpo -c compat.c  -fno-common -DPIC -o .libs/libntfs_3g_la-compat.o
652:info:build  /Developer/usr/bin/llvm-gcc-4.2 -DHAVE_CONFIG_H -I. -I.. -I/opt/local/include -I../include/ntfs-3g -pipe -O2 -arch x86_64 -Wall -MT libntfs_3g_la-compat.lo -MD -MP -MF .deps/libntfs_3g_la-compat.Tpo -c compat.c -o libntfs_3g_la-compat.o >/dev/null 2>&1
653:info:build mv -f .deps/libntfs_3g_la-compat.Tpo .deps/libntfs_3g_la-compat.Plo
654:info:build /bin/sh ../libtool --tag=CC   --mode=compile /Developer/usr/bin/llvm-gcc-4.2 -DHAVE_CONFIG_H -I. -I..   -I/opt/local/include  -I../include/ntfs-3g -pipe -O2 -arch x86_64 -Wall -MT libntfs_3g_la-debug.lo -MD -MP -MF .deps/libntfs_3g_la-debug.Tpo -c -o libntfs_3g_la-debug.lo `test -f 'debug.c' || echo './'`debug.c
655:info:build  /Developer/usr/bin/llvm-gcc-4.2 -DHAVE_CONFIG_H -I. -I.. -I/opt/local/include -I../include/ntfs-3g -pipe -O2 -arch x86_64 -Wall -MT libntfs_3g_la-compress.lo -MD -MP -MF .deps/libntfs_3g_la-compress.Tpo -c compress.c  -fno-common -DPIC -o .libs/libntfs_3g_la-compress.o
656:info:build  /Developer/usr/bin/llvm-gcc-4.2 -DHAVE_CONFIG_H -I. -I.. -I/opt/local/include -I../include/ntfs-3g -pipe -O2 -arch x86_64 -Wall -MT libntfs_3g_la-debug.lo -MD -MP -MF .deps/libntfs_3g_la-debug.Tpo -c debug.c  -fno-common -DPIC -o .libs/libntfs_3g_la-debug.o
657:info:build  /Developer/usr/bin/llvm-gcc-4.2 -DHAVE_CONFIG_H -I. -I.. -I/opt/local/include -I../include/ntfs-3g -pipe -O2 -arch x86_64 -Wall -MT libntfs_3g_la-debug.lo -MD -MP -MF .deps/libntfs_3g_la-debug.Tpo -c debug.c -o libntfs_3g_la-debug.o >/dev/null 2>&1
658:info:build mv -f .deps/libntfs_3g_la-debug.Tpo .deps/libntfs_3g_la-debug.Plo
659:info:build /bin/sh ../libtool --tag=CC   --mode=compile /Developer/usr/bin/llvm-gcc-4.2 -DHAVE_CONFIG_H -I. -I..   -I/opt/local/include  -I../include/ntfs-3g -pipe -O2 -arch x86_64 -Wall -MT libntfs_3g_la-device.lo -MD -MP -MF .deps/libntfs_3g_la-device.Tpo -c -o libntfs_3g_la-device.lo `test -f 'device.c' || echo './'`device.c
660:info:build  /Developer/usr/bin/llvm-gcc-4.2 -DHAVE_CONFIG_H -I. -I.. -I/opt/local/include -I../include/ntfs-3g -pipe -O2 -arch x86_64 -Wall -MT libntfs_3g_la-compress.lo -MD -MP -MF .deps/libntfs_3g_la-compress.Tpo -c compress.c -o libntfs_3g_la-compress.o >/dev/null 2>&1
661:info:build  /Developer/usr/bin/llvm-gcc-4.2 -DHAVE_CONFIG_H -I. -I.. -I/opt/local/include -I../include/ntfs-3g -pipe -O2 -arch x86_64 -Wall -MT libntfs_3g_la-device.lo -MD -MP -MF .deps/libntfs_3g_la-device.Tpo -c device.c  -fno-common -DPIC -o .libs/libntfs_3g_la-device.o
662:info:build mv -f .deps/libntfs_3g_la-compress.Tpo .deps/libntfs_3g_la-compress.Plo
663:info:build /bin/sh ../libtool --tag=CC   --mode=compile /Developer/usr/bin/llvm-gcc-4.2 -DHAVE_CONFIG_H -I. -I..   -I/opt/local/include  -I../include/ntfs-3g -pipe -O2 -arch x86_64 -Wall -MT libntfs_3g_la-dir.lo -MD -MP -MF .deps/libntfs_3g_la-dir.Tpo -c -o libntfs_3g_la-dir.lo `test -f 'dir.c' || echo './'`dir.c
664:info:build  /Developer/usr/bin/llvm-gcc-4.2 -DHAVE_CONFIG_H -I. -I.. -I/opt/local/include -I../include/ntfs-3g -pipe -O2 -arch x86_64 -Wall -MT libntfs_3g_la-device.lo -MD -MP -MF .deps/libntfs_3g_la-device.Tpo -c device.c -o libntfs_3g_la-device.o >/dev/null 2>&1
665:info:build mv -f .deps/libntfs_3g_la-device.Tpo .deps/libntfs_3g_la-device.Plo
666:info:build /bin/sh ../libtool --tag=CC   --mode=compile /Developer/usr/bin/llvm-gcc-4.2 -DHAVE_CONFIG_H -I. -I..   -I/opt/local/include  -I../include/ntfs-3g -pipe -O2 -arch x86_64 -Wall -MT libntfs_3g_la-efs.lo -MD -MP -MF .deps/libntfs_3g_la-efs.Tpo -c -o libntfs_3g_la-efs.lo `test -f 'efs.c' || echo './'`efs.c
667:info:build  /Developer/usr/bin/llvm-gcc-4.2 -DHAVE_CONFIG_H -I. -I.. -I/opt/local/include -I../include/ntfs-3g -pipe -O2 -arch x86_64 -Wall -MT libntfs_3g_la-dir.lo -MD -MP -MF .deps/libntfs_3g_la-dir.Tpo -c dir.c  -fno-common -DPIC -o .libs/libntfs_3g_la-dir.o
668:info:build  /Developer/usr/bin/llvm-gcc-4.2 -DHAVE_CONFIG_H -I. -I.. -I/opt/local/include -I../include/ntfs-3g -pipe -O2 -arch x86_64 -Wall -MT libntfs_3g_la-efs.lo -MD -MP -MF .deps/libntfs_3g_la-efs.Tpo -c efs.c  -fno-common -DPIC -o .libs/libntfs_3g_la-efs.o
669:info:build  /Developer/usr/bin/llvm-gcc-4.2 -DHAVE_CONFIG_H -I. -I.. -I/opt/local/include -I../include/ntfs-3g -pipe -O2 -arch x86_64 -Wall -MT libntfs_3g_la-efs.lo -MD -MP -MF .deps/libntfs_3g_la-efs.Tpo -c efs.c -o libntfs_3g_la-efs.o >/dev/null 2>&1
670:info:build mv -f .deps/libntfs_3g_la-efs.Tpo .deps/libntfs_3g_la-efs.Plo
671:info:build /bin/sh ../libtool --tag=CC   --mode=compile /Developer/usr/bin/llvm-gcc-4.2 -DHAVE_CONFIG_H -I. -I..   -I/opt/local/include  -I../include/ntfs-3g -pipe -O2 -arch x86_64 -Wall -MT libntfs_3g_la-index.lo -MD -MP -MF .deps/libntfs_3g_la-index.Tpo -c -o libntfs_3g_la-index.lo `test -f 'index.c' || echo './'`index.c
672:info:build  /Developer/usr/bin/llvm-gcc-4.2 -DHAVE_CONFIG_H -I. -I.. -I/opt/local/include -I../include/ntfs-3g -pipe -O2 -arch x86_64 -Wall -MT libntfs_3g_la-dir.lo -MD -MP -MF .deps/libntfs_3g_la-dir.Tpo -c dir.c -o libntfs_3g_la-dir.o >/dev/null 2>&1
673:info:build mv -f .deps/libntfs_3g_la-dir.Tpo .deps/libntfs_3g_la-dir.Plo
674:info:build /bin/sh ../libtool --tag=CC   --mode=compile /Developer/usr/bin/llvm-gcc-4.2 -DHAVE_CONFIG_H -I. -I..   -I/opt/local/include  -I../include/ntfs-3g -pipe -O2 -arch x86_64 -Wall -MT libntfs_3g_la-inode.lo -MD -MP -MF .deps/libntfs_3g_la-inode.Tpo -c -o libntfs_3g_la-inode.lo `test -f 'inode.c' || echo './'`inode.c
675:info:build  /Developer/usr/bin/llvm-gcc-4.2 -DHAVE_CONFIG_H -I. -I.. -I/opt/local/include -I../include/ntfs-3g -pipe -O2 -arch x86_64 -Wall -MT libntfs_3g_la-index.lo -MD -MP -MF .deps/libntfs_3g_la-index.Tpo -c index.c  -fno-common -DPIC -o .libs/libntfs_3g_la-index.o
676:info:build  /Developer/usr/bin/llvm-gcc-4.2 -DHAVE_CONFIG_H -I. -I.. -I/opt/local/include -I../include/ntfs-3g -pipe -O2 -arch x86_64 -Wall -MT libntfs_3g_la-index.lo -MD -MP -MF .deps/libntfs_3g_la-index.Tpo -c index.c -o libntfs_3g_la-index.o >/dev/null 2>&1
677:info:build  /Developer/usr/bin/llvm-gcc-4.2 -DHAVE_CONFIG_H -I. -I.. -I/opt/local/include -I../include/ntfs-3g -pipe -O2 -arch x86_64 -Wall -MT libntfs_3g_la-inode.lo -MD -MP -MF .deps/libntfs_3g_la-inode.Tpo -c inode.c  -fno-common -DPIC -o .libs/libntfs_3g_la-inode.o
678:info:build  /Developer/usr/bin/llvm-gcc-4.2 -DHAVE_CONFIG_H -I. -I.. -I/opt/local/include -I../include/ntfs-3g -pipe -O2 -arch x86_64 -Wall -MT libntfs_3g_la-inode.lo -MD -MP -MF .deps/libntfs_3g_la-inode.Tpo -c inode.c -o libntfs_3g_la-inode.o >/dev/null 2>&1
679:info:build mv -f .deps/libntfs_3g_la-index.Tpo .deps/libntfs_3g_la-index.Plo
680:info:build /bin/sh ../libtool --tag=CC   --mode=compile /Developer/usr/bin/llvm-gcc-4.2 -DHAVE_CONFIG_H -I. -I..   -I/opt/local/include  -I../include/ntfs-3g -pipe -O2 -arch x86_64 -Wall -MT libntfs_3g_la-lcnalloc.lo -MD -MP -MF .deps/libntfs_3g_la-lcnalloc.Tpo -c -o libntfs_3g_la-lcnalloc.lo `test -f 'lcnalloc.c' || echo './'`lcnalloc.c
681:info:build mv -f .deps/libntfs_3g_la-inode.Tpo .deps/libntfs_3g_la-inode.Plo
682:info:build /bin/sh ../libtool --tag=CC   --mode=compile /Developer/usr/bin/llvm-gcc-4.2 -DHAVE_CONFIG_H -I. -I..   -I/opt/local/include  -I../include/ntfs-3g -pipe -O2 -arch x86_64 -Wall -MT libntfs_3g_la-logfile.lo -MD -MP -MF .deps/libntfs_3g_la-logfile.Tpo -c -o libntfs_3g_la-logfile.lo `test -f 'logfile.c' || echo './'`logfile.c
683:info:build  /Developer/usr/bin/llvm-gcc-4.2 -DHAVE_CONFIG_H -I. -I.. -I/opt/local/include -I../include/ntfs-3g -pipe -O2 -arch x86_64 -Wall -MT libntfs_3g_la-lcnalloc.lo -MD -MP -MF .deps/libntfs_3g_la-lcnalloc.Tpo -c lcnalloc.c  -fno-common -DPIC -o .libs/libntfs_3g_la-lcnalloc.o
684:info:build  /Developer/usr/bin/llvm-gcc-4.2 -DHAVE_CONFIG_H -I. -I.. -I/opt/local/include -I../include/ntfs-3g -pipe -O2 -arch x86_64 -Wall -MT libntfs_3g_la-logfile.lo -MD -MP -MF .deps/libntfs_3g_la-logfile.Tpo -c logfile.c  -fno-common -DPIC -o .libs/libntfs_3g_la-logfile.o
685:info:build  /Developer/usr/bin/llvm-gcc-4.2 -DHAVE_CONFIG_H -I. -I.. -I/opt/local/include -I../include/ntfs-3g -pipe -O2 -arch x86_64 -Wall -MT libntfs_3g_la-lcnalloc.lo -MD -MP -MF .deps/libntfs_3g_la-lcnalloc.Tpo -c lcnalloc.c -o libntfs_3g_la-lcnalloc.o >/dev/null 2>&1
686:info:build  /Developer/usr/bin/llvm-gcc-4.2 -DHAVE_CONFIG_H -I. -I.. -I/opt/local/include -I../include/ntfs-3g -pipe -O2 -arch x86_64 -Wall -MT libntfs_3g_la-logfile.lo -MD -MP -MF .deps/libntfs_3g_la-logfile.Tpo -c logfile.c -o libntfs_3g_la-logfile.o >/dev/null 2>&1
687:info:build mv -f .deps/libntfs_3g_la-lcnalloc.Tpo .deps/libntfs_3g_la-lcnalloc.Plo
688:info:build /bin/sh ../libtool --tag=CC   --mode=compile /Developer/usr/bin/llvm-gcc-4.2 -DHAVE_CONFIG_H -I. -I..   -I/opt/local/include  -I../include/ntfs-3g -pipe -O2 -arch x86_64 -Wall -MT libntfs_3g_la-logging.lo -MD -MP -MF .deps/libntfs_3g_la-logging.Tpo -c -o libntfs_3g_la-logging.lo `test -f 'logging.c' || echo './'`logging.c
689:info:build mv -f .deps/libntfs_3g_la-logfile.Tpo .deps/libntfs_3g_la-logfile.Plo
690:info:build /bin/sh ../libtool --tag=CC   --mode=compile /Developer/usr/bin/llvm-gcc-4.2 -DHAVE_CONFIG_H -I. -I..   -I/opt/local/include  -I../include/ntfs-3g -pipe -O2 -arch x86_64 -Wall -MT libntfs_3g_la-mft.lo -MD -MP -MF .deps/libntfs_3g_la-mft.Tpo -c -o libntfs_3g_la-mft.lo `test -f 'mft.c' || echo './'`mft.c
691:info:build  /Developer/usr/bin/llvm-gcc-4.2 -DHAVE_CONFIG_H -I. -I.. -I/opt/local/include -I../include/ntfs-3g -pipe -O2 -arch x86_64 -Wall -MT libntfs_3g_la-logging.lo -MD -MP -MF .deps/libntfs_3g_la-logging.Tpo -c logging.c  -fno-common -DPIC -o .libs/libntfs_3g_la-logging.o
692:info:build  /Developer/usr/bin/llvm-gcc-4.2 -DHAVE_CONFIG_H -I. -I.. -I/opt/local/include -I../include/ntfs-3g -pipe -O2 -arch x86_64 -Wall -MT libntfs_3g_la-logging.lo -MD -MP -MF .deps/libntfs_3g_la-logging.Tpo -c logging.c -o libntfs_3g_la-logging.o >/dev/null 2>&1
693:info:build  /Developer/usr/bin/llvm-gcc-4.2 -DHAVE_CONFIG_H -I. -I.. -I/opt/local/include -I../include/ntfs-3g -pipe -O2 -arch x86_64 -Wall -MT libntfs_3g_la-mft.lo -MD -MP -MF .deps/libntfs_3g_la-mft.Tpo -c mft.c  -fno-common -DPIC -o .libs/libntfs_3g_la-mft.o
694:info:build mv -f .deps/libntfs_3g_la-logging.Tpo .deps/libntfs_3g_la-logging.Plo
695:info:build /bin/sh ../libtool --tag=CC   --mode=compile /Developer/usr/bin/llvm-gcc-4.2 -DHAVE_CONFIG_H -I. -I..   -I/opt/local/include  -I../include/ntfs-3g -pipe -O2 -arch x86_64 -Wall -MT libntfs_3g_la-misc.lo -MD -MP -MF .deps/libntfs_3g_la-misc.Tpo -c -o libntfs_3g_la-misc.lo `test -f 'misc.c' || echo './'`misc.c
696:info:build  /Developer/usr/bin/llvm-gcc-4.2 -DHAVE_CONFIG_H -I. -I.. -I/opt/local/include -I../include/ntfs-3g -pipe -O2 -arch x86_64 -Wall -MT libntfs_3g_la-mft.lo -MD -MP -MF .deps/libntfs_3g_la-mft.Tpo -c mft.c -o libntfs_3g_la-mft.o >/dev/null 2>&1
697:info:build  /Developer/usr/bin/llvm-gcc-4.2 -DHAVE_CONFIG_H -I. -I.. -I/opt/local/include -I../include/ntfs-3g -pipe -O2 -arch x86_64 -Wall -MT libntfs_3g_la-misc.lo -MD -MP -MF .deps/libntfs_3g_la-misc.Tpo -c misc.c  -fno-common -DPIC -o .libs/libntfs_3g_la-misc.o
698:info:build mv -f .deps/libntfs_3g_la-mft.Tpo .deps/libntfs_3g_la-mft.Plo
699:info:build  /Developer/usr/bin/llvm-gcc-4.2 -DHAVE_CONFIG_H -I. -I.. -I/opt/local/include -I../include/ntfs-3g -pipe -O2 -arch x86_64 -Wall -MT libntfs_3g_la-misc.lo -MD -MP -MF .deps/libntfs_3g_la-misc.Tpo -c misc.c -o libntfs_3g_la-misc.o >/dev/null 2>&1
700:info:build /bin/sh ../libtool --tag=CC   --mode=compile /Developer/usr/bin/llvm-gcc-4.2 -DHAVE_CONFIG_H -I. -I..   -I/opt/local/include  -I../include/ntfs-3g -pipe -O2 -arch x86_64 -Wall -MT libntfs_3g_la-mst.lo -MD -MP -MF .deps/libntfs_3g_la-mst.Tpo -c -o libntfs_3g_la-mst.lo `test -f 'mst.c' || echo './'`mst.c
701:info:build mv -f .deps/libntfs_3g_la-misc.Tpo .deps/libntfs_3g_la-misc.Plo
702:info:build /bin/sh ../libtool --tag=CC   --mode=compile /Developer/usr/bin/llvm-gcc-4.2 -DHAVE_CONFIG_H -I. -I..   -I/opt/local/include  -I../include/ntfs-3g -pipe -O2 -arch x86_64 -Wall -MT libntfs_3g_la-object_id.lo -MD -MP -MF .deps/libntfs_3g_la-object_id.Tpo -c -o libntfs_3g_la-object_id.lo `test -f 'object_id.c' || echo './'`object_id.c
703:info:build  /Developer/usr/bin/llvm-gcc-4.2 -DHAVE_CONFIG_H -I. -I.. -I/opt/local/include -I../include/ntfs-3g -pipe -O2 -arch x86_64 -Wall -MT libntfs_3g_la-mst.lo -MD -MP -MF .deps/libntfs_3g_la-mst.Tpo -c mst.c  -fno-common -DPIC -o .libs/libntfs_3g_la-mst.o
704:info:build  /Developer/usr/bin/llvm-gcc-4.2 -DHAVE_CONFIG_H -I. -I.. -I/opt/local/include -I../include/ntfs-3g -pipe -O2 -arch x86_64 -Wall -MT libntfs_3g_la-object_id.lo -MD -MP -MF .deps/libntfs_3g_la-object_id.Tpo -c object_id.c  -fno-common -DPIC -o .libs/libntfs_3g_la-object_id.o
705:info:build  /Developer/usr/bin/llvm-gcc-4.2 -DHAVE_CONFIG_H -I. -I.. -I/opt/local/include -I../include/ntfs-3g -pipe -O2 -arch x86_64 -Wall -MT libntfs_3g_la-mst.lo -MD -MP -MF .deps/libntfs_3g_la-mst.Tpo -c mst.c -o libntfs_3g_la-mst.o >/dev/null 2>&1
706:info:build mv -f .deps/libntfs_3g_la-mst.Tpo .deps/libntfs_3g_la-mst.Plo
707:info:build /bin/sh ../libtool --tag=CC   --mode=compile /Developer/usr/bin/llvm-gcc-4.2 -DHAVE_CONFIG_H -I. -I..   -I/opt/local/include  -I../include/ntfs-3g -pipe -O2 -arch x86_64 -Wall -MT libntfs_3g_la-reparse.lo -MD -MP -MF .deps/libntfs_3g_la-reparse.Tpo -c -o libntfs_3g_la-reparse.lo `test -f 'reparse.c' || echo './'`reparse.c
708:info:build  /Developer/usr/bin/llvm-gcc-4.2 -DHAVE_CONFIG_H -I. -I.. -I/opt/local/include -I../include/ntfs-3g -pipe -O2 -arch x86_64 -Wall -MT libntfs_3g_la-object_id.lo -MD -MP -MF .deps/libntfs_3g_la-object_id.Tpo -c object_id.c -o libntfs_3g_la-object_id.o >/dev/null 2>&1
709:info:build mv -f .deps/libntfs_3g_la-object_id.Tpo .deps/libntfs_3g_la-object_id.Plo
710:info:build /bin/sh ../libtool --tag=CC   --mode=compile /Developer/usr/bin/llvm-gcc-4.2 -DHAVE_CONFIG_H -I. -I..   -I/opt/local/include  -I../include/ntfs-3g -pipe -O2 -arch x86_64 -Wall -MT libntfs_3g_la-runlist.lo -MD -MP -MF .deps/libntfs_3g_la-runlist.Tpo -c -o libntfs_3g_la-runlist.lo `test -f 'runlist.c' || echo './'`runlist.c
711:info:build  /Developer/usr/bin/llvm-gcc-4.2 -DHAVE_CONFIG_H -I. -I.. -I/opt/local/include -I../include/ntfs-3g -pipe -O2 -arch x86_64 -Wall -MT libntfs_3g_la-reparse.lo -MD -MP -MF .deps/libntfs_3g_la-reparse.Tpo -c reparse.c  -fno-common -DPIC -o .libs/libntfs_3g_la-reparse.o
712:info:build  /Developer/usr/bin/llvm-gcc-4.2 -DHAVE_CONFIG_H -I. -I.. -I/opt/local/include -I../include/ntfs-3g -pipe -O2 -arch x86_64 -Wall -MT libntfs_3g_la-runlist.lo -MD -MP -MF .deps/libntfs_3g_la-runlist.Tpo -c runlist.c  -fno-common -DPIC -o .libs/libntfs_3g_la-runlist.o
713:info:build  /Developer/usr/bin/llvm-gcc-4.2 -DHAVE_CONFIG_H -I. -I.. -I/opt/local/include -I../include/ntfs-3g -pipe -O2 -arch x86_64 -Wall -MT libntfs_3g_la-reparse.lo -MD -MP -MF .deps/libntfs_3g_la-reparse.Tpo -c reparse.c -o libntfs_3g_la-reparse.o >/dev/null 2>&1
714:info:build mv -f .deps/libntfs_3g_la-reparse.Tpo .deps/libntfs_3g_la-reparse.Plo
715:info:build /bin/sh ../libtool --tag=CC   --mode=compile /Developer/usr/bin/llvm-gcc-4.2 -DHAVE_CONFIG_H -I. -I..   -I/opt/local/include  -I../include/ntfs-3g -pipe -O2 -arch x86_64 -Wall -MT libntfs_3g_la-security.lo -MD -MP -MF .deps/libntfs_3g_la-security.Tpo -c -o libntfs_3g_la-security.lo `test -f 'security.c' || echo './'`security.c
716:info:build  /Developer/usr/bin/llvm-gcc-4.2 -DHAVE_CONFIG_H -I. -I.. -I/opt/local/include -I../include/ntfs-3g -pipe -O2 -arch x86_64 -Wall -MT libntfs_3g_la-runlist.lo -MD -MP -MF .deps/libntfs_3g_la-runlist.Tpo -c runlist.c -o libntfs_3g_la-runlist.o >/dev/null 2>&1
717:info:build mv -f .deps/libntfs_3g_la-runlist.Tpo .deps/libntfs_3g_la-runlist.Plo
718:info:build /bin/sh ../libtool --tag=CC   --mode=compile /Developer/usr/bin/llvm-gcc-4.2 -DHAVE_CONFIG_H -I. -I..   -I/opt/local/include  -I../include/ntfs-3g -pipe -O2 -arch x86_64 -Wall -MT libntfs_3g_la-unistr.lo -MD -MP -MF .deps/libntfs_3g_la-unistr.Tpo -c -o libntfs_3g_la-unistr.lo `test -f 'unistr.c' || echo './'`unistr.c
719:info:build  /Developer/usr/bin/llvm-gcc-4.2 -DHAVE_CONFIG_H -I. -I.. -I/opt/local/include -I../include/ntfs-3g -pipe -O2 -arch x86_64 -Wall -MT libntfs_3g_la-security.lo -MD -MP -MF .deps/libntfs_3g_la-security.Tpo -c security.c  -fno-common -DPIC -o .libs/libntfs_3g_la-security.o
720:info:build  /Developer/usr/bin/llvm-gcc-4.2 -DHAVE_CONFIG_H -I. -I.. -I/opt/local/include -I../include/ntfs-3g -pipe -O2 -arch x86_64 -Wall -MT libntfs_3g_la-unistr.lo -MD -MP -MF .deps/libntfs_3g_la-unistr.Tpo -c unistr.c  -fno-common -DPIC -o .libs/libntfs_3g_la-unistr.o
721:info:build  /Developer/usr/bin/llvm-gcc-4.2 -DHAVE_CONFIG_H -I. -I.. -I/opt/local/include -I../include/ntfs-3g -pipe -O2 -arch x86_64 -Wall -MT libntfs_3g_la-security.lo -MD -MP -MF .deps/libntfs_3g_la-security.Tpo -c security.c -o libntfs_3g_la-security.o >/dev/null 2>&1
722:info:build  /Developer/usr/bin/llvm-gcc-4.2 -DHAVE_CONFIG_H -I. -I.. -I/opt/local/include -I../include/ntfs-3g -pipe -O2 -arch x86_64 -Wall -MT libntfs_3g_la-unistr.lo -MD -MP -MF .deps/libntfs_3g_la-unistr.Tpo -c unistr.c -o libntfs_3g_la-unistr.o >/dev/null 2>&1
723:info:build mv -f .deps/libntfs_3g_la-unistr.Tpo .deps/libntfs_3g_la-unistr.Plo
724:info:build /bin/sh ../libtool --tag=CC   --mode=compile /Developer/usr/bin/llvm-gcc-4.2 -DHAVE_CONFIG_H -I. -I..   -I/opt/local/include  -I../include/ntfs-3g -pipe -O2 -arch x86_64 -Wall -MT libntfs_3g_la-volume.lo -MD -MP -MF .deps/libntfs_3g_la-volume.Tpo -c -o libntfs_3g_la-volume.lo `test -f 'volume.c' || echo './'`volume.c
725:info:build mv -f .deps/libntfs_3g_la-security.Tpo .deps/libntfs_3g_la-security.Plo
726:info:build /bin/sh ../libtool --tag=CC   --mode=compile /Developer/usr/bin/llvm-gcc-4.2 -DHAVE_CONFIG_H -I. -I..   -I/opt/local/include  -I../include/ntfs-3g -pipe -O2 -arch x86_64 -Wall -MT libntfs_3g_la-xattrs.lo -MD -MP -MF .deps/libntfs_3g_la-xattrs.Tpo -c -o libntfs_3g_la-xattrs.lo `test -f 'xattrs.c' || echo './'`xattrs.c
727:info:build  /Developer/usr/bin/llvm-gcc-4.2 -DHAVE_CONFIG_H -I. -I.. -I/opt/local/include -I../include/ntfs-3g -pipe -O2 -arch x86_64 -Wall -MT libntfs_3g_la-volume.lo -MD -MP -MF .deps/libntfs_3g_la-volume.Tpo -c volume.c  -fno-common -DPIC -o .libs/libntfs_3g_la-volume.o
728:info:build  /Developer/usr/bin/llvm-gcc-4.2 -DHAVE_CONFIG_H -I. -I.. -I/opt/local/include -I../include/ntfs-3g -pipe -O2 -arch x86_64 -Wall -MT libntfs_3g_la-xattrs.lo -MD -MP -MF .deps/libntfs_3g_la-xattrs.Tpo -c xattrs.c  -fno-common -DPIC -o .libs/libntfs_3g_la-xattrs.o
729:info:build  /Developer/usr/bin/llvm-gcc-4.2 -DHAVE_CONFIG_H -I. -I.. -I/opt/local/include -I../include/ntfs-3g -pipe -O2 -arch x86_64 -Wall -MT libntfs_3g_la-xattrs.lo -MD -MP -MF .deps/libntfs_3g_la-xattrs.Tpo -c xattrs.c -o libntfs_3g_la-xattrs.o >/dev/null 2>&1
730:info:build mv -f .deps/libntfs_3g_la-xattrs.Tpo .deps/libntfs_3g_la-xattrs.Plo
731:info:build /bin/sh ../libtool --tag=CC   --mode=compile /Developer/usr/bin/llvm-gcc-4.2 -DHAVE_CONFIG_H -I. -I..   -I/opt/local/include  -I../include/ntfs-3g -pipe -O2 -arch x86_64 -Wall -MT libntfs_3g_la-unix_io.lo -MD -MP -MF .deps/libntfs_3g_la-unix_io.Tpo -c -o libntfs_3g_la-unix_io.lo `test -f 'unix_io.c' || echo './'`unix_io.c
732:info:build  /Developer/usr/bin/llvm-gcc-4.2 -DHAVE_CONFIG_H -I. -I.. -I/opt/local/include -I../include/ntfs-3g -pipe -O2 -arch x86_64 -Wall -MT libntfs_3g_la-volume.lo -MD -MP -MF .deps/libntfs_3g_la-volume.Tpo -c volume.c -o libntfs_3g_la-volume.o >/dev/null 2>&1
733:info:build mv -f .deps/libntfs_3g_la-volume.Tpo .deps/libntfs_3g_la-volume.Plo
734:info:build  /Developer/usr/bin/llvm-gcc-4.2 -DHAVE_CONFIG_H -I. -I.. -I/opt/local/include -I../include/ntfs-3g -pipe -O2 -arch x86_64 -Wall -MT libntfs_3g_la-unix_io.lo -MD -MP -MF .deps/libntfs_3g_la-unix_io.Tpo -c unix_io.c  -fno-common -DPIC -o .libs/libntfs_3g_la-unix_io.o
735:info:build  /Developer/usr/bin/llvm-gcc-4.2 -DHAVE_CONFIG_H -I. -I.. -I/opt/local/include -I../include/ntfs-3g -pipe -O2 -arch x86_64 -Wall -MT libntfs_3g_la-unix_io.lo -MD -MP -MF .deps/libntfs_3g_la-unix_io.Tpo -c unix_io.c -o libntfs_3g_la-unix_io.o >/dev/null 2>&1
736:info:build mv -f .deps/libntfs_3g_la-unix_io.Tpo .deps/libntfs_3g_la-unix_io.Plo
737:info:build /bin/sh ../libtool --tag=CC   --mode=link /Developer/usr/bin/llvm-gcc-4.2  -I../include/ntfs-3g -pipe -O2 -arch x86_64 -Wall -version-info 81 -no-undefined -L/opt/local/lib -framework CoreFoundation -lintl -arch x86_64 -framework CoreFoundation -o libntfs-3g.la -rpath /opt/local/lib libntfs_3g_la-acls.lo libntfs_3g_la-attrib.lo libntfs_3g_la-attrlist.lo libntfs_3g_la-bitmap.lo libntfs_3g_la-bootsect.lo libntfs_3g_la-cache.lo libntfs_3g_la-collate.lo libntfs_3g_la-compat.lo libntfs_3g_la-compress.lo libntfs_3g_la-debug.lo libntfs_3g_la-device.lo libntfs_3g_la-dir.lo libntfs_3g_la-efs.lo libntfs_3g_la-index.lo libntfs_3g_la-inode.lo libntfs_3g_la-lcnalloc.lo libntfs_3g_la-logfile.lo libntfs_3g_la-logging.lo libntfs_3g_la-mft.lo libntfs_3g_la-misc.lo libntfs_3g_la-mst.lo libntfs_3g_la-object_id.lo libntfs_3g_la-reparse.lo libntfs_3g_la-runlist.lo libntfs_3g_la-security.lo libntfs_3g_la-unistr.lo libntfs_3g_la-volume.lo libntfs_3g_la-xattrs.lo  libntfs_3g_la-unix_io.lo 
738:info:build /Developer/usr/bin/llvm-gcc-4.2 -dynamiclib  -o .libs/libntfs-3g.81.0.0.dylib  .libs/libntfs_3g_la-acls.o .libs/libntfs_3g_la-attrib.o .libs/libntfs_3g_la-attrlist.o .libs/libntfs_3g_la-bitmap.o .libs/libntfs_3g_la-bootsect.o .libs/libntfs_3g_la-cache.o .libs/libntfs_3g_la-collate.o .libs/libntfs_3g_la-compat.o .libs/libntfs_3g_la-compress.o .libs/libntfs_3g_la-debug.o .libs/libntfs_3g_la-device.o .libs/libntfs_3g_la-dir.o .libs/libntfs_3g_la-efs.o .libs/libntfs_3g_la-index.o .libs/libntfs_3g_la-inode.o .libs/libntfs_3g_la-lcnalloc.o .libs/libntfs_3g_la-logfile.o .libs/libntfs_3g_la-logging.o .libs/libntfs_3g_la-mft.o .libs/libntfs_3g_la-misc.o .libs/libntfs_3g_la-mst.o .libs/libntfs_3g_la-object_id.o .libs/libntfs_3g_la-reparse.o .libs/libntfs_3g_la-runlist.o .libs/libntfs_3g_la-security.o .libs/libntfs_3g_la-unistr.o .libs/libntfs_3g_la-volume.o .libs/libntfs_3g_la-xattrs.o .libs/libntfs_3g_la-unix_io.o  -L/opt/local/lib /opt/local/lib/libintl.dylib /opt/local/lib/libiconv.dylib  -arch x86_64 -framework CoreFoundation -arch x86_64 -framework CoreFoundation -install_name  /opt/local/lib/libntfs-3g.81.dylib -compatibility_version 82 -current_version 82.0 -Wl,-single_module
739:info:build dsymutil .libs/libntfs-3g.81.0.0.dylib || :
740:info:build warning: no debug symbols in executable (-arch x86_64)
741:info:build (cd .libs && rm -f libntfs-3g.81.dylib && ln -s libntfs-3g.81.0.0.dylib libntfs-3g.81.dylib)
742:info:build (cd .libs && rm -f libntfs-3g.dylib && ln -s libntfs-3g.81.0.0.dylib libntfs-3g.dylib)
743:info:build ar cru .libs/libntfs-3g.a  libntfs_3g_la-acls.o libntfs_3g_la-attrib.o libntfs_3g_la-attrlist.o libntfs_3g_la-bitmap.o libntfs_3g_la-bootsect.o libntfs_3g_la-cache.o libntfs_3g_la-collate.o libntfs_3g_la-compat.o libntfs_3g_la-compress.o libntfs_3g_la-debug.o libntfs_3g_la-device.o libntfs_3g_la-dir.o libntfs_3g_la-efs.o libntfs_3g_la-index.o libntfs_3g_la-inode.o libntfs_3g_la-lcnalloc.o libntfs_3g_la-logfile.o libntfs_3g_la-logging.o libntfs_3g_la-mft.o libntfs_3g_la-misc.o libntfs_3g_la-mst.o libntfs_3g_la-object_id.o libntfs_3g_la-reparse.o libntfs_3g_la-runlist.o libntfs_3g_la-security.o libntfs_3g_la-unistr.o libntfs_3g_la-volume.o libntfs_3g_la-xattrs.o libntfs_3g_la-unix_io.o
744:info:build /usr/bin/ranlib: file: .libs/libntfs-3g.a(libntfs_3g_la-compat.o) has no symbols
745:info:build /usr/bin/ranlib: file: .libs/libntfs-3g.a(libntfs_3g_la-debug.o) has no symbols
746:info:build ranlib .libs/libntfs-3g.a
747:info:build ranlib: file: .libs/libntfs-3g.a(libntfs_3g_la-compat.o) has no symbols
748:info:build ranlib: file: .libs/libntfs-3g.a(libntfs_3g_la-debug.o) has no symbols
749:info:build creating libntfs-3g.la
750:info:build (cd .libs && rm -f libntfs-3g.la && ln -s ../libntfs-3g.la libntfs-3g.la)
751:info:build make[2]: Leaving directory `/opt/local/var/macports/build/_opt_local_var_macports_sources_rsync.macports.org_release_tarballs_ports_fuse_ntfs-3g/ntfs-3g/work/ntfs-3g_ntfsprogs-2011.4.12/libntfs-3g'
752:info:build Making all in ntfsprogs
753:info:build make[2]: Entering directory `/opt/local/var/macports/build/_opt_local_var_macports_sources_rsync.macports.org_release_tarballs_ports_fuse_ntfs-3g/ntfs-3g/work/ntfs-3g_ntfsprogs-2011.4.12/ntfsprogs'
754:info:build /Developer/usr/bin/llvm-gcc-4.2 -DHAVE_CONFIG_H -I. -I..  -I../include/ntfs-3g  -I/opt/local/include  -pipe -O2 -arch x86_64 -Wall -MT ntfsfix.o -MD -MP -MF .deps/ntfsfix.Tpo -c -o ntfsfix.o ntfsfix.c
755:info:build /Developer/usr/bin/llvm-gcc-4.2 -DHAVE_CONFIG_H -I. -I..  -I../include/ntfs-3g  -I/opt/local/include  -pipe -O2 -arch x86_64 -Wall -MT utils.o -MD -MP -MF .deps/utils.Tpo -c -o utils.o utils.c
756:info:build mv -f .deps/utils.Tpo .deps/utils.Po
757:info:build /Developer/usr/bin/llvm-gcc-4.2 -DHAVE_CONFIG_H -I. -I..  -I../include/ntfs-3g  -I/opt/local/include  -pipe -O2 -arch x86_64 -Wall -MT ntfsinfo.o -MD -MP -MF .deps/ntfsinfo.Tpo -c -o ntfsinfo.o ntfsinfo.c
758:info:build mv -f .deps/ntfsfix.Tpo .deps/ntfsfix.Po
759:info:build /Developer/usr/bin/llvm-gcc-4.2 -DHAVE_CONFIG_H -I. -I..  -I../include/ntfs-3g  -I/opt/local/include  -pipe -O2 -arch x86_64 -Wall -MT ntfscluster.o -MD -MP -MF .deps/ntfscluster.Tpo -c -o ntfscluster.o ntfscluster.c
760:info:build mv -f .deps/ntfscluster.Tpo .deps/ntfscluster.Po
761:info:build /Developer/usr/bin/llvm-gcc-4.2 -DHAVE_CONFIG_H -I. -I..  -I../include/ntfs-3g  -I/opt/local/include  -pipe -O2 -arch x86_64 -Wall -MT cluster.o -MD -MP -MF .deps/cluster.Tpo -c -o cluster.o cluster.c
762:info:build mv -f .deps/cluster.Tpo .deps/cluster.Po
763:info:build /Developer/usr/bin/llvm-gcc-4.2 -DHAVE_CONFIG_H -I. -I..  -I../include/ntfs-3g  -I/opt/local/include  -pipe -O2 -arch x86_64 -Wall -MT ntfsls.o -MD -MP -MF .deps/ntfsls.Tpo -c -o ntfsls.o ntfsls.c
764:info:build In file included from ntfsls.c:52:
765:info:build list.h:43:1: warning: "LIST_HEAD" redefined
766:info:build In file included from /usr/include/sys/ucred.h:81,
767:info:build                  from /usr/include/sys/attr.h:42,
768:info:build                  from /usr/include/sys/mount.h:76,
769:info:build                  from ../include/ntfs-3g/volume.h:40,
770:info:build                  from ../include/ntfs-3g/mft.h:27,
771:info:build                  from ntfsls.c:46:
772:info:build /usr/include/sys/queue.h:373:1: warning: this is the location of the previous definition
773:info:build mv -f .deps/ntfsls.Tpo .deps/ntfsls.Po
774:info:build /Developer/usr/bin/llvm-gcc-4.2 -DHAVE_CONFIG_H -I. -I..  -I../include/ntfs-3g  -I/opt/local/include  -pipe -O2 -arch x86_64 -Wall -MT ntfscat.o -MD -MP -MF .deps/ntfscat.Tpo -c -o ntfscat.o ntfscat.c
775:info:build mv -f .deps/ntfscat.Tpo .deps/ntfscat.Po
776:info:build /Developer/usr/bin/llvm-gcc-4.2 -DHAVE_CONFIG_H -I. -I..  -I../include/ntfs-3g  -I/opt/local/include  -pipe -O2 -arch x86_64 -Wall -MT ntfscmp.o -MD -MP -MF .deps/ntfscmp.Tpo -c -o ntfscmp.o ntfscmp.c
777:info:build mv -f .deps/ntfsinfo.Tpo .deps/ntfsinfo.Po
778:info:build /Developer/usr/bin/llvm-gcc-4.2 -DHAVE_CONFIG_H -I. -I..  -I../include/ntfs-3g   -I/opt/local/include  -pipe -O2 -arch x86_64 -Wall -MT mkntfs-attrdef.o -MD -MP -MF .deps/mkntfs-attrdef.Tpo -c -o mkntfs-attrdef.o `test -f 'attrdef.c' || echo './'`attrdef.c
779:info:build mv -f .deps/mkntfs-attrdef.Tpo .deps/mkntfs-attrdef.Po
780:info:build /Developer/usr/bin/llvm-gcc-4.2 -DHAVE_CONFIG_H -I. -I..  -I../include/ntfs-3g   -I/opt/local/include  -pipe -O2 -arch x86_64 -Wall -MT mkntfs-boot.o -MD -MP -MF .deps/mkntfs-boot.Tpo -c -o mkntfs-boot.o `test -f 'boot.c' || echo './'`boot.c
781:info:build mv -f .deps/mkntfs-boot.Tpo .deps/mkntfs-boot.Po
782:info:build /Developer/usr/bin/llvm-gcc-4.2 -DHAVE_CONFIG_H -I. -I..  -I../include/ntfs-3g   -I/opt/local/include  -pipe -O2 -arch x86_64 -Wall -MT mkntfs-sd.o -MD -MP -MF .deps/mkntfs-sd.Tpo -c -o mkntfs-sd.o `test -f 'sd.c' || echo './'`sd.c
783:info:build mv -f .deps/ntfscmp.Tpo .deps/ntfscmp.Po
784:info:build mv -f .deps/mkntfs-sd.Tpo .deps/mkntfs-sd.Po
785:info:build /Developer/usr/bin/llvm-gcc-4.2 -DHAVE_CONFIG_H -I. -I..  -I../include/ntfs-3g   -I/opt/local/include  -pipe -O2 -arch x86_64 -Wall -MT mkntfs-mkntfs.o -MD -MP -MF .deps/mkntfs-mkntfs.Tpo -c -o mkntfs-mkntfs.o `test -f 'mkntfs.c' || echo './'`mkntfs.c
786:info:build /Developer/usr/bin/llvm-gcc-4.2 -DHAVE_CONFIG_H -I. -I..  -I../include/ntfs-3g   -I/opt/local/include  -pipe -O2 -arch x86_64 -Wall -MT mkntfs-utils.o -MD -MP -MF .deps/mkntfs-utils.Tpo -c -o mkntfs-utils.o `test -f 'utils.c' || echo './'`utils.c
787:info:build mv -f .deps/mkntfs-utils.Tpo .deps/mkntfs-utils.Po
788:info:build /Developer/usr/bin/llvm-gcc-4.2 -DHAVE_CONFIG_H -I. -I..  -I../include/ntfs-3g  -I/opt/local/include  -pipe -O2 -arch x86_64 -Wall -MT ntfslabel.o -MD -MP -MF .deps/ntfslabel.Tpo -c -o ntfslabel.o ntfslabel.c
789:info:build mv -f .deps/ntfslabel.Tpo .deps/ntfslabel.Po
790:info:build /Developer/usr/bin/llvm-gcc-4.2 -DHAVE_CONFIG_H -I. -I..  -I../include/ntfs-3g  -I/opt/local/include  -pipe -O2 -arch x86_64 -Wall -MT ntfsundelete.o -MD -MP -MF .deps/ntfsundelete.Tpo -c -o ntfsundelete.o ntfsundelete.c
791:info:build mv -f .deps/ntfsundelete.Tpo .deps/ntfsundelete.Po
792:info:build /Developer/usr/bin/llvm-gcc-4.2 -DHAVE_CONFIG_H -I. -I..  -I../include/ntfs-3g  -I/opt/local/include  -pipe -O2 -arch x86_64 -Wall -MT ntfsresize.o -MD -MP -MF .deps/ntfsresize.Tpo -c -o ntfsresize.o ntfsresize.c
793:info:build mv -f .deps/mkntfs-mkntfs.Tpo .deps/mkntfs-mkntfs.Po
794:info:build /Developer/usr/bin/llvm-gcc-4.2 -DHAVE_CONFIG_H -I. -I..  -I../include/ntfs-3g  -I/opt/local/include  -pipe -O2 -arch x86_64 -Wall -MT ntfsclone.o -MD -MP -MF .deps/ntfsclone.Tpo -c -o ntfsclone.o ntfsclone.c
795:info:build mv -f .deps/ntfsresize.Tpo .deps/ntfsresize.Po
796:info:build /Developer/usr/bin/llvm-gcc-4.2 -DHAVE_CONFIG_H -I. -I..  -I../include/ntfs-3g  -I/opt/local/include  -pipe -O2 -arch x86_64 -Wall -MT ntfscp.o -MD -MP -MF .deps/ntfscp.Tpo -c -o ntfscp.o ntfscp.c
797:info:build mv -f .deps/ntfsclone.Tpo .deps/ntfsclone.Po
798:info:build /bin/sh ../libtool --tag=CC   --mode=link /Developer/usr/bin/llvm-gcc-4.2  -pipe -O2 -arch x86_64 -Wall  -L/opt/local/lib -framework CoreFoundation -lintl -arch x86_64 -framework CoreFoundation -o ntfsfix ntfsfix.o utils.o ../libntfs-3g/libntfs-3g.la
799:info:build mv -f .deps/ntfscp.Tpo .deps/ntfscp.Po
800:info:build /bin/sh ../libtool --tag=CC   --mode=link /Developer/usr/bin/llvm-gcc-4.2  -pipe -O2 -arch x86_64 -Wall  -L/opt/local/lib -framework CoreFoundation -lintl -arch x86_64 -framework CoreFoundation -o ntfsinfo ntfsinfo.o utils.o ../libntfs-3g/libntfs-3g.la
801:info:build mkdir .libs
802:info:build /Developer/usr/bin/llvm-gcc-4.2 -pipe -O2 -arch x86_64 -Wall -framework CoreFoundation -arch x86_64 -framework CoreFoundation -o .libs/ntfsfix ntfsfix.o utils.o  -L/opt/local/lib ../libntfs-3g/.libs/libntfs-3g.dylib /opt/local/lib/libintl.dylib /opt/local/lib/libiconv.dylib -lc
803:info:build creating ntfsfix
804:info:build /bin/sh ../libtool --tag=CC   --mode=link /Developer/usr/bin/llvm-gcc-4.2  -pipe -O2 -arch x86_64 -Wall  -L/opt/local/lib -framework CoreFoundation -lintl -arch x86_64 -framework CoreFoundation -o ntfscluster ntfscluster.o cluster.o utils.o ../libntfs-3g/libntfs-3g.la
805:info:build /Developer/usr/bin/llvm-gcc-4.2 -pipe -O2 -arch x86_64 -Wall -framework CoreFoundation -arch x86_64 -framework CoreFoundation -o .libs/ntfsinfo ntfsinfo.o utils.o  -L/opt/local/lib ../libntfs-3g/.libs/libntfs-3g.dylib /opt/local/lib/libintl.dylib /opt/local/lib/libiconv.dylib -lc
806:info:build creating ntfsinfo
807:info:build /bin/sh ../libtool --tag=CC   --mode=link /Developer/usr/bin/llvm-gcc-4.2  -pipe -O2 -arch x86_64 -Wall  -L/opt/local/lib -framework CoreFoundation -lintl -arch x86_64 -framework CoreFoundation -o ntfsls ntfsls.o utils.o ../libntfs-3g/libntfs-3g.la
808:info:build /Developer/usr/bin/llvm-gcc-4.2 -pipe -O2 -arch x86_64 -Wall -framework CoreFoundation -arch x86_64 -framework CoreFoundation -o .libs/ntfscluster ntfscluster.o cluster.o utils.o  -L/opt/local/lib ../libntfs-3g/.libs/libntfs-3g.dylib /opt/local/lib/libintl.dylib /opt/local/lib/libiconv.dylib -lc
809:info:build creating ntfscluster
810:info:build /bin/sh ../libtool --tag=CC   --mode=link /Developer/usr/bin/llvm-gcc-4.2  -pipe -O2 -arch x86_64 -Wall  -L/opt/local/lib -framework CoreFoundation -lintl -arch x86_64 -framework CoreFoundation -o ntfscat ntfscat.o utils.o ../libntfs-3g/libntfs-3g.la
811:info:build /Developer/usr/bin/llvm-gcc-4.2 -pipe -O2 -arch x86_64 -Wall -framework CoreFoundation -arch x86_64 -framework CoreFoundation -o .libs/ntfsls ntfsls.o utils.o  -L/opt/local/lib ../libntfs-3g/.libs/libntfs-3g.dylib /opt/local/lib/libintl.dylib /opt/local/lib/libiconv.dylib -lc
812:info:build creating ntfsls
813:info:build /bin/sh ../libtool --tag=CC   --mode=link /Developer/usr/bin/llvm-gcc-4.2  -pipe -O2 -arch x86_64 -Wall  -L/opt/local/lib -framework CoreFoundation -lintl -arch x86_64 -framework CoreFoundation -o ntfscmp ntfscmp.o utils.o ../libntfs-3g/libntfs-3g.la
814:info:build /Developer/usr/bin/llvm-gcc-4.2 -pipe -O2 -arch x86_64 -Wall -framework CoreFoundation -arch x86_64 -framework CoreFoundation -o .libs/ntfscat ntfscat.o utils.o  -L/opt/local/lib ../libntfs-3g/.libs/libntfs-3g.dylib /opt/local/lib/libintl.dylib /opt/local/lib/libiconv.dylib -lc
815:info:build creating ntfscat
816:info:build /bin/sh ../libtool --tag=CC   --mode=link /Developer/usr/bin/llvm-gcc-4.2  -pipe -O2 -arch x86_64 -Wall  -L/opt/local/lib -framework CoreFoundation -lintl -arch x86_64 -framework CoreFoundation -o mkntfs mkntfs-attrdef.o mkntfs-boot.o mkntfs-sd.o mkntfs-mkntfs.o mkntfs-utils.o ../libntfs-3g/libntfs-3g.la -luuid
817:info:build /Developer/usr/bin/llvm-gcc-4.2 -pipe -O2 -arch x86_64 -Wall -framework CoreFoundation -arch x86_64 -framework CoreFoundation -o .libs/ntfscmp ntfscmp.o utils.o  -L/opt/local/lib ../libntfs-3g/.libs/libntfs-3g.dylib /opt/local/lib/libintl.dylib /opt/local/lib/libiconv.dylib -lc
818:info:build creating ntfscmp
819:info:build /bin/sh ../libtool --tag=CC   --mode=link /Developer/usr/bin/llvm-gcc-4.2  -pipe -O2 -arch x86_64 -Wall  -L/opt/local/lib -framework CoreFoundation -lintl -arch x86_64 -framework CoreFoundation -o ntfslabel ntfslabel.o utils.o ../libntfs-3g/libntfs-3g.la
820:info:build /Developer/usr/bin/llvm-gcc-4.2 -pipe -O2 -arch x86_64 -Wall -framework CoreFoundation -arch x86_64 -framework CoreFoundation -o .libs/ntfslabel ntfslabel.o utils.o  -L/opt/local/lib ../libntfs-3g/.libs/libntfs-3g.dylib /opt/local/lib/libintl.dylib /opt/local/lib/libiconv.dylib -lc
821:info:build creating ntfslabel
822:info:build /Developer/usr/bin/llvm-gcc-4.2 -pipe -O2 -arch x86_64 -Wall -framework CoreFoundation -arch x86_64 -framework CoreFoundation -o .libs/mkntfs mkntfs-attrdef.o mkntfs-boot.o mkntfs-sd.o mkntfs-mkntfs.o mkntfs-utils.o  -L/opt/local/lib ../libntfs-3g/.libs/libntfs-3g.dylib /opt/local/lib/libintl.dylib /opt/local/lib/libiconv.dylib -lc /opt/local/lib/libuuid.dylib
823:info:build /bin/sh ../libtool --tag=CC   --mode=link /Developer/usr/bin/llvm-gcc-4.2  -pipe -O2 -arch x86_64 -Wall  -L/opt/local/lib -framework CoreFoundation -lintl -arch x86_64 -framework CoreFoundation -o ntfsundelete ntfsundelete.o utils.o ../libntfs-3g/libntfs-3g.la
824:info:build creating mkntfs
825:info:build /bin/sh ../libtool --tag=CC   --mode=link /Developer/usr/bin/llvm-gcc-4.2  -pipe -O2 -arch x86_64 -Wall  -L/opt/local/lib -framework CoreFoundation -lintl -arch x86_64 -framework CoreFoundation -o ntfsresize ntfsresize.o utils.o ../libntfs-3g/libntfs-3g.la
826:info:build /Developer/usr/bin/llvm-gcc-4.2 -pipe -O2 -arch x86_64 -Wall -framework CoreFoundation -arch x86_64 -framework CoreFoundation -o .libs/ntfsundelete ntfsundelete.o utils.o  -L/opt/local/lib ../libntfs-3g/.libs/libntfs-3g.dylib /opt/local/lib/libintl.dylib /opt/local/lib/libiconv.dylib -lc
827:info:build creating ntfsundelete
828:info:build /Developer/usr/bin/llvm-gcc-4.2 -pipe -O2 -arch x86_64 -Wall -framework CoreFoundation -arch x86_64 -framework CoreFoundation -o .libs/ntfsresize ntfsresize.o utils.o  -L/opt/local/lib ../libntfs-3g/.libs/libntfs-3g.dylib /opt/local/lib/libintl.dylib /opt/local/lib/libiconv.dylib -lc
829:info:build /bin/sh ../libtool --tag=CC   --mode=link /Developer/usr/bin/llvm-gcc-4.2  -pipe -O2 -arch x86_64 -Wall  -L/opt/local/lib -framework CoreFoundation -lintl -arch x86_64 -framework CoreFoundation -o ntfsclone ntfsclone.o utils.o ../libntfs-3g/libntfs-3g.la
830:info:build creating ntfsresize
831:info:build /bin/sh ../libtool --tag=CC   --mode=link /Developer/usr/bin/llvm-gcc-4.2  -pipe -O2 -arch x86_64 -Wall  -L/opt/local/lib -framework CoreFoundation -lintl -arch x86_64 -framework CoreFoundation -o ntfscp ntfscp.o utils.o ../libntfs-3g/libntfs-3g.la
832:info:build /Developer/usr/bin/llvm-gcc-4.2 -pipe -O2 -arch x86_64 -Wall -framework CoreFoundation -arch x86_64 -framework CoreFoundation -o .libs/ntfsclone ntfsclone.o utils.o  -L/opt/local/lib ../libntfs-3g/.libs/libntfs-3g.dylib /opt/local/lib/libintl.dylib /opt/local/lib/libiconv.dylib -lc
833:info:build creating ntfsclone
834:info:build /Developer/usr/bin/llvm-gcc-4.2 -pipe -O2 -arch x86_64 -Wall -framework CoreFoundation -arch x86_64 -framework CoreFoundation -o .libs/ntfscp ntfscp.o utils.o  -L/opt/local/lib ../libntfs-3g/.libs/libntfs-3g.dylib /opt/local/lib/libintl.dylib /opt/local/lib/libiconv.dylib -lc
835:info:build creating ntfscp
836:info:build make[2]: Leaving directory `/opt/local/var/macports/build/_opt_local_var_macports_sources_rsync.macports.org_release_tarballs_ports_fuse_ntfs-3g/ntfs-3g/work/ntfs-3g_ntfsprogs-2011.4.12/ntfsprogs'
837:info:build Making all in src
838:info:build make[2]: Entering directory `/opt/local/var/macports/build/_opt_local_var_macports_sources_rsync.macports.org_release_tarballs_ports_fuse_ntfs-3g/ntfs-3g/work/ntfs-3g_ntfsprogs-2011.4.12/src'
839:info:build /Developer/usr/bin/llvm-gcc-4.2 -DHAVE_CONFIG_H -I. -I..   -I/opt/local/include  -I../include/ntfs-3g -pipe -O2 -arch x86_64 -Wall -MT ntfs_3g_probe-ntfs-3g.probe.o -MD -MP -MF .deps/ntfs_3g_probe-ntfs-3g.probe.Tpo -c -o ntfs_3g_probe-ntfs-3g.probe.o `test -f 'ntfs-3g.probe.c' || echo './'`ntfs-3g.probe.c
840:info:build /Developer/usr/bin/llvm-gcc-4.2 -DHAVE_CONFIG_H -I. -I..   -I/opt/local/include  -I../include/ntfs-3g -pipe -O2 -arch x86_64 -Wall -MT ntfs_3g_usermap-usermap.o -MD -MP -MF .deps/ntfs_3g_usermap-usermap.Tpo -c -o ntfs_3g_usermap-usermap.o `test -f 'usermap.c' || echo './'`usermap.c
841:info:build mv -f .deps/ntfs_3g_probe-ntfs-3g.probe.Tpo .deps/ntfs_3g_probe-ntfs-3g.probe.Po
842:info:build /Developer/usr/bin/llvm-gcc-4.2 -DHAVE_CONFIG_H -I. -I..   -I/opt/local/include  -I../include/ntfs-3g -pipe -O2 -arch x86_64 -Wall -MT ntfs_3g_secaudit-secaudit.o -MD -MP -MF .deps/ntfs_3g_secaudit-secaudit.Tpo -c -o ntfs_3g_secaudit-secaudit.o `test -f 'secaudit.c' || echo './'`secaudit.c
843:info:build mv -f .deps/ntfs_3g_usermap-usermap.Tpo .deps/ntfs_3g_usermap-usermap.Po
844:info:build /Developer/usr/bin/llvm-gcc-4.2 -DHAVE_CONFIG_H -I. -I..   -I/opt/local/include  -DFUSE_USE_VERSION=26 -D__FreeBSD__=10 -D_FILE_OFFSET_BITS=64 -I/usr/local/include/fuse   -I../include/ntfs-3g -pipe -O2 -arch x86_64 -Wall -MT ntfs_3g-ntfs-3g.o -MD -MP -MF .deps/ntfs_3g-ntfs-3g.Tpo -c -o ntfs_3g-ntfs-3g.o `test -f 'ntfs-3g.c' || echo './'`ntfs-3g.c
845:info:build ntfs-3g.c:3274: warning: initialization from incompatible pointer type
846:info:build ntfs-3g.c:3275: warning: initialization from incompatible pointer type
847:info:build ntfs-3g.c: In function ‘setup_logging’:
848:info:build ntfs-3g.c:3577: warning: ‘daemon’ is deprecated (declared at /usr/include/stdlib.h:292)
849:info:build mv -f .deps/ntfs_3g-ntfs-3g.Tpo .deps/ntfs_3g-ntfs-3g.Po
850:info:build /Developer/usr/bin/llvm-gcc-4.2 -DHAVE_CONFIG_H -I. -I..   -I/opt/local/include  -DFUSE_USE_VERSION=26 -D__FreeBSD__=10 -D_FILE_OFFSET_BITS=64 -I/usr/local/include/fuse   -I../include/ntfs-3g -pipe -O2 -arch x86_64 -Wall -MT ntfs_3g-ntfs-3g_common.o -MD -MP -MF .deps/ntfs_3g-ntfs-3g_common.Tpo -c -o ntfs_3g-ntfs-3g_common.o `test -f 'ntfs-3g_common.c' || echo './'`ntfs-3g_common.c
851:info:build mv -f .deps/ntfs_3g-ntfs-3g_common.Tpo .deps/ntfs_3g-ntfs-3g_common.Po
852:info:build /Developer/usr/bin/llvm-gcc-4.2 -DHAVE_CONFIG_H -I. -I..   -I/opt/local/include  -DFUSE_USE_VERSION=26 -D__FreeBSD__=10 -D_FILE_OFFSET_BITS=64 -I/usr/local/include/fuse   -I../include/ntfs-3g -pipe -O2 -arch x86_64 -Wall -MT lowntfs_3g-lowntfs-3g.o -MD -MP -MF .deps/lowntfs_3g-lowntfs-3g.Tpo -c -o lowntfs_3g-lowntfs-3g.o `test -f 'lowntfs-3g.c' || echo './'`lowntfs-3g.c
853:info:build mv -f .deps/ntfs_3g_secaudit-secaudit.Tpo .deps/ntfs_3g_secaudit-secaudit.Po
854:info:build /Developer/usr/bin/llvm-gcc-4.2 -DHAVE_CONFIG_H -I. -I..   -I/opt/local/include  -DFUSE_USE_VERSION=26 -D__FreeBSD__=10 -D_FILE_OFFSET_BITS=64 -I/usr/local/include/fuse   -I../include/ntfs-3g -pipe -O2 -arch x86_64 -Wall -MT lowntfs_3g-ntfs-3g_common.o -MD -MP -MF .deps/lowntfs_3g-ntfs-3g_common.Tpo -c -o lowntfs_3g-ntfs-3g_common.o `test -f 'ntfs-3g_common.c' || echo './'`ntfs-3g_common.c
855:info:build lowntfs-3g.c: In function ‘ntfs_fuse_fill_security_context’:
856:info:build lowntfs-3g.c:300: error: ‘const struct fuse_ctx’ has no member named ‘umask’
857:info:build lowntfs-3g.c: In function ‘ntfs_fuse_setxattr’:
858:info:build lowntfs-3g.c:2975: warning: implicit declaration of function ‘fuse_lowlevel_notify_inval_inode’
859:info:build lowntfs-3g.c: At top level:
860:info:build lowntfs-3g.c:3355: warning: initialization from incompatible pointer type
861:info:build lowntfs-3g.c:3356: warning: initialization from incompatible pointer type
862:info:build lowntfs-3g.c: In function ‘setup_logging’:
863:info:build lowntfs-3g.c:3657: warning: ‘daemon’ is deprecated (declared at /usr/include/stdlib.h:292)
864:info:build make[2]: *** [lowntfs_3g-lowntfs-3g.o] Error 1
865:info:build make[2]: *** Waiting for unfinished jobs....
866:info:build mv -f .deps/lowntfs_3g-ntfs-3g_common.Tpo .deps/lowntfs_3g-ntfs-3g_common.Po
867:info:build make[2]: Leaving directory `/opt/local/var/macports/build/_opt_local_var_macports_sources_rsync.macports.org_release_tarballs_ports_fuse_ntfs-3g/ntfs-3g/work/ntfs-3g_ntfsprogs-2011.4.12/src'
868:info:build make[1]: *** [all-recursive] Error 1
869:info:build make[1]: Leaving directory `/opt/local/var/macports/build/_opt_local_var_macports_sources_rsync.macports.org_release_tarballs_ports_fuse_ntfs-3g/ntfs-3g/work/ntfs-3g_ntfsprogs-2011.4.12'
870:info:build make: *** [all] Error 2
871:info:build make: Leaving directory `/opt/local/var/macports/build/_opt_local_var_macports_sources_rsync.macports.org_release_tarballs_ports_fuse_ntfs-3g/ntfs-3g/work/ntfs-3g_ntfsprogs-2011.4.12'
872:info:build shell command " cd "/opt/local/var/macports/build/_opt_local_var_macports_sources_rsync.macports.org_release_tarballs_ports_fuse_ntfs-3g/ntfs-3g/work/ntfs-3g_ntfsprogs-2011.4.12" && /usr/bin/make -j2 -w all " returned error 2
873:error:build Target org.macports.build returned: shell command failed (see log for details)
874:debug:build Backtrace: shell command failed (see log for details)
875    while executing
876"command_exec build"
877    (procedure "portbuild::build_main" line 8)
878    invoked from within
879"$procedure $targetname"
880:info:build Warning: the following items did not execute (for ntfs-3g): org.macports.activate org.macports.build org.macports.destroot org.macports.install
881:notice:build Log for ntfs-3g is at: /opt/local/var/macports/logs/_opt_local_var_macports_sources_rsync.macports.org_release_tarballs_ports_fuse_ntfs-3g/ntfs-3g/main.log