Ticket #32164: main.log

File main.log, 143.8 KB (added by rudloff@…, 9 years ago)
Line 
1version:1
2:debug:main epoch: in tree: 0 installed: 0
3:debug:main zlib 1.2.5_0 exists in the ports tree
4:debug:main zlib 1.2.5_0  is the latest installed
5:debug:main zlib 1.2.5_0  is active
6:debug:main Merging existing variants '' into variants
7:debug:main new fully merged portvariants: quartz +
8:debug:main Changing to port directory: /opt/local/var/macports/sources/rsync.macports.org/release/tarballs/ports/archivers/zlib
9:debug:main OS darwin/8.11.1 (Mac OS X 10.4) arch i386
10:debug:main org.macports.load registered provides 'load', a pre-existing procedure. Target override will not be provided
11:debug:main org.macports.distfiles registered provides 'distfiles', a pre-existing procedure. Target override will not be provided
12:debug:main Using group file /opt/local/var/macports/sources/rsync.macports.org/release/tarballs/ports/_resources/port1.0/group/xcodeversion-1.0.tcl
13:debug:main adding the default universal variant
14:debug:main Reading variant descriptions from /opt/local/var/macports/sources/rsync.macports.org/release/tarballs/ports/_resources/port1.0/variant_descriptions.conf
15:debug:main Requested variant quartz is not provided by port zlib.
16:debug:main No need to upgrade! zlib 1.2.5_0 >= zlib 1.2.5_0
17:debug:main epoch: in tree: 0 installed: 0
18:debug:main libpng 1.4.8_0 exists in the ports tree
19:debug:main libpng 1.4.8_0  is the latest installed
20:debug:main libpng 1.4.8_0  is active
21:debug:main Merging existing variants '' into variants
22:debug:main new fully merged portvariants: quartz +
23:debug:main Changing to port directory: /opt/local/var/macports/sources/rsync.macports.org/release/tarballs/ports/graphics/libpng
24:debug:main OS darwin/8.11.1 (Mac OS X 10.4) arch i386
25:debug:main org.macports.load registered provides 'load', a pre-existing procedure. Target override will not be provided
26:debug:main org.macports.distfiles registered provides 'distfiles', a pre-existing procedure. Target override will not be provided
27:debug:main Using group file /opt/local/var/macports/sources/rsync.macports.org/release/tarballs/ports/_resources/port1.0/group/archcheck-1.0.tcl
28:debug:main adding the default universal variant
29:debug:main Reading variant descriptions from /opt/local/var/macports/sources/rsync.macports.org/release/tarballs/ports/_resources/port1.0/variant_descriptions.conf
30:debug:main Requested variant quartz is not provided by port libpng.
31:debug:main No need to upgrade! libpng 1.4.8_0 >= libpng 1.4.8_0
32:debug:main epoch: in tree: 0 installed: 0
33:debug:main fribidi 0.10.9_0 exists in the ports tree
34:debug:main fribidi 0.10.9_0  is the latest installed
35:debug:main fribidi 0.10.9_0  is active
36:debug:main Merging existing variants '' into variants
37:debug:main new fully merged portvariants: quartz +
38:debug:main Changing to port directory: /opt/local/var/macports/sources/rsync.macports.org/release/tarballs/ports/textproc/fribidi
39:debug:main OS darwin/8.11.1 (Mac OS X 10.4) arch i386
40:debug:main org.macports.load registered provides 'load', a pre-existing procedure. Target override will not be provided
41:debug:main org.macports.distfiles registered provides 'distfiles', a pre-existing procedure. Target override will not be provided
42:debug:main adding the default universal variant
43:debug:main Reading variant descriptions from /opt/local/var/macports/sources/rsync.macports.org/release/tarballs/ports/_resources/port1.0/variant_descriptions.conf
44:debug:main Requested variant quartz is not provided by port fribidi.
45:debug:main No need to upgrade! fribidi 0.10.9_0 >= fribidi 0.10.9_0
46:debug:main epoch: in tree: 0 installed: 0
47:debug:main fontconfig 2.8.0_0 exists in the ports tree
48:debug:main fontconfig 2.8.0_0  is the latest installed
49:debug:main fontconfig 2.8.0_0  is active
50:debug:main Merging existing variants '' into variants
51:debug:main new fully merged portvariants: quartz +
52:debug:main Changing to port directory: /opt/local/var/macports/sources/rsync.macports.org/release/tarballs/ports/graphics/fontconfig
53:debug:main OS darwin/8.11.1 (Mac OS X 10.4) arch i386
54:debug:main org.macports.load registered provides 'load', a pre-existing procedure. Target override will not be provided
55:debug:main org.macports.distfiles registered provides 'distfiles', a pre-existing procedure. Target override will not be provided
56:debug:main Using group file /opt/local/var/macports/sources/rsync.macports.org/release/tarballs/ports/_resources/port1.0/group/muniversal-1.0.tcl
57:debug:main Reading variant descriptions from /opt/local/var/macports/sources/rsync.macports.org/release/tarballs/ports/_resources/port1.0/variant_descriptions.conf
58:debug:main Using group file /opt/local/var/macports/sources/rsync.macports.org/release/tarballs/ports/_resources/port1.0/group/archcheck-1.0.tcl
59:debug:main universal variant already exists, so not adding the default one
60:debug:main Requested variant quartz is not provided by port fontconfig.
61:debug:main No need to upgrade! fontconfig 2.8.0_0 >= fontconfig 2.8.0_0
62:debug:main epoch: in tree: 0 installed: 0
63:debug:main libiconv 1.14_0 exists in the ports tree
64:debug:main libiconv 1.14_0  is the latest installed
65:debug:main libiconv 1.14_0  is active
66:debug:main Merging existing variants '' into variants
67:debug:main new fully merged portvariants: quartz +
68:debug:main Changing to port directory: /opt/local/var/macports/sources/rsync.macports.org/release/tarballs/ports/textproc/libiconv
69:debug:main OS darwin/8.11.1 (Mac OS X 10.4) arch i386
70:debug:main org.macports.load registered provides 'load', a pre-existing procedure. Target override will not be provided
71:debug:main org.macports.distfiles registered provides 'distfiles', a pre-existing procedure. Target override will not be provided
72:debug:main Using group file /opt/local/var/macports/sources/rsync.macports.org/release/tarballs/ports/_resources/port1.0/group/muniversal-1.0.tcl
73:debug:main Reading variant descriptions from /opt/local/var/macports/sources/rsync.macports.org/release/tarballs/ports/_resources/port1.0/variant_descriptions.conf
74:debug:main universal variant already exists, so not adding the default one
75:debug:main Requested variant quartz is not provided by port libiconv.
76:debug:main No need to upgrade! libiconv 1.14_0 >= libiconv 1.14_0
77:debug:main epoch: in tree: 0 installed: 0
78:debug:main expat 2.0.1_1 exists in the ports tree
79:debug:main expat 2.0.1_1  is the latest installed
80:debug:main expat 2.0.1_1  is active
81:debug:main Merging existing variants '' into variants
82:debug:main new fully merged portvariants: quartz +
83:debug:main Changing to port directory: /opt/local/var/macports/sources/rsync.macports.org/release/tarballs/ports/textproc/expat
84:debug:main OS darwin/8.11.1 (Mac OS X 10.4) arch i386
85:debug:main org.macports.load registered provides 'load', a pre-existing procedure. Target override will not be provided
86:debug:main org.macports.distfiles registered provides 'distfiles', a pre-existing procedure. Target override will not be provided
87:debug:main adding the default universal variant
88:debug:main Reading variant descriptions from /opt/local/var/macports/sources/rsync.macports.org/release/tarballs/ports/_resources/port1.0/variant_descriptions.conf
89:debug:main Requested variant quartz is not provided by port expat.
90:debug:main No need to upgrade! expat 2.0.1_1 >= expat 2.0.1_1
91:debug:main epoch: in tree: 0 installed: 0
92:debug:main freetype 2.4.8_0 exists in the ports tree
93:debug:main freetype 2.4.8_0  is the latest installed
94:debug:main freetype 2.4.8_0  is active
95:debug:main Merging existing variants '' into variants
96:debug:main new fully merged portvariants: quartz +
97:debug:main Changing to port directory: /opt/local/var/macports/sources/rsync.macports.org/release/tarballs/ports/print/freetype
98:debug:main OS darwin/8.11.1 (Mac OS X 10.4) arch i386
99:debug:main org.macports.load registered provides 'load', a pre-existing procedure. Target override will not be provided
100:debug:main org.macports.distfiles registered provides 'distfiles', a pre-existing procedure. Target override will not be provided
101:debug:main Using group file /opt/local/var/macports/sources/rsync.macports.org/release/tarballs/ports/_resources/port1.0/group/muniversal-1.0.tcl
102:debug:main Reading variant descriptions from /opt/local/var/macports/sources/rsync.macports.org/release/tarballs/ports/_resources/port1.0/variant_descriptions.conf
103:debug:main Using group file /opt/local/var/macports/sources/rsync.macports.org/release/tarballs/ports/_resources/port1.0/group/archcheck-1.0.tcl
104:debug:main universal variant already exists, so not adding the default one
105:debug:main Requested variant quartz is not provided by port freetype.
106:debug:main No need to upgrade! freetype 2.4.8_0 >= freetype 2.4.8_0
107:debug:main epoch: in tree: 0 installed: 0
108:debug:main bzip2 1.0.6_0 exists in the ports tree
109:debug:main bzip2 1.0.6_0  is the latest installed
110:debug:main bzip2 1.0.6_0  is active
111:debug:main Merging existing variants '' into variants
112:debug:main new fully merged portvariants: quartz +
113:debug:main Changing to port directory: /opt/local/var/macports/sources/rsync.macports.org/release/tarballs/ports/archivers/bzip2
114:debug:main OS darwin/8.11.1 (Mac OS X 10.4) arch i386
115:debug:main org.macports.load registered provides 'load', a pre-existing procedure. Target override will not be provided
116:debug:main org.macports.distfiles registered provides 'distfiles', a pre-existing procedure. Target override will not be provided
117:debug:main Reading variant descriptions from /opt/local/var/macports/sources/rsync.macports.org/release/tarballs/ports/_resources/port1.0/variant_descriptions.conf
118:debug:main universal variant already exists, so not adding the default one
119:debug:main Requested variant quartz is not provided by port bzip2.
120:debug:main No need to upgrade! bzip2 1.0.6_0 >= bzip2 1.0.6_0
121:debug:main epoch: in tree: 0 installed: 0
122:debug:main ImageMagick 6.7.3-1_0 exists in the ports tree
123:debug:main ImageMagick 6.7.3-1_0 +q16 is the latest installed
124:debug:main ImageMagick 6.7.3-1_0 +q16 is active
125:debug:main Merging existing variants '+q16' into variants
126:debug:main new fully merged portvariants: q16 + quartz +
127:debug:main Changing to port directory: /opt/local/var/macports/sources/rsync.macports.org/release/tarballs/ports/graphics/ImageMagick
128:debug:main OS darwin/8.11.1 (Mac OS X 10.4) arch i386
129:debug:main org.macports.load registered provides 'load', a pre-existing procedure. Target override will not be provided
130:debug:main org.macports.distfiles registered provides 'distfiles', a pre-existing procedure. Target override will not be provided
131:debug:main Using group file /opt/local/var/macports/sources/rsync.macports.org/release/tarballs/ports/_resources/port1.0/group/archcheck-1.0.tcl
132:debug:main Reading variant descriptions from /opt/local/var/macports/sources/rsync.macports.org/release/tarballs/ports/_resources/port1.0/variant_descriptions.conf
133:debug:main adding the default universal variant
134:debug:main Requested variant quartz is not provided by port ImageMagick.
135:debug:main Executing variant q16 provides q16
136:debug:main No need to upgrade! ImageMagick 6.7.3-1_0 >= ImageMagick 6.7.3-1_0
137:debug:main epoch: in tree: 0 installed: 0
138:debug:main xorg-libXext 1.3.0_0 exists in the ports tree
139:debug:main xorg-libXext 1.3.0_0  is the latest installed
140:debug:main xorg-libXext 1.3.0_0  is active
141:debug:main Merging existing variants '' into variants
142:debug:main new fully merged portvariants: quartz +
143:debug:main Changing to port directory: /opt/local/var/macports/sources/rsync.macports.org/release/tarballs/ports/x11/xorg-libXext
144:debug:main OS darwin/8.11.1 (Mac OS X 10.4) arch i386
145:debug:main org.macports.load registered provides 'load', a pre-existing procedure. Target override will not be provided
146:debug:main org.macports.distfiles registered provides 'distfiles', a pre-existing procedure. Target override will not be provided
147:debug:main adding the default universal variant
148:debug:main Reading variant descriptions from /opt/local/var/macports/sources/rsync.macports.org/release/tarballs/ports/_resources/port1.0/variant_descriptions.conf
149:debug:main Requested variant quartz is not provided by port xorg-libXext.
150:debug:main No need to upgrade! xorg-libXext 1.3.0_0 >= xorg-libXext 1.3.0_0
151:debug:main epoch: in tree: 0 installed: 0
152:debug:main xorg-libX11 1.4.4_0 exists in the ports tree
153:debug:main xorg-libX11 1.4.4_0  is the latest installed
154:debug:main xorg-libX11 1.4.4_0  is active
155:debug:main Merging existing variants '' into variants
156:debug:main new fully merged portvariants: quartz +
157:debug:main Changing to port directory: /opt/local/var/macports/sources/rsync.macports.org/release/tarballs/ports/x11/xorg-libX11
158:debug:main OS darwin/8.11.1 (Mac OS X 10.4) arch i386
159:debug:main org.macports.load registered provides 'load', a pre-existing procedure. Target override will not be provided
160:debug:main org.macports.distfiles registered provides 'distfiles', a pre-existing procedure. Target override will not be provided
161:debug:main adding the default universal variant
162:debug:main Reading variant descriptions from /opt/local/var/macports/sources/rsync.macports.org/release/tarballs/ports/_resources/port1.0/variant_descriptions.conf
163:debug:main Requested variant quartz is not provided by port xorg-libX11.
164:debug:main No need to upgrade! xorg-libX11 1.4.4_0 >= xorg-libX11 1.4.4_0
165:debug:main epoch: in tree: 0 installed: 0
166:debug:main xorg-libXdmcp 1.1.0_0 exists in the ports tree
167:debug:main xorg-libXdmcp 1.1.0_0  is the latest installed
168:debug:main xorg-libXdmcp 1.1.0_0  is active
169:debug:main Merging existing variants '' into variants
170:debug:main new fully merged portvariants: quartz +
171:debug:main Changing to port directory: /opt/local/var/macports/sources/rsync.macports.org/release/tarballs/ports/x11/xorg-libXdmcp
172:debug:main OS darwin/8.11.1 (Mac OS X 10.4) arch i386
173:debug:main org.macports.load registered provides 'load', a pre-existing procedure. Target override will not be provided
174:debug:main org.macports.distfiles registered provides 'distfiles', a pre-existing procedure. Target override will not be provided
175:debug:main adding the default universal variant
176:debug:main Reading variant descriptions from /opt/local/var/macports/sources/rsync.macports.org/release/tarballs/ports/_resources/port1.0/variant_descriptions.conf
177:debug:main Requested variant quartz is not provided by port xorg-libXdmcp.
178:debug:main No need to upgrade! xorg-libXdmcp 1.1.0_0 >= xorg-libXdmcp 1.1.0_0
179:debug:main epoch: in tree: 0 installed: 0
180:debug:main xorg-libXau 1.0.6_0 exists in the ports tree
181:debug:main xorg-libXau 1.0.6_0  is the latest installed
182:debug:main xorg-libXau 1.0.6_0  is active
183:debug:main Merging existing variants '' into variants
184:debug:main new fully merged portvariants: quartz +
185:debug:main Changing to port directory: /opt/local/var/macports/sources/rsync.macports.org/release/tarballs/ports/x11/xorg-libXau
186:debug:main OS darwin/8.11.1 (Mac OS X 10.4) arch i386
187:debug:main org.macports.load registered provides 'load', a pre-existing procedure. Target override will not be provided
188:debug:main org.macports.distfiles registered provides 'distfiles', a pre-existing procedure. Target override will not be provided
189:debug:main adding the default universal variant
190:debug:main Reading variant descriptions from /opt/local/var/macports/sources/rsync.macports.org/release/tarballs/ports/_resources/port1.0/variant_descriptions.conf
191:debug:main Requested variant quartz is not provided by port xorg-libXau.
192:debug:main No need to upgrade! xorg-libXau 1.0.6_0 >= xorg-libXau 1.0.6_0
193:debug:main epoch: in tree: 0 installed: 0
194:debug:main xorg-xproto 7.0.22_0 exists in the ports tree
195:debug:main xorg-xproto 7.0.22_0  is the latest installed
196:debug:main xorg-xproto 7.0.22_0  is active
197:debug:main Merging existing variants '' into variants
198:debug:main new fully merged portvariants: quartz +
199:debug:main Changing to port directory: /opt/local/var/macports/sources/rsync.macports.org/release/tarballs/ports/x11/xorg-xproto
200:debug:main OS darwin/8.11.1 (Mac OS X 10.4) arch i386
201:debug:main org.macports.load registered provides 'load', a pre-existing procedure. Target override will not be provided
202:debug:main org.macports.distfiles registered provides 'distfiles', a pre-existing procedure. Target override will not be provided
203:debug:main only one arch supported, so not adding the default universal variant
204:debug:main Requested variant quartz is not provided by port xorg-xproto.
205:debug:main No need to upgrade! xorg-xproto 7.0.22_0 >= xorg-xproto 7.0.22_0
206:debug:main epoch: in tree: 0 installed: 0
207:debug:main xorg-libxcb 1.7_0 exists in the ports tree
208:debug:main xorg-libxcb 1.7_0 +python27 is the latest installed
209:debug:main xorg-libxcb 1.7_0 +python27 is active
210:debug:main Merging existing variants '+python27' into variants
211:debug:main new fully merged portvariants: quartz + python27 +
212:debug:main Changing to port directory: /opt/local/var/macports/sources/rsync.macports.org/release/tarballs/ports/x11/xorg-libxcb
213:debug:main OS darwin/8.11.1 (Mac OS X 10.4) arch i386
214:debug:main org.macports.load registered provides 'load', a pre-existing procedure. Target override will not be provided
215:debug:main org.macports.distfiles registered provides 'distfiles', a pre-existing procedure. Target override will not be provided
216:debug:main adding the default universal variant
217:debug:main Reading variant descriptions from /opt/local/var/macports/sources/rsync.macports.org/release/tarballs/ports/_resources/port1.0/variant_descriptions.conf
218:debug:main Requested variant quartz is not provided by port xorg-libxcb.
219:debug:main Executing variant python27 provides python27
220:debug:main No need to upgrade! xorg-libxcb 1.7_0 >= xorg-libxcb 1.7_0
221:debug:main epoch: in tree: 0 installed: 0
222:debug:main xorg-xcb-proto 1.6_0 exists in the ports tree
223:debug:main xorg-xcb-proto 1.6_0 +python27 is the latest installed
224:debug:main xorg-xcb-proto 1.6_0 +python27 is active
225:debug:main Merging existing variants '+python27' into variants
226:debug:main new fully merged portvariants: quartz + python27 +
227:debug:main Changing to port directory: /opt/local/var/macports/sources/rsync.macports.org/release/tarballs/ports/x11/xorg-xcb-proto
228:debug:main OS darwin/8.11.1 (Mac OS X 10.4) arch i386
229:debug:main org.macports.load registered provides 'load', a pre-existing procedure. Target override will not be provided
230:debug:main org.macports.distfiles registered provides 'distfiles', a pre-existing procedure. Target override will not be provided
231:debug:main only one arch supported, so not adding the default universal variant
232:debug:main Requested variant quartz is not provided by port xorg-xcb-proto.
233:debug:main Executing variant python27 provides python27
234:debug:main No need to upgrade! xorg-xcb-proto 1.6_0 >= xorg-xcb-proto 1.6_0
235:debug:main epoch: in tree: 0 installed: 0
236:debug:main libxml2 2.7.8_0 exists in the ports tree
237:debug:main libxml2 2.7.8_0  is the latest installed
238:debug:main libxml2 2.7.8_0  is active
239:debug:main Merging existing variants '' into variants
240:debug:main new fully merged portvariants: quartz +
241:debug:main Changing to port directory: /opt/local/var/macports/sources/rsync.macports.org/release/tarballs/ports/textproc/libxml2
242:debug:main OS darwin/8.11.1 (Mac OS X 10.4) arch i386
243:debug:main org.macports.load registered provides 'load', a pre-existing procedure. Target override will not be provided
244:debug:main org.macports.distfiles registered provides 'distfiles', a pre-existing procedure. Target override will not be provided
245:debug:main Using group file /opt/local/var/macports/sources/rsync.macports.org/release/tarballs/ports/_resources/port1.0/group/archcheck-1.0.tcl
246:debug:main adding the default universal variant
247:debug:main Reading variant descriptions from /opt/local/var/macports/sources/rsync.macports.org/release/tarballs/ports/_resources/port1.0/variant_descriptions.conf
248:debug:main Requested variant quartz is not provided by port libxml2.
249:debug:main No need to upgrade! libxml2 2.7.8_0 >= libxml2 2.7.8_0
250:debug:main epoch: in tree: 2 installed: 2
251:debug:main python27 2.7.2_2 exists in the ports tree
252:debug:main python27 2.7.2_2  is the latest installed
253:debug:main python27 2.7.2_2  is active
254:debug:main Merging existing variants '' into variants
255:debug:main new fully merged portvariants: quartz +
256:debug:main Changing to port directory: /opt/local/var/macports/sources/rsync.macports.org/release/tarballs/ports/lang/python27
257:debug:main OS darwin/8.11.1 (Mac OS X 10.4) arch i386
258:debug:main org.macports.load registered provides 'load', a pre-existing procedure. Target override will not be provided
259:debug:main org.macports.distfiles registered provides 'distfiles', a pre-existing procedure. Target override will not be provided
260:debug:main Using group file /opt/local/var/macports/sources/rsync.macports.org/release/tarballs/ports/_resources/port1.0/group/select-1.0.tcl
261:debug:main Reading variant descriptions from /opt/local/var/macports/sources/rsync.macports.org/release/tarballs/ports/_resources/port1.0/variant_descriptions.conf
262:debug:main universal variant already exists, so not adding the default one
263:debug:main Requested variant quartz is not provided by port python27.
264:debug:main No need to upgrade! python27 2.7.2_2 >= python27 2.7.2_2
265:debug:main epoch: in tree: 0 installed: 0
266:debug:main gettext 0.18.1.1_2 exists in the ports tree
267:debug:main gettext 0.18.1.1_2  is the latest installed
268:debug:main gettext 0.18.1.1_2  is active
269:debug:main Merging existing variants '' into variants
270:debug:main new fully merged portvariants: quartz +
271:debug:main Changing to port directory: /opt/local/var/macports/sources/rsync.macports.org/release/tarballs/ports/devel/gettext
272:debug:main OS darwin/8.11.1 (Mac OS X 10.4) arch i386
273:debug:main org.macports.load registered provides 'load', a pre-existing procedure. Target override will not be provided
274:debug:main org.macports.distfiles registered provides 'distfiles', a pre-existing procedure. Target override will not be provided
275:debug:main Using group file /opt/local/var/macports/sources/rsync.macports.org/release/tarballs/ports/_resources/port1.0/group/muniversal-1.0.tcl
276:debug:main Reading variant descriptions from /opt/local/var/macports/sources/rsync.macports.org/release/tarballs/ports/_resources/port1.0/variant_descriptions.conf
277:debug:main Using group file /opt/local/var/macports/sources/rsync.macports.org/release/tarballs/ports/_resources/port1.0/group/archcheck-1.0.tcl
278:debug:main universal variant already exists, so not adding the default one
279:debug:main Requested variant quartz is not provided by port gettext.
280:debug:main No need to upgrade! gettext 0.18.1.1_2 >= gettext 0.18.1.1_2
281:debug:main epoch: in tree: 0 installed: 0
282:debug:main ncurses 5.9_1 exists in the ports tree
283:debug:main ncurses 5.9_1  is the latest installed
284:debug:main ncurses 5.9_1  is active
285:debug:main Merging existing variants '' into variants
286:debug:main new fully merged portvariants: quartz +
287:debug:main Changing to port directory: /opt/local/var/macports/sources/rsync.macports.org/release/tarballs/ports/devel/ncurses
288:debug:main OS darwin/8.11.1 (Mac OS X 10.4) arch i386
289:debug:main org.macports.load registered provides 'load', a pre-existing procedure. Target override will not be provided
290:debug:main org.macports.distfiles registered provides 'distfiles', a pre-existing procedure. Target override will not be provided
291:debug:main adding the default universal variant
292:debug:main Reading variant descriptions from /opt/local/var/macports/sources/rsync.macports.org/release/tarballs/ports/_resources/port1.0/variant_descriptions.conf
293:debug:main Requested variant quartz is not provided by port ncurses.
294:debug:main No need to upgrade! ncurses 5.9_1 >= ncurses 5.9_1
295:debug:main epoch: in tree: 1 installed: 1
296:debug:main openssl 1.0.0e_1 exists in the ports tree
297:debug:main openssl 1.0.0e_1  is the latest installed
298:debug:main openssl 1.0.0e_1  is active
299:debug:main Merging existing variants '' into variants
300:debug:main new fully merged portvariants: quartz +
301:debug:main Changing to port directory: /opt/local/var/macports/sources/rsync.macports.org/release/tarballs/ports/devel/openssl
302:debug:main OS darwin/8.11.1 (Mac OS X 10.4) arch i386
303:debug:main org.macports.load registered provides 'load', a pre-existing procedure. Target override will not be provided
304:debug:main org.macports.distfiles registered provides 'distfiles', a pre-existing procedure. Target override will not be provided
305:debug:main Using group file /opt/local/var/macports/sources/rsync.macports.org/release/tarballs/ports/_resources/port1.0/group/muniversal-1.0.tcl
306:debug:main Reading variant descriptions from /opt/local/var/macports/sources/rsync.macports.org/release/tarballs/ports/_resources/port1.0/variant_descriptions.conf
307:debug:main universal variant already exists, so not adding the default one
308:debug:main Requested variant quartz is not provided by port openssl.
309:debug:main No need to upgrade! openssl 1.0.0e_1 >= openssl 1.0.0e_1
310:debug:main epoch: in tree: 0 installed: 0
311:debug:main sqlite3 3.7.9_0 exists in the ports tree
312:debug:main sqlite3 3.7.9_0  is the latest installed
313:debug:main sqlite3 3.7.9_0  is active
314:debug:main Merging existing variants '' into variants
315:debug:main new fully merged portvariants: quartz +
316:debug:main Changing to port directory: /opt/local/var/macports/sources/rsync.macports.org/release/tarballs/ports/databases/sqlite3
317:debug:main OS darwin/8.11.1 (Mac OS X 10.4) arch i386
318:debug:main org.macports.load registered provides 'load', a pre-existing procedure. Target override will not be provided
319:debug:main org.macports.distfiles registered provides 'distfiles', a pre-existing procedure. Target override will not be provided
320:debug:main adding the default universal variant
321:debug:main Reading variant descriptions from /opt/local/var/macports/sources/rsync.macports.org/release/tarballs/ports/_resources/port1.0/variant_descriptions.conf
322:debug:main Requested variant quartz is not provided by port sqlite3.
323:debug:main No need to upgrade! sqlite3 3.7.9_0 >= sqlite3 3.7.9_0
324:debug:main epoch: in tree: 20090923 installed: 20090923
325:debug:main libedit 20110802-3.0_0 exists in the ports tree
326:debug:main libedit 20110802-3.0_0  is the latest installed
327:debug:main libedit 20110802-3.0_0  is active
328:debug:main Merging existing variants '' into variants
329:debug:main new fully merged portvariants: quartz +
330:debug:main Changing to port directory: /opt/local/var/macports/sources/rsync.macports.org/release/tarballs/ports/devel/libedit
331:debug:main OS darwin/8.11.1 (Mac OS X 10.4) arch i386
332:debug:main org.macports.load registered provides 'load', a pre-existing procedure. Target override will not be provided
333:debug:main org.macports.distfiles registered provides 'distfiles', a pre-existing procedure. Target override will not be provided
334:debug:main Using group file /opt/local/var/macports/sources/rsync.macports.org/release/tarballs/ports/_resources/port1.0/group/muniversal-1.0.tcl
335:debug:main Reading variant descriptions from /opt/local/var/macports/sources/rsync.macports.org/release/tarballs/ports/_resources/port1.0/variant_descriptions.conf
336:debug:main universal variant already exists, so not adding the default one
337:debug:main Requested variant quartz is not provided by port libedit.
338:debug:main No need to upgrade! libedit 20110802-3.0_0 >= libedit 20110802-3.0_0
339:debug:main epoch: in tree: 0 installed: 0
340:debug:main db46 4.6.21_6 exists in the ports tree
341:debug:main db46 4.6.21_6 +java is the latest installed
342:debug:main db46 4.6.21_6 +java is active
343:debug:main Merging existing variants '+java' into variants
344:debug:main new fully merged portvariants: java + quartz +
345:debug:main Changing to port directory: /opt/local/var/macports/sources/rsync.macports.org/release/tarballs/ports/databases/db46
346:debug:main OS darwin/8.11.1 (Mac OS X 10.4) arch i386
347:debug:main org.macports.load registered provides 'load', a pre-existing procedure. Target override will not be provided
348:debug:main org.macports.distfiles registered provides 'distfiles', a pre-existing procedure. Target override will not be provided
349:debug:main Using group file /opt/local/var/macports/sources/rsync.macports.org/release/tarballs/ports/_resources/port1.0/group/muniversal-1.0.tcl
350:debug:main Reading variant descriptions from /opt/local/var/macports/sources/rsync.macports.org/release/tarballs/ports/_resources/port1.0/variant_descriptions.conf
351:debug:main universal variant already exists, so not adding the default one
352:debug:main Requested variant quartz is not provided by port db46.
353:debug:main Executing variant java provides java
354:debug:main No need to upgrade! db46 4.6.21_6 >= db46 4.6.21_6
355:debug:main epoch: in tree: 0 installed: 0
356:debug:main gdbm 1.10_0 exists in the ports tree
357:debug:main gdbm 1.10_0  is the latest installed
358:debug:main gdbm 1.10_0  is active
359:debug:main Merging existing variants '' into variants
360:debug:main new fully merged portvariants: quartz +
361:debug:main Changing to port directory: /opt/local/var/macports/sources/rsync.macports.org/release/tarballs/ports/databases/gdbm
362:debug:main OS darwin/8.11.1 (Mac OS X 10.4) arch i386
363:debug:main org.macports.load registered provides 'load', a pre-existing procedure. Target override will not be provided
364:debug:main org.macports.distfiles registered provides 'distfiles', a pre-existing procedure. Target override will not be provided
365:debug:main Using group file /opt/local/var/macports/sources/rsync.macports.org/release/tarballs/ports/_resources/port1.0/group/muniversal-1.0.tcl
366:debug:main Reading variant descriptions from /opt/local/var/macports/sources/rsync.macports.org/release/tarballs/ports/_resources/port1.0/variant_descriptions.conf
367:debug:main universal variant already exists, so not adding the default one
368:debug:main Requested variant quartz is not provided by port gdbm.
369:debug:main No need to upgrade! gdbm 1.10_0 >= gdbm 1.10_0
370:debug:main epoch: in tree: 0 installed: 0
371:debug:main python_select 0.3_1 exists in the ports tree
372:debug:main python_select 0.3_1  is the latest installed
373:debug:main python_select 0.3_1  is active
374:debug:main Merging existing variants '' into variants
375:debug:main new fully merged portvariants: quartz +
376:debug:main Changing to port directory: /opt/local/var/macports/sources/rsync.macports.org/release/tarballs/ports/sysutils/python_select
377:debug:main OS darwin/8.11.1 (Mac OS X 10.4) arch i386
378:debug:main org.macports.load registered provides 'load', a pre-existing procedure. Target override will not be provided
379:debug:main org.macports.distfiles registered provides 'distfiles', a pre-existing procedure. Target override will not be provided
380:debug:main Using group file /opt/local/var/macports/sources/rsync.macports.org/release/tarballs/ports/_resources/port1.0/group/select-1.0.tcl
381:debug:main universal_variant is false, so not adding the default universal variant
382:debug:main Requested variant quartz is not provided by port python_select.
383:debug:main No need to upgrade! python_select 0.3_1 >= python_select 0.3_1
384:debug:main epoch: in tree: 0 installed: 0
385:debug:main xorg-libpthread-stubs 0.3_0 exists in the ports tree
386:debug:main xorg-libpthread-stubs 0.3_0  is the latest installed
387:debug:main xorg-libpthread-stubs 0.3_0  is active
388:debug:main Merging existing variants '' into variants
389:debug:main new fully merged portvariants: quartz +
390:debug:main Changing to port directory: /opt/local/var/macports/sources/rsync.macports.org/release/tarballs/ports/x11/xorg-libpthread-stubs
391:debug:main OS darwin/8.11.1 (Mac OS X 10.4) arch i386
392:debug:main org.macports.load registered provides 'load', a pre-existing procedure. Target override will not be provided
393:debug:main org.macports.distfiles registered provides 'distfiles', a pre-existing procedure. Target override will not be provided
394:debug:main only one arch supported, so not adding the default universal variant
395:debug:main Requested variant quartz is not provided by port xorg-libpthread-stubs.
396:debug:main No need to upgrade! xorg-libpthread-stubs 0.3_0 >= xorg-libpthread-stubs 0.3_0
397:debug:main epoch: in tree: 0 installed: 0
398:debug:main xorg-kbproto 1.0.5_0 exists in the ports tree
399:debug:main xorg-kbproto 1.0.5_0  is the latest installed
400:debug:main xorg-kbproto 1.0.5_0  is active
401:debug:main Merging existing variants '' into variants
402:debug:main new fully merged portvariants: quartz +
403:debug:main Changing to port directory: /opt/local/var/macports/sources/rsync.macports.org/release/tarballs/ports/x11/xorg-kbproto
404:debug:main OS darwin/8.11.1 (Mac OS X 10.4) arch i386
405:debug:main org.macports.load registered provides 'load', a pre-existing procedure. Target override will not be provided
406:debug:main org.macports.distfiles registered provides 'distfiles', a pre-existing procedure. Target override will not be provided
407:debug:main only one arch supported, so not adding the default universal variant
408:debug:main Requested variant quartz is not provided by port xorg-kbproto.
409:debug:main No need to upgrade! xorg-kbproto 1.0.5_0 >= xorg-kbproto 1.0.5_0
410:debug:main epoch: in tree: 0 installed: 0
411:debug:main xorg-xextproto 7.2.0_0 exists in the ports tree
412:debug:main xorg-xextproto 7.2.0_0  is the latest installed
413:debug:main xorg-xextproto 7.2.0_0  is active
414:debug:main Merging existing variants '' into variants
415:debug:main new fully merged portvariants: quartz +
416:debug:main Changing to port directory: /opt/local/var/macports/sources/rsync.macports.org/release/tarballs/ports/x11/xorg-xextproto
417:debug:main OS darwin/8.11.1 (Mac OS X 10.4) arch i386
418:debug:main org.macports.load registered provides 'load', a pre-existing procedure. Target override will not be provided
419:debug:main org.macports.distfiles registered provides 'distfiles', a pre-existing procedure. Target override will not be provided
420:debug:main only one arch supported, so not adding the default universal variant
421:debug:main Requested variant quartz is not provided by port xorg-xextproto.
422:debug:main No need to upgrade! xorg-xextproto 7.2.0_0 >= xorg-xextproto 7.2.0_0
423:debug:main epoch: in tree: 0 installed: 0
424:debug:main xorg-libXt 1.1.1_0 exists in the ports tree
425:debug:main xorg-libXt 1.1.1_0  is the latest installed
426:debug:main xorg-libXt 1.1.1_0  is active
427:debug:main Merging existing variants '' into variants
428:debug:main new fully merged portvariants: quartz +
429:debug:main Changing to port directory: /opt/local/var/macports/sources/rsync.macports.org/release/tarballs/ports/x11/xorg-libXt
430:debug:main OS darwin/8.11.1 (Mac OS X 10.4) arch i386
431:debug:main org.macports.load registered provides 'load', a pre-existing procedure. Target override will not be provided
432:debug:main org.macports.distfiles registered provides 'distfiles', a pre-existing procedure. Target override will not be provided
433:debug:main adding the default universal variant
434:debug:main Reading variant descriptions from /opt/local/var/macports/sources/rsync.macports.org/release/tarballs/ports/_resources/port1.0/variant_descriptions.conf
435:debug:main Requested variant quartz is not provided by port xorg-libXt.
436:debug:main No need to upgrade! xorg-libXt 1.1.1_0 >= xorg-libXt 1.1.1_0
437:debug:main epoch: in tree: 0 installed: 0
438:debug:main xorg-libsm 1.2.0_0 exists in the ports tree
439:debug:main xorg-libsm 1.2.0_0  is the latest installed
440:debug:main xorg-libsm 1.2.0_0  is active
441:debug:main Merging existing variants '' into variants
442:debug:main new fully merged portvariants: quartz +
443:debug:main Changing to port directory: /opt/local/var/macports/sources/rsync.macports.org/release/tarballs/ports/x11/xorg-libsm
444:debug:main OS darwin/8.11.1 (Mac OS X 10.4) arch i386
445:debug:main org.macports.load registered provides 'load', a pre-existing procedure. Target override will not be provided
446:debug:main org.macports.distfiles registered provides 'distfiles', a pre-existing procedure. Target override will not be provided
447:debug:main adding the default universal variant
448:debug:main Reading variant descriptions from /opt/local/var/macports/sources/rsync.macports.org/release/tarballs/ports/_resources/port1.0/variant_descriptions.conf
449:debug:main Requested variant quartz is not provided by port xorg-libsm.
450:debug:main No need to upgrade! xorg-libsm 1.2.0_0 >= xorg-libsm 1.2.0_0
451:debug:main epoch: in tree: 0 installed: 0
452:debug:main xorg-libice 1.0.7_0 exists in the ports tree
453:debug:main xorg-libice 1.0.7_0  is the latest installed
454:debug:main xorg-libice 1.0.7_0  is active
455:debug:main Merging existing variants '' into variants
456:debug:main new fully merged portvariants: quartz +
457:debug:main Changing to port directory: /opt/local/var/macports/sources/rsync.macports.org/release/tarballs/ports/x11/xorg-libice
458:debug:main OS darwin/8.11.1 (Mac OS X 10.4) arch i386
459:debug:main org.macports.load registered provides 'load', a pre-existing procedure. Target override will not be provided
460:debug:main org.macports.distfiles registered provides 'distfiles', a pre-existing procedure. Target override will not be provided
461:debug:main adding the default universal variant
462:debug:main Reading variant descriptions from /opt/local/var/macports/sources/rsync.macports.org/release/tarballs/ports/_resources/port1.0/variant_descriptions.conf
463:debug:main Requested variant quartz is not provided by port xorg-libice.
464:debug:main No need to upgrade! xorg-libice 1.0.7_0 >= xorg-libice 1.0.7_0
465:debug:main epoch: in tree: 0 installed: 0
466:debug:main liblzma 5.0.3_0 exists in the ports tree
467:debug:main liblzma 5.0.3_0  is the latest installed
468:debug:main liblzma 5.0.3_0  is active
469:debug:main Merging existing variants '' into variants
470:debug:main new fully merged portvariants: quartz +
471:debug:main Changing to port directory: /opt/local/var/macports/sources/rsync.macports.org/release/tarballs/ports/devel/liblzma
472:debug:main OS darwin/8.11.1 (Mac OS X 10.4) arch i386
473:debug:main org.macports.load registered provides 'load', a pre-existing procedure. Target override will not be provided
474:debug:main org.macports.distfiles registered provides 'distfiles', a pre-existing procedure. Target override will not be provided
475:debug:main adding the default universal variant
476:debug:main Reading variant descriptions from /opt/local/var/macports/sources/rsync.macports.org/release/tarballs/ports/_resources/port1.0/variant_descriptions.conf
477:debug:main Requested variant quartz is not provided by port liblzma.
478:debug:main No need to upgrade! liblzma 5.0.3_0 >= liblzma 5.0.3_0
479:debug:main epoch: in tree: 0 installed: 0
480:debug:main jpeg 8c_0 exists in the ports tree
481:debug:main jpeg 8c_0  is the latest installed
482:debug:main jpeg 8c_0  is active
483:debug:main Merging existing variants '' into variants
484:debug:main new fully merged portvariants: quartz +
485:debug:main Changing to port directory: /opt/local/var/macports/sources/rsync.macports.org/release/tarballs/ports/graphics/jpeg
486:debug:main OS darwin/8.11.1 (Mac OS X 10.4) arch i386
487:debug:main org.macports.load registered provides 'load', a pre-existing procedure. Target override will not be provided
488:debug:main org.macports.distfiles registered provides 'distfiles', a pre-existing procedure. Target override will not be provided
489:debug:main adding the default universal variant
490:debug:main Reading variant descriptions from /opt/local/var/macports/sources/rsync.macports.org/release/tarballs/ports/_resources/port1.0/variant_descriptions.conf
491:debug:main Requested variant quartz is not provided by port jpeg.
492:debug:main No need to upgrade! jpeg 8c_0 >= jpeg 8c_0
493:debug:main epoch: in tree: 0 installed: 0
494:debug:main lcms2 2.2_0 exists in the ports tree
495:debug:main lcms2 2.2_0  is the latest installed
496:debug:main lcms2 2.2_0  is active
497:debug:main Merging existing variants '' into variants
498:debug:main new fully merged portvariants: quartz +
499:debug:main Changing to port directory: /opt/local/var/macports/sources/rsync.macports.org/release/tarballs/ports/graphics/lcms2
500:debug:main OS darwin/8.11.1 (Mac OS X 10.4) arch i386
501:debug:main org.macports.load registered provides 'load', a pre-existing procedure. Target override will not be provided
502:debug:main org.macports.distfiles registered provides 'distfiles', a pre-existing procedure. Target override will not be provided
503:debug:main Using group file /opt/local/var/macports/sources/rsync.macports.org/release/tarballs/ports/_resources/port1.0/group/muniversal-1.0.tcl
504:debug:main Reading variant descriptions from /opt/local/var/macports/sources/rsync.macports.org/release/tarballs/ports/_resources/port1.0/variant_descriptions.conf
505:debug:main universal variant already exists, so not adding the default one
506:debug:main Requested variant quartz is not provided by port lcms2.
507:debug:main No need to upgrade! lcms2 2.2_0 >= lcms2 2.2_0
508:debug:main epoch: in tree: 0 installed: 0
509:debug:main tiff 3.9.5_0 exists in the ports tree
510:debug:main tiff 3.9.5_0  is the latest installed
511:debug:main tiff 3.9.5_0  is active
512:debug:main Merging existing variants '' into variants
513:debug:main new fully merged portvariants: quartz +
514:debug:main Changing to port directory: /opt/local/var/macports/sources/rsync.macports.org/release/tarballs/ports/graphics/tiff
515:debug:main OS darwin/8.11.1 (Mac OS X 10.4) arch i386
516:debug:main org.macports.load registered provides 'load', a pre-existing procedure. Target override will not be provided
517:debug:main org.macports.distfiles registered provides 'distfiles', a pre-existing procedure. Target override will not be provided
518:debug:main Using group file /opt/local/var/macports/sources/rsync.macports.org/release/tarballs/ports/_resources/port1.0/group/xcodeversion-1.0.tcl
519:debug:main adding the default universal variant
520:debug:main Reading variant descriptions from /opt/local/var/macports/sources/rsync.macports.org/release/tarballs/ports/_resources/port1.0/variant_descriptions.conf
521:debug:main Requested variant quartz is not provided by port tiff.
522:debug:main No need to upgrade! tiff 3.9.5_0 >= tiff 3.9.5_0
523:debug:main epoch: in tree: 0 installed: 0
524:debug:main ghostscript 9.04_1 exists in the ports tree
525:debug:main ghostscript 9.04_1  is the latest installed
526:debug:main ghostscript 9.04_1  is active
527:debug:main Merging existing variants '' into variants
528:debug:main new fully merged portvariants: quartz +
529:debug:main Changing to port directory: /opt/local/var/macports/sources/rsync.macports.org/release/tarballs/ports/print/ghostscript
530:debug:main OS darwin/8.11.1 (Mac OS X 10.4) arch i386
531:debug:main org.macports.load registered provides 'load', a pre-existing procedure. Target override will not be provided
532:debug:main org.macports.distfiles registered provides 'distfiles', a pre-existing procedure. Target override will not be provided
533:debug:main Using group file /opt/local/var/macports/sources/rsync.macports.org/release/tarballs/ports/_resources/port1.0/group/muniversal-1.0.tcl
534:debug:main Reading variant descriptions from /opt/local/var/macports/sources/rsync.macports.org/release/tarballs/ports/_resources/port1.0/variant_descriptions.conf
535:debug:main universal variant already exists, so not adding the default one
536:debug:main Requested variant quartz is not provided by port ghostscript.
537:debug:main No need to upgrade! ghostscript 9.04_1 >= ghostscript 9.04_1
538:debug:main epoch: in tree: 0 installed: 0
539:debug:main libidn 1.22_0 exists in the ports tree
540:debug:main libidn 1.22_0  is the latest installed
541:debug:main libidn 1.22_0  is active
542:debug:main Merging existing variants '' into variants
543:debug:main new fully merged portvariants: quartz +
544:debug:main Changing to port directory: /opt/local/var/macports/sources/rsync.macports.org/release/tarballs/ports/mail/libidn
545:debug:main OS darwin/8.11.1 (Mac OS X 10.4) arch i386
546:debug:main org.macports.load registered provides 'load', a pre-existing procedure. Target override will not be provided
547:debug:main org.macports.distfiles registered provides 'distfiles', a pre-existing procedure. Target override will not be provided
548:debug:main adding the default universal variant
549:debug:main Reading variant descriptions from /opt/local/var/macports/sources/rsync.macports.org/release/tarballs/ports/_resources/port1.0/variant_descriptions.conf
550:debug:main Requested variant quartz is not provided by port libidn.
551:debug:main No need to upgrade! libidn 1.22_0 >= libidn 1.22_0
552:debug:main epoch: in tree: 0 installed: 0
553:debug:main libpaper 1.1.24_0 exists in the ports tree
554:debug:main libpaper 1.1.24_0  is the latest installed
555:debug:main libpaper 1.1.24_0  is active
556:debug:main Merging existing variants '' into variants
557:debug:main new fully merged portvariants: quartz +
558:debug:main Changing to port directory: /opt/local/var/macports/sources/rsync.macports.org/release/tarballs/ports/print/libpaper
559:debug:main OS darwin/8.11.1 (Mac OS X 10.4) arch i386
560:debug:main org.macports.load registered provides 'load', a pre-existing procedure. Target override will not be provided
561:debug:main org.macports.distfiles registered provides 'distfiles', a pre-existing procedure. Target override will not be provided
562:debug:main adding the default universal variant
563:debug:main Reading variant descriptions from /opt/local/var/macports/sources/rsync.macports.org/release/tarballs/ports/_resources/port1.0/variant_descriptions.conf
564:debug:main Requested variant quartz is not provided by port libpaper.
565:debug:main No need to upgrade! libpaper 1.1.24_0 >= libpaper 1.1.24_0
566:debug:main epoch: in tree: 0 installed: 0
567:debug:main perl5 5.12.3_1 exists in the ports tree
568:debug:main perl5 5.12.3_1 +perl5_12 is the latest installed
569:debug:main perl5 5.12.3_1 +perl5_12 is active
570:debug:main Merging existing variants '+perl5_12' into variants
571:debug:main new fully merged portvariants: perl5_12 + quartz +
572:debug:main Changing to port directory: /opt/local/var/macports/sources/rsync.macports.org/release/tarballs/ports/lang/perl5
573:debug:main OS darwin/8.11.1 (Mac OS X 10.4) arch i386
574:debug:main org.macports.load registered provides 'load', a pre-existing procedure. Target override will not be provided
575:debug:main org.macports.distfiles registered provides 'distfiles', a pre-existing procedure. Target override will not be provided
576:debug:main universal_variant is false, so not adding the default universal variant
577:debug:main Requested variant quartz is not provided by port perl5.
578:debug:main Executing variant perl5_12 provides perl5_12
579:debug:main No need to upgrade! perl5 5.12.3_1 >= perl5 5.12.3_1
580:debug:main epoch: in tree: 0 installed: 0
581:debug:main perl5.12 5.12.3_2 exists in the ports tree
582:debug:main perl5.12 5.12.3_2  is the latest installed
583:debug:main perl5.12 5.12.3_2  is active
584:debug:main Merging existing variants '' into variants
585:debug:main new fully merged portvariants: quartz +
586:debug:main Changing to port directory: /opt/local/var/macports/sources/rsync.macports.org/release/tarballs/ports/lang/perl5.12
587:debug:main OS darwin/8.11.1 (Mac OS X 10.4) arch i386
588:debug:main org.macports.load registered provides 'load', a pre-existing procedure. Target override will not be provided
589:debug:main org.macports.distfiles registered provides 'distfiles', a pre-existing procedure. Target override will not be provided
590:debug:main adding the default universal variant
591:debug:main Reading variant descriptions from /opt/local/var/macports/sources/rsync.macports.org/release/tarballs/ports/_resources/port1.0/variant_descriptions.conf
592:debug:main Requested variant quartz is not provided by port perl5.12.
593:debug:main No need to upgrade! perl5.12 5.12.3_2 >= perl5.12 5.12.3_2
594:debug:main epoch: in tree: 0 installed: 0
595:debug:main libtool 2.4.2_0 exists in the ports tree
596:debug:main libtool 2.4.2_0  is the latest installed
597:debug:main libtool 2.4.2_0  is active
598:debug:main Merging existing variants '' into variants
599:debug:main new fully merged portvariants: quartz +
600:debug:main Changing to port directory: /opt/local/var/macports/sources/rsync.macports.org/release/tarballs/ports/devel/libtool
601:debug:main OS darwin/8.11.1 (Mac OS X 10.4) arch i386
602:debug:main org.macports.load registered provides 'load', a pre-existing procedure. Target override will not be provided
603:debug:main org.macports.distfiles registered provides 'distfiles', a pre-existing procedure. Target override will not be provided
604:debug:main adding the default universal variant
605:debug:main Reading variant descriptions from /opt/local/var/macports/sources/rsync.macports.org/release/tarballs/ports/_resources/port1.0/variant_descriptions.conf
606:debug:main Requested variant quartz is not provided by port libtool.
607:debug:main No need to upgrade! libtool 2.4.2_0 >= libtool 2.4.2_0
608:debug:main epoch: in tree: 0 installed: 0
609:debug:main urw-fonts 1.0.7pre44_0 exists in the ports tree
610:debug:main urw-fonts 1.0.7pre44_0  is the latest installed
611:debug:main urw-fonts 1.0.7pre44_0  is active
612:debug:main Merging existing variants '' into variants
613:debug:main new fully merged portvariants: quartz +
614:debug:main Changing to port directory: /opt/local/var/macports/sources/rsync.macports.org/release/tarballs/ports/x11/urw-fonts
615:debug:main OS darwin/8.11.1 (Mac OS X 10.4) arch i386
616:debug:main org.macports.load registered provides 'load', a pre-existing procedure. Target override will not be provided
617:debug:main org.macports.distfiles registered provides 'distfiles', a pre-existing procedure. Target override will not be provided
618:debug:main universal_variant is false, so not adding the default universal variant
619:debug:main Requested variant quartz is not provided by port urw-fonts.
620:debug:main No need to upgrade! urw-fonts 1.0.7pre44_0 >= urw-fonts 1.0.7pre44_0
621:msg:main --->  Computing dependencies for abiword:info:main .:debug:main Searching for dependency: zlib
622:debug:main Found Dependency: receipt exists for zlib
623:debug:main Searching for dependency: libpng
624:debug:main Found Dependency: receipt exists for libpng
625:debug:main Searching for dependency: fribidi
626:debug:main Found Dependency: receipt exists for fribidi
627:debug:main Searching for dependency: fontconfig
628:debug:main Found Dependency: receipt exists for fontconfig
629:debug:main Searching for dependency: ImageMagick
630:debug:main Found Dependency: receipt exists for ImageMagick
631:msg:main
632:debug:main Executing org.macports.main (abiword)
633:debug:main changing euid/egid - current euid: 0 - current egid: 0
634:debug:main egid changed to: 500
635:debug:main euid changed to: 502
636:debug:archivefetch archivefetch phase started at Sun Nov 20 23:42:34 CET 2011
637:msg:archivefetch --->  Fetching archive for abiword
638:debug:archivefetch Executing org.macports.archivefetch (abiword)
639:debug:archivefetch euid/egid changed to: 0/0
640:debug:archivefetch chowned /opt/local/var/macports/software/abiword to macports
641:debug:archivefetch euid/egid changed to: 502/500
642:debug:archivefetch euid/egid changed to: 0/0
643:debug:archivefetch chowned /opt/local/var/macports/incoming to macports
644:debug:archivefetch euid/egid changed to: 502/500
645:info:archivefetch --->  abiword-2.4.5_0+use_source.darwin_8.i386.tbz2 doesn't seem to exist in /opt/local/var/macports/software/abiword
646:msg:archivefetch --->  Attempting to fetch abiword-2.4.5_0+use_source.darwin_8.i386.tbz2 from http://packages.macports.org/abiword
647:debug:archivefetch Fetching archive failed:: The requested URL returned error: 404
648:debug:archivefetch Privilege de-escalation not attempted as not running as root.
649:debug:fetch fetch phase started at Sun Nov 20 23:42:35 CET 2011
650:notice:fetch --->  Fetching abiword
651:debug:fetch euid/egid changed to: 0/0
652:debug:fetch chowned /opt/local/var/macports/distfiles/abiword to macports
653:debug:fetch euid/egid changed to: 502/500
654:debug:fetch Executing proc-pre-org.macports.fetch-fetch-0
655:debug:fetch Executing org.macports.fetch (abiword)
656:debug:fetch Privilege de-escalation not attempted as not running as root.
657:debug:checksum checksum phase started at Sun Nov 20 23:42:35 CET 2011
658:notice:checksum --->  Verifying checksum(s) for abiword
659:debug:checksum Executing org.macports.checksum (abiword)
660:info:checksum --->  Checksumming abiword-2.4.5.tar.bz2
661:debug:checksum Correct (md5) checksum for abiword-2.4.5.tar.bz2
662:debug:checksum Correct (sha1) checksum for abiword-2.4.5.tar.bz2
663:debug:checksum Correct (rmd160) checksum for abiword-2.4.5.tar.bz2
664:debug:checksum Privilege de-escalation not attempted as not running as root.
665:debug:extract extract phase started at Sun Nov 20 23:42:37 CET 2011
666:notice:extract --->  Extracting abiword
667:debug:extract setting option extract.cmd to /usr/bin/bzip2
668:debug:extract Executing org.macports.extract (abiword)
669:info:extract --->  Extracting abiword-2.4.5.tar.bz2
670:debug:extract setting option extract.args to '/opt/local/var/macports/distfiles/abiword/abiword-2.4.5.tar.bz2'
671:debug:extract Environment: CPATH='/opt/local/include' CC_PRINT_OPTIONS_FILE='/opt/local/var/macports/build/_opt_local_var_macports_sources_rsync.macports.org_release_tarballs_ports_editors_abiword/abiword/work/.CC_PRINT_OPTIONS' LIBRARY_PATH='/opt/local/lib' CC_PRINT_OPTIONS='YES' MACOSX_DEPLOYMENT_TARGET='10.4'
672:debug:extract Assembled command: 'cd "/opt/local/var/macports/build/_opt_local_var_macports_sources_rsync.macports.org_release_tarballs_ports_editors_abiword/abiword/work" && /usr/bin/bzip2 -dc '/opt/local/var/macports/distfiles/abiword/abiword-2.4.5.tar.bz2' | /usr/bin/gnutar --no-same-owner -xf -'
673:debug:extract Executing command line:  cd "/opt/local/var/macports/build/_opt_local_var_macports_sources_rsync.macports.org_release_tarballs_ports_editors_abiword/abiword/work" && /usr/bin/bzip2 -dc '/opt/local/var/macports/distfiles/abiword/abiword-2.4.5.tar.bz2' | /usr/bin/gnutar --no-same-owner -xf -
674:debug:extract euid/egid changed to: 0/0
675:debug:extract chowned /opt/local/var/macports/build/_opt_local_var_macports_sources_rsync.macports.org_release_tarballs_ports_editors_abiword/abiword/work to macports
676:debug:extract euid/egid changed to: 502/500
677:debug:extract Privilege de-escalation not attempted as not running as root.
678:debug:patch patch phase started at Sun Nov 20 23:43:06 CET 2011
679:debug:patch Executing org.macports.patch (abiword)
680:notice:patch --->  Applying patches to abiword
681:info:patch --->  Applying /opt/local/var/macports/sources/rsync.macports.org/release/tarballs/ports/editors/abiword/files/configure.patch
682:debug:patch Environment: CPATH='/opt/local/include' CC_PRINT_OPTIONS_FILE='/opt/local/var/macports/build/_opt_local_var_macports_sources_rsync.macports.org_release_tarballs_ports_editors_abiword/abiword/work/.CC_PRINT_OPTIONS' LIBRARY_PATH='/opt/local/lib' CC_PRINT_OPTIONS='YES' MACOSX_DEPLOYMENT_TARGET='10.4'
683:debug:patch Assembled command: 'cd "/opt/local/var/macports/build/_opt_local_var_macports_sources_rsync.macports.org_release_tarballs_ports_editors_abiword/abiword/work/abiword-2.4.5/abi" && /usr/bin/patch -p0'
684:debug:patch Executing command line:  cd "/opt/local/var/macports/build/_opt_local_var_macports_sources_rsync.macports.org_release_tarballs_ports_editors_abiword/abiword/work/abiword-2.4.5/abi" && /usr/bin/patch -p0 < '/opt/local/var/macports/sources/rsync.macports.org/release/tarballs/ports/editors/abiword/files/configure.patch'
685:info:patch patching file configure
686:info:patch --->  Applying /opt/local/var/macports/sources/rsync.macports.org/release/tarballs/ports/editors/abiword/files/abi-detect-platform.m4.patch
687:debug:patch Environment: CPATH='/opt/local/include' CC_PRINT_OPTIONS_FILE='/opt/local/var/macports/build/_opt_local_var_macports_sources_rsync.macports.org_release_tarballs_ports_editors_abiword/abiword/work/.CC_PRINT_OPTIONS' LIBRARY_PATH='/opt/local/lib' CC_PRINT_OPTIONS='YES' MACOSX_DEPLOYMENT_TARGET='10.4'
688:debug:patch Assembled command: 'cd "/opt/local/var/macports/build/_opt_local_var_macports_sources_rsync.macports.org_release_tarballs_ports_editors_abiword/abiword/work/abiword-2.4.5/abi" && /usr/bin/patch -p0'
689:debug:patch Executing command line:  cd "/opt/local/var/macports/build/_opt_local_var_macports_sources_rsync.macports.org_release_tarballs_ports_editors_abiword/abiword/work/abiword-2.4.5/abi" && /usr/bin/patch -p0 < '/opt/local/var/macports/sources/rsync.macports.org/release/tarballs/ports/editors/abiword/files/abi-detect-platform.m4.patch'
690:info:patch patching file ac-helpers/abi-detect-platform.m4
691:debug:patch Privilege de-escalation not attempted as not running as root.
692:debug:configure configure phase started at Sun Nov 20 23:43:07 CET 2011
693:notice:configure --->  Configuring abiword
694:debug:configure Using compiler 'Mac OS X gcc 4.0'
695:debug:configure Executing org.macports.configure (abiword)
696:debug:configure Environment: CPATH='/opt/local/include' CFLAGS='-pipe -O2 -arch i386' CPPFLAGS='-I/opt/local/include' CXXFLAGS='-pipe -O2 -arch i386' LIBRARY_PATH='/opt/local/lib' MACOSX_DEPLOYMENT_TARGET='10.4' CXX='/usr/bin/g++-4.0' CC_PRINT_OPTIONS_FILE='/opt/local/var/macports/build/_opt_local_var_macports_sources_rsync.macports.org_release_tarballs_ports_editors_abiword/abiword/work/.CC_PRINT_OPTIONS' F90FLAGS='-pipe -O2 -m32' LDFLAGS='-L/opt/local/lib -arch i386' OBJC='/usr/bin/gcc-4.0' FCFLAGS='-pipe -O2 -m32' INSTALL='/usr/bin/install -c' OBJCFLAGS='-pipe -O2 -arch i386' FFLAGS='-pipe -O2 -m32' CC_PRINT_OPTIONS='YES' CC='/usr/bin/gcc-4.0'
697:debug:configure Assembled command: 'cd "/opt/local/var/macports/build/_opt_local_var_macports_sources_rsync.macports.org_release_tarballs_ports_editors_abiword/abiword/work/abiword-2.4.5/abi" && ./configure --prefix=/opt/local --enable-Cocoa --mandir=/opt/local/share/man --with-zlib=/opt/local --with-libpng=/opt/local --with-popt=/opt/local --without-epath --disable-gnome'
698:debug:configure Executing command line:  cd "/opt/local/var/macports/build/_opt_local_var_macports_sources_rsync.macports.org_release_tarballs_ports_editors_abiword/abiword/work/abiword-2.4.5/abi" && ./configure --prefix=/opt/local --enable-Cocoa --mandir=/opt/local/share/man --with-zlib=/opt/local --with-libpng=/opt/local --with-popt=/opt/local --without-epath --disable-gnome
699:info:configure checking for a BSD-compatible install... /usr/bin/install -c
700:info:configure checking whether build environment is sane... yes
701:info:configure checking for gawk... gawk
702:info:configure checking whether make sets $(MAKE)... yes
703:info:configure checking for C++ compiler default output file name... a.out
704:info:configure checking whether the C++ compiler works... yes
705:info:configure checking whether we are cross compiling... no
706:info:configure checking for suffix of executables...
707:info:configure checking for suffix of object files... o
708:info:configure checking whether we are using the GNU C++ compiler... yes
709:info:configure checking whether /usr/bin/g++-4.0 accepts -g... yes
710:info:configure checking for style of include used by make... GNU
711:info:configure checking dependency style of /usr/bin/g++-4.0... gcc3
712:info:configure checking for gcc... /usr/bin/gcc-4.0
713:info:configure checking whether we are using the GNU C compiler... yes
714:info:configure checking whether /usr/bin/gcc-4.0 accepts -g... yes
715:info:configure checking for /usr/bin/gcc-4.0 option to accept ANSI C... none needed
716:info:configure checking dependency style of /usr/bin/gcc-4.0... gcc3
717:info:configure checking for library containing strerror... none required
718:info:configure checking how to run the C preprocessor... /usr/bin/gcc-4.0 -E
719:info:configure checking CFLAGS... -pipe -O2 -arch i386
720:info:configure checking CXXFLAGS... -pipe -O2 -arch i386
721:info:configure checking for a BSD-compatible install... /usr/bin/install -c
722:info:configure checking whether ln -s works... yes
723:info:configure checking whether make sets $(MAKE)... (cached) yes
724:info:configure checking for ranlib... ranlib
725:info:configure checking for egrep... grep -E
726:info:configure checking for ANSI C header files... yes
727:info:configure checking for sys/types.h... yes
728:info:configure checking for sys/stat.h... yes
729:info:configure checking for stdlib.h... yes
730:info:configure checking for string.h... yes
731:info:configure checking for memory.h... yes
732:info:configure checking for strings.h... yes
733:info:configure checking for inttypes.h... yes
734:info:configure checking for stdint.h... yes
735:info:configure checking for unistd.h... yes
736:info:configure checking for long int... yes
737:info:configure checking size of long int... 4
738:info:configure checking for pkg-config... /opt/local/bin/pkg-config
739:info:configure checking for glib-2.0 >= 2.0... yes
740:info:configure checking GLIB_CFLAGS... -I/opt/local/include/glib-2.0 -I/opt/local/lib/glib-2.0/include -I/opt/local/include 
741:info:configure checking GLIB_LIBS... -L/opt/local/lib -lglib-2.0 -lintl 
742:info:configure checking for gmodule-2.0 >= 2.0... yes
743:info:configure checking GMODULE_CFLAGS... -D_REENTRANT -I/opt/local/include/glib-2.0 -I/opt/local/lib/glib-2.0/include -I/opt/local/include 
744:info:configure checking GMODULE_LIBS... -L/opt/local/lib -lgmodule-2.0 -lglib-2.0 -lintl 
745:info:configure checking for gthread-2.0... yes
746:info:configure checking GTHREAD_CFLAGS... -D_REENTRANT -I/opt/local/include/glib-2.0 -I/opt/local/lib/glib-2.0/include -I/opt/local/include 
747:info:configure checking GTHREAD_LIBS... -L/opt/local/lib -lgthread-2.0 -lglib-2.0 -lintl 
748:info:configure checking iconv.h usability... yes
749:info:configure checking iconv.h presence... yes
750:info:configure checking for iconv.h... yes
751:info:configure checking for gucharmap >= 1.4... checking for enchant >= 1.1.0... yes
752:info:configure checking _abi_enchant_CFLAGS... -D_REENTRANT -I/opt/local/include/enchant -I/opt/local/include/glib-2.0 -I/opt/local/lib/glib-2.0/include -I/opt/local/include 
753:info:configure checking _abi_enchant_LIBS... -L/opt/local/lib -lenchant -lgmodule-2.0 -lglib-2.0 -lintl 
754:info:configure checking for fribidi >= 0.10.4... yes
755:info:configure checking FRIBIDI_CFLAGS... -I/opt/local/include/fribidi 
756:info:configure checking FRIBIDI_LIBS... -L/opt/local/lib -lfribidi 
757:info:configure checking for ANSI C header files... (cached) yes
758:info:configure checking limits.h usability... yes
759:info:configure checking limits.h presence... yes
760:info:configure checking for limits.h... yes
761:info:configure checking for strings.h... (cached) yes
762:info:configure checking sys/time.h usability... yes
763:info:configure checking sys/time.h presence... yes
764:info:configure checking for sys/time.h... yes
765:info:configure checking for unistd.h... (cached) yes
766:info:configure checking malloc.h usability... no
767:info:configure checking malloc.h presence... no
768:info:configure checking for malloc.h... no
769:info:configure checking for an ANSI C-conforming const... yes
770:info:configure checking for size_t... yes
771:info:configure checking whether byte ordering is bigendian... no
772:info:configure checking for xml2-config... /opt/local/bin/xml2-config
773:info:configure checking for wv... /opt/local/var/macports/build/_opt_local_var_macports_sources_rsync.macports.org_release_tarballs_ports_editors_abiword/abiword/work/abiword-2.4.5/wv
774:info:configure checking zlib.h usability... yes
775:info:configure checking zlib.h presence... yes
776:info:configure checking for zlib.h... yes
777:info:configure checking png.h usability... yes
778:info:configure checking png.h presence... yes
779:info:configure checking for png.h... yes
780:info:configure checking popt.h usability... yes
781:info:configure checking popt.h presence... yes
782:info:configure checking for popt.h... yes
783:info:configure checking for libjpeg
784:info:configure checking for jpeg_start_decompress in -ljpeg... yes
785:info:configure checking jpeglib.h usability... yes
786:info:configure checking jpeglib.h presence... yes
787:info:configure checking for jpeglib.h... yes
788:info:configure checking for working alloca.h... yes
789:info:configure checking for alloca... yes
790:info:configure checking return type of signal handlers... void
791:info:configure checking for re_comp... no
792:info:configure checking for regcomp... yes
793:info:configure checking for strdup... yes
794:info:configure checking for strstr... yes
795:info:configure checking for strcasecmp... yes
796:info:configure checking for stricmp... no
797:info:configure checking for strnlen... no
798:info:configure
799:info:configure configuring wv: srcdir=../wv, builddir=../wv
800:info:configure
801:info:configure creating cache ./config.cache
802:info:configure checking for Cygwin environment... no
803:info:configure checking for mingw32 environment... no
804:info:configure checking for executable suffix... no
805:info:configure checking for object suffix... o
806:info:configure checking for mingw32 environment... (cached) no
807:info:configure checking for gcc... /usr/bin/gcc-4.0
808:info:configure checking whether the C compiler (/usr/bin/gcc-4.0 -pipe -O2 -arch i386 -L/opt/local/lib -arch i386) works... yes
809:info:configure checking whether the C compiler (/usr/bin/gcc-4.0 -pipe -O2 -arch i386 -L/opt/local/lib -arch i386) is a cross-compiler... no
810:info:configure checking whether we are using GNU C... yes
811:info:configure checking whether /usr/bin/gcc-4.0 accepts -g... yes
812:info:configure checking whether make sets ${MAKE}... yes
813:info:configure checking for a BSD compatible install... /usr/bin/install -c
814:info:configure checking for ranlib... ranlib
815:info:configure checking how to run the C preprocessor... /usr/bin/gcc-4.0 -E
816:info:configure checking for ANSI C header files... yes
817:info:configure checking for fcntl.h... yes
818:info:configure checking for io.h... no
819:info:configure checking for malloc.h... no
820:info:configure checking for sys/file.h... yes
821:info:configure checking for sys/ioctl.h... yes
822:info:configure checking for unistd.h... yes
823:info:configure checking for working const... yes
824:info:configure checking for zlib.h... yes
825:info:configure checking for gzread in -lz... yes
826:info:configure checking for png.h... yes
827:info:configure checking for pngconf.h... yes
828:info:configure checking for png_free in -lpng... yes
829:info:configure checking for xml2-config... /opt/local/bin/xml2-config
830:info:configure checking for libxml/parser.h... yes
831:info:configure checking for xmlParseDocument in -lxml2... yes
832:info:configure checking for pkg-config... /opt/local/bin/pkg-config
833:info:configure checking for glib-2.0 >= 2.0... yes
834:info:configure checking GLIB_CFLAGS... -I/opt/local/include/glib-2.0 -I/opt/local/lib/glib-2.0/include -I/opt/local/include 
835:info:configure checking GLIB_LIBS... -L/opt/local/lib -lglib-2.0 -lintl 
836:info:configure checking for gnome-config... no
837:info:configure checking for iconv.h... yes
838:info:configure checking for iconv_open in -liconv... no
839:info:configure checking for libiconv_open in -liconv... yes
840:info:configure checking need for const in iconv... yes
841:info:configure checking size of char... 1
842:info:configure checking size of short... 2
843:info:configure checking size of int... 4
844:info:configure checking size of long... 4
845:info:configure checking whether byte ordering is bigendian... no
846:info:configure checking for getopt_long... yes
847:info:configure checking for strerror... yes
848:info:configure checking for strcasecmp... yes
849:info:configure checking for memcpy... yes
850:info:configure checking for unistd.h... (cached) yes
851:info:configure checking for getpagesize... yes
852:info:configure checking for working mmap... yes
853:info:configure updating cache ./config.cache
854:info:configure creating ./config.status
855:info:configure creating Makefile
856:info:configure creating version.c
857:info:configure creating wvAbw
858:info:configure creating wvDVI
859:info:configure creating wvPS
860:info:configure creating wvPDF
861:info:configure creating wvHtml
862:info:configure creating wvDocBook
863:info:configure creating wvLatex
864:info:configure creating wvCleanLatex
865:info:configure creating wvText
866:info:configure creating wvWml
867:info:configure creating libole2/Makefile
868:info:configure creating glib-wv/Makefile
869:info:configure creating expat/Makefile
870:info:configure creating expat/xmltok/Makefile
871:info:configure creating expat/xmlparse/Makefile
872:info:configure creating exporter/Makefile
873:info:configure creating iconv/Makefile
874:info:configure creating magick/Makefile
875:info:configure creating config.h
876:info:configure configure: warning: libwv will not have wmf to png support: see README
877:info:configure
878:info:configure checking whether scandir select requires const struct dirent... no
879:info:configure checking for valgrind... no
880:info:configure checking valgrind/memcheck.h usability... no
881:info:configure checking valgrind/memcheck.h presence... no
882:info:configure checking for valgrind/memcheck.h... no
883:info:configure configure: WARNING: Valgrind is missing. UnitTesting will run without
884:info:configure configure: creating ./config.status
885:info:configure config.status: creating GNUmakefile
886:info:configure config.status: creating src/GNUmakefile
887:info:configure config.status: creating src/af/GNUmakefile
888:info:configure config.status: creating src/af/tf/GNUmakefile
889:info:configure config.status: creating src/af/ev/GNUmakefile
890:info:configure config.status: creating src/af/ev/xp/GNUmakefile
891:info:configure config.status: creating src/af/ev/cocoa/GNUmakefile
892:info:configure config.status: creating src/af/ev/qnx/GNUmakefile
893:info:configure config.status: creating src/af/ev/unix/GNUmakefile
894:info:configure config.status: creating src/af/ev/unix/gnome/GNUmakefile
895:info:configure config.status: creating src/af/ev/win/GNUmakefile
896:info:configure config.status: creating src/af/gr/GNUmakefile
897:info:configure config.status: creating src/af/gr/xp/GNUmakefile
898:info:configure config.status: creating src/af/gr/cocoa/GNUmakefile
899:info:configure config.status: creating src/af/gr/unix/GNUmakefile
900:info:configure config.status: creating src/af/gr/qnx/GNUmakefile
901:info:configure config.status: creating src/af/gr/win/GNUmakefile
902:info:configure config.status: creating src/af/util/GNUmakefile
903:info:configure config.status: creating src/af/util/xp/GNUmakefile
904:info:configure config.status: creating src/af/util/xp/t/GNUmakefile
905:info:configure config.status: creating src/af/util/unix/GNUmakefile
906:info:configure config.status: creating src/af/util/qnx/GNUmakefile
907:info:configure config.status: creating src/af/util/win/GNUmakefile
908:info:configure config.status: creating src/af/tf/xp/GNUmakefile
909:info:configure config.status: creating src/af/xap/GNUmakefile
910:info:configure config.status: creating src/af/xap/xp/GNUmakefile
911:info:configure config.status: creating src/af/xap/cocoa/GNUmakefile
912:info:configure config.status: creating src/af/xap/qnx/GNUmakefile
913:info:configure config.status: creating src/af/xap/win/GNUmakefile
914:info:configure config.status: creating src/af/xap/unix/GNUmakefile
915:info:configure config.status: creating src/af/xap/unix/t/GNUmakefile
916:info:configure config.status: creating src/af/xap/unix/gnome/GNUmakefile
917:info:configure config.status: creating src/af/xap/unix/hildon/GNUmakefile
918:info:configure config.status: creating src/other/GNUmakefile
919:info:configure config.status: creating src/other/spell/GNUmakefile
920:info:configure config.status: creating src/other/spell/xp/GNUmakefile
921:info:configure config.status: creating src/other/ttftool/GNUmakefile
922:info:configure config.status: creating src/other/ttftool/unix/GNUmakefile
923:info:configure config.status: creating src/pkg/GNUmakefile
924:info:configure config.status: creating src/pkg/linux/GNUmakefile
925:info:configure config.status: creating src/pkg/linux/apkg/GNUmakefile
926:info:configure config.status: creating src/text/GNUmakefile
927:info:configure config.status: creating src/text/fmt/GNUmakefile
928:info:configure config.status: creating src/text/fmt/xp/GNUmakefile
929:info:configure config.status: creating src/text/ptbl/GNUmakefile
930:info:configure config.status: creating src/text/ptbl/xp/GNUmakefile
931:info:configure config.status: creating src/text/ptbl/xp/t/GNUmakefile
932:info:configure config.status: creating src/wp/GNUmakefile
933:info:configure config.status: creating src/wp/ap/GNUmakefile
934:info:configure config.status: creating src/wp/ap/xp/GNUmakefile
935:info:configure config.status: creating src/wp/ap/cocoa/GNUmakefile
936:info:configure config.status: creating src/wp/ap/qnx/GNUmakefile
937:info:configure config.status: creating src/wp/ap/unix/GNUmakefile
938:info:configure config.status: creating src/wp/ap/unix/gnome/GNUmakefile
939:info:configure config.status: creating src/wp/ap/unix/hildon/GNUmakefile
940:info:configure config.status: creating src/wp/ap/win/GNUmakefile
941:info:configure config.status: creating src/wp/impexp/GNUmakefile
942:info:configure config.status: creating src/wp/impexp/cocoa/GNUmakefile
943:info:configure config.status: creating src/wp/impexp/unix/GNUmakefile
944:info:configure config.status: creating src/wp/impexp/qnx/GNUmakefile
945:info:configure config.status: creating src/wp/impexp/win/GNUmakefile
946:info:configure config.status: creating src/wp/impexp/xp/GNUmakefile
947:info:configure config.status: creating src/wp/main/GNUmakefile
948:info:configure config.status: creating src/wp/main/xp/GNUmakefile
949:info:configure config.status: creating src/wp/main/cocoa/GNUmakefile
950:info:configure config.status: creating src/wp/main/cocoa/bundle/GNUmakefile
951:info:configure config.status: creating src/wp/main/cocoa/bundle/Info.plist
952:info:configure config.status: creating src/wp/main/cocoa/AbiWord.app/GNUmakefile
953:info:configure config.status: creating src/wp/main/cocoa/AbiWord.app/Contents/GNUmakefile
954:info:configure config.status: creating src/wp/main/cocoa/AbiWord.app/Contents/MacOS/GNUmakefile
955:info:configure config.status: creating src/wp/main/cocoa/AbiWord.app/Contents/Frameworks/GNUmakefile
956:info:configure config.status: creating src/wp/main/cocoa/AbiWord.app/Contents/Resources/GNUmakefile
957:info:configure config.status: creating src/wp/main/cocoa/AbiWord.app/Contents/Resources/English.lproj/GNUmakefile
958:info:configure config.status: creating src/wp/main/qnx/GNUmakefile
959:info:configure config.status: creating src/wp/main/unix/GNUmakefile
960:info:configure config.status: creating src/wp/main/win/GNUmakefile
961:info:configure config.status: creating src/wp/test/GNUmakefile
962:info:configure config.status: creating src/wp/test/xp/GNUmakefile
963:info:configure config.status: creating src/wp/test/unix/GNUmakefile
964:info:configure config.status: creating src/wp/test/unix/testwrap.sh
965:info:configure config.status: creating src/wp/test/win/GNUmakefile
966:info:configure config.status: creating src/wp/test/win/testwrap.sh
967:info:configure config.status: creating src/tools/GNUmakefile
968:info:configure config.status: creating src/tools/cdump/GNUmakefile
969:info:configure config.status: creating src/tools/cdump/xp/GNUmakefile
970:info:configure config.status: creating src/tools/cdump/qnx/GNUmakefile
971:info:configure config.status: creating src/tools/pfa2afm/GNUmakefile
972:info:configure config.status: creating src/tools/pfa2afm/unix/GNUmakefile
973:info:configure config.status: creating src/tools/po2str/GNUmakefile
974:info:configure config.status: creating src/tools/po2str/xp/GNUmakefile
975:info:configure config.status: creating src/tools/ttftool/GNUmakefile
976:info:configure config.status: creating src/tools/ttftool/unix/GNUmakefile
977:info:configure config.status: creating src/tools/scripts/GNUmakefile
978:info:configure config.status: creating src/tools/scripts/unix/GNUmakefile
979:info:configure config.status: creating src/bindings/GNUmakefile
980:info:configure config.status: creating src/bindings/perl/GNUmakefile
981:info:configure config.status: creating src/pkg/linux/apkg/abiword-gnome.apspec
982:info:configure config.status: creating src/pkg/linux/apkg/abiword-gtk.apspec
983:info:configure config.status: creating src/pkg/maemo/debian/misc/abiword.desktop
984:info:configure config.status: creating src/pkg/maemo/debian/misc/osso-abiword.service
985:info:configure config.status: executing depfiles commands
986:info:configure 
987:info:configure Configured to build on a Mac OS X platform using Cocoa.
988:info:configure 
989:info:configure   XML Parser:      libxml2 in -L/opt/local/lib -lxml2 -lz -lpthread -liconv -lm
990:info:configure   zlib:            zlib in -L/opt/local/lib -lz
991:info:configure   PNG Library:     libpng in -L/opt/local/lib -lpng
992:info:configure   popt:            libpopt in -L/opt/local/lib -lpopt
993:info:configure   WV Library:      supplied wv in /opt/local/var/macports/build/_opt_local_var_macports_sources_rsync.macports.org_release_tarballs_ports_editors_abiword/abiword/work/abiword-2.4.5/wv
994:info:configure   iconv:           libiconv in -liconv
995:info:configure   spelling:        enchant
996:info:configure   binreloc:       
997:info:configure Type make to build AbiWord.
998:debug:configure Privilege de-escalation not attempted as not running as root.
999:debug:build build phase started at Sun Nov 20 23:44:26 CET 2011
1000:notice:build --->  Building abiword
1001:debug:build Executing org.macports.build (abiword)
1002:debug:build Environment: CPATH='/opt/local/include' CC_PRINT_OPTIONS_FILE='/opt/local/var/macports/build/_opt_local_var_macports_sources_rsync.macports.org_release_tarballs_ports_editors_abiword/abiword/work/.CC_PRINT_OPTIONS' LIBRARY_PATH='/opt/local/lib' CC_PRINT_OPTIONS='YES' MACOSX_DEPLOYMENT_TARGET='10.4'
1003:debug:build Assembled command: 'cd "/opt/local/var/macports/build/_opt_local_var_macports_sources_rsync.macports.org_release_tarballs_ports_editors_abiword/abiword/work/abiword-2.4.5/abi" && /usr/bin/make -j2 -w '
1004:debug:build Executing command line:  cd "/opt/local/var/macports/build/_opt_local_var_macports_sources_rsync.macports.org_release_tarballs_ports_editors_abiword/abiword/work/abiword-2.4.5/abi" && /usr/bin/make -j2 -w 
1005:info:build make: Entering directory `/opt/local/var/macports/build/_opt_local_var_macports_sources_rsync.macports.org_release_tarballs_ports_editors_abiword/abiword/work/abiword-2.4.5/abi'
1006:info:build cd . && /bin/sh /opt/local/var/macports/build/_opt_local_var_macports_sources_rsync.macports.org_release_tarballs_ports_editors_abiword/abiword/work/abiword-2.4.5/abi/ac-helpers/missing --run aclocal-1.9 -I ac-helpers
1007:info:build /opt/local/var/macports/build/_opt_local_var_macports_sources_rsync.macports.org_release_tarballs_ports_editors_abiword/abiword/work/abiword-2.4.5/abi/ac-helpers/missing: line 52: aclocal-1.9: command not found
1008:info:build WARNING: `aclocal-1.9' is missing on your system.  You should only need it if
1009:info:build          you modified `acinclude.m4' or `configure.ac'.  You might want
1010:info:build          to install the `Automake' and `Perl' packages.  Grab them from
1011:info:build          any GNU archive site.
1012:info:build cd . && /bin/sh /opt/local/var/macports/build/_opt_local_var_macports_sources_rsync.macports.org_release_tarballs_ports_editors_abiword/abiword/work/abiword-2.4.5/abi/ac-helpers/missing --run autoconf
1013:info:build  cd . && /bin/sh /opt/local/var/macports/build/_opt_local_var_macports_sources_rsync.macports.org_release_tarballs_ports_editors_abiword/abiword/work/abiword-2.4.5/abi/ac-helpers/missing --run automake-1.9 --foreign
1014:info:build /opt/local/var/macports/build/_opt_local_var_macports_sources_rsync.macports.org_release_tarballs_ports_editors_abiword/abiword/work/abiword-2.4.5/abi/ac-helpers/missing: line 52: automake-1.9: command not found
1015:info:build WARNING: `automake-1.9' is missing on your system.  You should only need it if
1016:info:build          you modified `Makefile.am', `acinclude.m4' or `configure.ac'.
1017:info:build          You might want to install the `Automake' and `Perl' packages.
1018:info:build          Grab them from any GNU archive site.
1019:info:build configure.ac:418: warning: AC_LANG_CONFTEST: no AC_LANG_SOURCE call detected in body
1020:info:build ../../lib/autoconf/lang.m4:194: AC_LANG_CONFTEST is expanded from...
1021:info:build ../../lib/autoconf/general.m4:2591: _AC_COMPILE_IFELSE is expanded from...
1022:info:build ../../lib/autoconf/general.m4:2607: AC_COMPILE_IFELSE is expanded from...
1023:info:build ac-helpers/abi-scandir-select.m4:20: ABI_FUNC_SCANDIR_SELECT_CHECK is expanded from...
1024:info:build configure.ac:418: the top level
1025:info:build /bin/sh ./config.status --recheck
1026:info:build running /bin/sh ./configure  --prefix=/opt/local --enable-Cocoa --mandir=/opt/local/share/man --with-zlib=/opt/local --with-libpng=/opt/local --with-popt=/opt/local --without-epath --disable-gnome CC=/usr/bin/gcc-4.0 CFLAGS=-pipe -O2 -arch i386 CPPFLAGS=-I/opt/local/include CXXFLAGS=-pipe -O2 -arch i386 CXX=/usr/bin/g++-4.0 LDFLAGS=-L/opt/local/lib -arch i386  --no-create --no-recursion
1027:info:build checking for a BSD-compatible install... /opt/local/bin/ginstall -c
1028:info:build checking whether build environment is sane... yes
1029:info:build checking for gawk... gawk
1030:info:build checking whether make sets $(MAKE)... yes
1031:info:build checking whether the C++ compiler works... yes
1032:info:build checking for C++ compiler default output file name... a.out
1033:info:build checking for suffix of executables...
1034:info:build checking whether we are cross compiling... no
1035:info:build checking for suffix of object files... o
1036:info:build checking whether we are using the GNU C++ compiler... yes
1037:info:build checking whether /usr/bin/g++-4.0 accepts -g... yes
1038:info:build checking for style of include used by make... GNU
1039:info:build checking dependency style of /usr/bin/g++-4.0... gcc3
1040:info:build checking for gcc... /usr/bin/gcc-4.0
1041:info:build checking whether we are using the GNU C compiler... yes
1042:info:build checking whether /usr/bin/gcc-4.0 accepts -g... yes
1043:info:build checking for /usr/bin/gcc-4.0 option to accept ISO C89... none needed
1044:info:build checking dependency style of /usr/bin/gcc-4.0... gcc3
1045:info:build checking for library containing strerror... none required
1046:info:build checking how to run the C preprocessor... /usr/bin/gcc-4.0 -E
1047:info:build checking CFLAGS... -pipe -O2 -arch i386
1048:info:build checking CXXFLAGS... -pipe -O2 -arch i386
1049:info:build checking whether ln -s works... yes
1050:info:build checking whether make sets $(MAKE)... (cached) yes
1051:info:build checking for ranlib... ranlib
1052:info:build checking for grep that handles long lines and -e... /usr/bin/grep
1053:info:build checking for egrep... /usr/bin/grep -E
1054:info:build checking for ANSI C header files... yes
1055:info:build checking for sys/types.h... yes
1056:info:build checking for sys/stat.h... yes
1057:info:build checking for stdlib.h... yes
1058:info:build checking for string.h... yes
1059:info:build checking for memory.h... yes
1060:info:build checking for strings.h... yes
1061:info:build checking for inttypes.h... yes
1062:info:build checking for stdint.h... yes
1063:info:build checking for unistd.h... yes
1064:info:build checking size of long int... 4
1065:info:build checking for pkg-config... /opt/local/bin/pkg-config
1066:info:build checking for glib-2.0 >= 2.0... yes
1067:info:build checking GLIB_CFLAGS... -I/opt/local/include/glib-2.0 -I/opt/local/lib/glib-2.0/include -I/opt/local/include 
1068:info:build checking GLIB_LIBS... -L/opt/local/lib -lglib-2.0 -lintl 
1069:info:build checking for gmodule-2.0 >= 2.0... yes
1070:info:build checking GMODULE_CFLAGS... -D_REENTRANT -I/opt/local/include/glib-2.0 -I/opt/local/lib/glib-2.0/include -I/opt/local/include 
1071:info:build checking GMODULE_LIBS... -L/opt/local/lib -lgmodule-2.0 -lglib-2.0 -lintl 
1072:info:build checking for gthread-2.0... yes
1073:info:build checking GTHREAD_CFLAGS... -D_REENTRANT -I/opt/local/include/glib-2.0 -I/opt/local/lib/glib-2.0/include -I/opt/local/include 
1074:info:build checking GTHREAD_LIBS... -L/opt/local/lib -lgthread-2.0 -lglib-2.0 -lintl 
1075:info:build checking iconv.h usability... yes
1076:info:build checking iconv.h presence... yes
1077:info:build checking for iconv.h... yes
1078:info:build checking for gucharmap >= 1.4... checking for enchant >= 1.1.0... yes
1079:info:build checking _abi_enchant_CFLAGS... -D_REENTRANT -I/opt/local/include/enchant -I/opt/local/include/glib-2.0 -I/opt/local/lib/glib-2.0/include -I/opt/local/include 
1080:info:build checking _abi_enchant_LIBS... -L/opt/local/lib -lenchant -lgmodule-2.0 -lglib-2.0 -lintl 
1081:info:build checking for fribidi >= 0.10.4... yes
1082:info:build checking FRIBIDI_CFLAGS... -I/opt/local/include/fribidi 
1083:info:build checking FRIBIDI_LIBS... -L/opt/local/lib -lfribidi 
1084:info:build checking for ANSI C header files... (cached) yes
1085:info:build checking limits.h usability... yes
1086:info:build checking limits.h presence... yes
1087:info:build checking for limits.h... yes
1088:info:build checking for strings.h... (cached) yes
1089:info:build checking sys/time.h usability... yes
1090:info:build checking sys/time.h presence... yes
1091:info:build checking for sys/time.h... yes
1092:info:build checking for unistd.h... (cached) yes
1093:info:build checking malloc.h usability... no
1094:info:build checking malloc.h presence... no
1095:info:build checking for malloc.h... no
1096:info:build checking for an ANSI C-conforming const... yes
1097:info:build checking for size_t... yes
1098:info:build checking whether byte ordering is bigendian... no
1099:info:build checking for xml2-config... /opt/local/bin/xml2-config
1100:info:build checking for wv... /opt/local/var/macports/build/_opt_local_var_macports_sources_rsync.macports.org_release_tarballs_ports_editors_abiword/abiword/work/abiword-2.4.5/wv
1101:info:build checking zlib.h usability... yes
1102:info:build checking zlib.h presence... yes
1103:info:build checking for zlib.h... yes
1104:info:build checking png.h usability... yes
1105:info:build checking png.h presence... yes
1106:info:build checking for png.h... yes
1107:info:build checking popt.h usability... yes
1108:info:build checking popt.h presence... yes
1109:info:build checking for popt.h... yes
1110:info:build checking for libjpeg
1111:info:build checking for jpeg_start_decompress in -ljpeg... yes
1112:info:build checking jpeglib.h usability... yes
1113:info:build checking jpeglib.h presence... yes
1114:info:build checking for jpeglib.h... yes
1115:info:build checking for working alloca.h... yes
1116:info:build checking for alloca... yes
1117:info:build checking return type of signal handlers... void
1118:info:build checking for re_comp... no
1119:info:build checking for regcomp... yes
1120:info:build checking for strdup... yes
1121:info:build checking for strstr... yes
1122:info:build checking for strcasecmp... yes
1123:info:build checking for stricmp... no
1124:info:build checking for strnlen... no
1125:info:build
1126:info:build configuring wv: srcdir=../wv, builddir=../wv
1127:info:build
1128:info:build loading cache ./config.cache
1129:info:build checking for Cygwin environment... (cached) no
1130:info:build checking for mingw32 environment... (cached) no
1131:info:build checking for executable suffix... (cached) no
1132:info:build checking for object suffix... (cached) o
1133:info:build checking for mingw32 environment... (cached) no
1134:info:build checking for gcc... (cached) /usr/bin/gcc-4.0
1135:info:build checking whether the C compiler (/usr/bin/gcc-4.0 -pipe -O2 -arch i386 -L/opt/local/lib -arch i386) works... yes
1136:info:build checking whether the C compiler (/usr/bin/gcc-4.0 -pipe -O2 -arch i386 -L/opt/local/lib -arch i386) is a cross-compiler... no
1137:info:build checking whether we are using GNU C... (cached) yes
1138:info:build checking whether /usr/bin/gcc-4.0 accepts -g... (cached) yes
1139:info:build checking whether make sets ${MAKE}... (cached) yes
1140:info:build checking for a BSD compatible install... /opt/local/bin/ginstall -c
1141:info:build checking for ranlib... (cached) ranlib
1142:info:build checking how to run the C preprocessor... (cached) /usr/bin/gcc-4.0 -E
1143:info:build checking for ANSI C header files... (cached) yes
1144:info:build checking for fcntl.h... (cached) yes
1145:info:build checking for io.h... (cached) no
1146:info:build checking for malloc.h... (cached) no
1147:info:build checking for sys/file.h... (cached) yes
1148:info:build checking for sys/ioctl.h... (cached) yes
1149:info:build checking for unistd.h... (cached) yes
1150:info:build checking for working const... (cached) yes
1151:info:build checking for zlib.h... (cached) yes
1152:info:build checking for gzread in -lz... (cached) yes
1153:info:build checking for png.h... (cached) yes
1154:info:build checking for pngconf.h... (cached) yes
1155:info:build checking for png_free in -lpng... (cached) yes
1156:info:build checking for xml2-config... (cached) /opt/local/bin/xml2-config
1157:info:build checking for libxml/parser.h... (cached) yes
1158:info:build checking for xmlParseDocument in -lxml2... (cached) yes
1159:info:build checking for pkg-config... (cached) /opt/local/bin/pkg-config
1160:info:build checking for glib-2.0 >= 2.0... yes
1161:info:build checking GLIB_CFLAGS... -I/opt/local/include/glib-2.0 -I/opt/local/lib/glib-2.0/include -I/opt/local/include 
1162:info:build checking GLIB_LIBS... -L/opt/local/lib -lglib-2.0 -lintl 
1163:info:build checking for gnome-config... no
1164:info:build checking for iconv.h... (cached) yes
1165:info:build checking for iconv_open in -liconv... (cached) no
1166:info:build checking for libiconv_open in -liconv... (cached) yes
1167:info:build checking need for const in iconv... yes
1168:info:build checking size of char... (cached) 1
1169:info:build checking size of short... (cached) 2
1170:info:build checking size of int... (cached) 4
1171:info:build checking size of long... (cached) 4
1172:info:build checking whether byte ordering is bigendian... (cached) no
1173:info:build checking for getopt_long... (cached) yes
1174:info:build checking for strerror... (cached) yes
1175:info:build checking for strcasecmp... (cached) yes
1176:info:build checking for memcpy... (cached) yes
1177:info:build checking for unistd.h... (cached) yes
1178:info:build checking for getpagesize... (cached) yes
1179:info:build checking for working mmap... (cached) yes
1180:info:build updating cache ./config.cache
1181:info:build creating ./config.status
1182:info:build creating Makefile
1183:info:build creating version.c
1184:info:build creating wvAbw
1185:info:build creating wvDVI
1186:info:build creating wvPS
1187:info:build creating wvPDF
1188:info:build creating wvHtml
1189:info:build creating wvDocBook
1190:info:build creating wvLatex
1191:info:build creating wvCleanLatex
1192:info:build creating wvText
1193:info:build creating wvWml
1194:info:build creating libole2/Makefile
1195:info:build creating glib-wv/Makefile
1196:info:build creating expat/Makefile
1197:info:build creating expat/xmltok/Makefile
1198:info:build creating expat/xmlparse/Makefile
1199:info:build creating exporter/Makefile
1200:info:build creating iconv/Makefile
1201:info:build creating magick/Makefile
1202:info:build creating config.h
1203:info:build config.h is unchanged
1204:info:build configure: warning: libwv will not have wmf to png support: see README
1205:info:build
1206:info:build checking whether scandir select requires const struct dirent... no
1207:info:build checking for valgrind... no
1208:info:build checking valgrind/memcheck.h usability... no
1209:info:build checking valgrind/memcheck.h presence... no
1210:info:build checking for valgrind/memcheck.h... no
1211:info:build configure: WARNING: Valgrind is missing. UnitTesting will run without
1212:info:build configure: creating ./config.status
1213:info:build 
1214:info:build Configured to build on a Mac OS X platform using Cocoa.
1215:info:build 
1216:info:build   XML Parser:      libxml2 in -L/opt/local/lib -lxml2 -lz -lpthread -liconv -lm
1217:info:build   zlib:            zlib in -L/opt/local/lib -lz
1218:info:build   PNG Library:     libpng in -L/opt/local/lib -lpng
1219:info:build   popt:                libpopt in -L/opt/local/lib -lpopt
1220:info:build   WV Library:      supplied wv in /opt/local/var/macports/build/_opt_local_var_macports_sources_rsync.macports.org_release_tarballs_ports_editors_abiword/abiword/work/abiword-2.4.5/wv
1221:info:build   iconv:           libiconv in -liconv
1222:info:build   spelling:        enchant
1223:info:build   binreloc:       
1224:info:build Type make to build AbiWord.
1225:info:build  /bin/sh ./config.status
1226:info:build config.status: creating GNUmakefile
1227:info:build config.status: WARNING:  'GNUmakefile.in' seems to ignore the --datarootdir setting
1228:info:build config.status: creating src/GNUmakefile
1229:info:build config.status: WARNING:  'src/GNUmakefile.in' seems to ignore the --datarootdir setting
1230:info:build config.status: creating src/af/GNUmakefile
1231:info:build config.status: WARNING:  'src/af/GNUmakefile.in' seems to ignore the --datarootdir setting
1232:info:build config.status: creating src/af/tf/GNUmakefile
1233:info:build config.status: WARNING:  'src/af/tf/GNUmakefile.in' seems to ignore the --datarootdir setting
1234:info:build config.status: creating src/af/ev/GNUmakefile
1235:info:build config.status: WARNING:  'src/af/ev/GNUmakefile.in' seems to ignore the --datarootdir setting
1236:info:build config.status: creating src/af/ev/xp/GNUmakefile
1237:info:build config.status: WARNING:  'src/af/ev/xp/GNUmakefile.in' seems to ignore the --datarootdir setting
1238:info:build config.status: creating src/af/ev/cocoa/GNUmakefile
1239:info:build config.status: WARNING:  'src/af/ev/cocoa/GNUmakefile.in' seems to ignore the --datarootdir setting
1240:info:build config.status: creating src/af/ev/qnx/GNUmakefile
1241:info:build config.status: WARNING:  'src/af/ev/qnx/GNUmakefile.in' seems to ignore the --datarootdir setting
1242:info:build config.status: creating src/af/ev/unix/GNUmakefile
1243:info:build config.status: WARNING:  'src/af/ev/unix/GNUmakefile.in' seems to ignore the --datarootdir setting
1244:info:build config.status: creating src/af/ev/unix/gnome/GNUmakefile
1245:info:build config.status: WARNING:  'src/af/ev/unix/gnome/GNUmakefile.in' seems to ignore the --datarootdir setting
1246:info:build config.status: creating src/af/ev/win/GNUmakefile
1247:info:build config.status: WARNING:  'src/af/ev/win/GNUmakefile.in' seems to ignore the --datarootdir setting
1248:info:build config.status: creating src/af/gr/GNUmakefile
1249:info:build config.status: WARNING:  'src/af/gr/GNUmakefile.in' seems to ignore the --datarootdir setting
1250:info:build config.status: creating src/af/gr/xp/GNUmakefile
1251:info:build config.status: WARNING:  'src/af/gr/xp/GNUmakefile.in' seems to ignore the --datarootdir setting
1252:info:build config.status: creating src/af/gr/cocoa/GNUmakefile
1253:info:build config.status: WARNING:  'src/af/gr/cocoa/GNUmakefile.in' seems to ignore the --datarootdir setting
1254:info:build config.status: creating src/af/gr/unix/GNUmakefile
1255:info:build config.status: WARNING:  'src/af/gr/unix/GNUmakefile.in' seems to ignore the --datarootdir setting
1256:info:build config.status: creating src/af/gr/qnx/GNUmakefile
1257:info:build config.status: WARNING:  'src/af/gr/qnx/GNUmakefile.in' seems to ignore the --datarootdir setting
1258:info:build config.status: creating src/af/gr/win/GNUmakefile
1259:info:build config.status: WARNING:  'src/af/gr/win/GNUmakefile.in' seems to ignore the --datarootdir setting
1260:info:build config.status: creating src/af/util/GNUmakefile
1261:info:build config.status: WARNING:  'src/af/util/GNUmakefile.in' seems to ignore the --datarootdir setting
1262:info:build config.status: creating src/af/util/xp/GNUmakefile
1263:info:build config.status: WARNING:  'src/af/util/xp/GNUmakefile.in' seems to ignore the --datarootdir setting
1264:info:build config.status: creating src/af/util/xp/t/GNUmakefile
1265:info:build config.status: WARNING:  'src/af/util/xp/t/GNUmakefile.in' seems to ignore the --datarootdir setting
1266:info:build config.status: creating src/af/util/unix/GNUmakefile
1267:info:build config.status: WARNING:  'src/af/util/unix/GNUmakefile.in' seems to ignore the --datarootdir setting
1268:info:build config.status: creating src/af/util/qnx/GNUmakefile
1269:info:build config.status: WARNING:  'src/af/util/qnx/GNUmakefile.in' seems to ignore the --datarootdir setting
1270:info:build config.status: creating src/af/util/win/GNUmakefile
1271:info:build config.status: WARNING:  'src/af/util/win/GNUmakefile.in' seems to ignore the --datarootdir setting
1272:info:build config.status: creating src/af/tf/xp/GNUmakefile
1273:info:build config.status: WARNING:  'src/af/tf/xp/GNUmakefile.in' seems to ignore the --datarootdir setting
1274:info:build config.status: creating src/af/xap/GNUmakefile
1275:info:build config.status: WARNING:  'src/af/xap/GNUmakefile.in' seems to ignore the --datarootdir setting
1276:info:build config.status: creating src/af/xap/xp/GNUmakefile
1277:info:build config.status: WARNING:  'src/af/xap/xp/GNUmakefile.in' seems to ignore the --datarootdir setting
1278:info:build config.status: creating src/af/xap/cocoa/GNUmakefile
1279:info:build config.status: WARNING:  'src/af/xap/cocoa/GNUmakefile.in' seems to ignore the --datarootdir setting
1280:info:build config.status: creating src/af/xap/qnx/GNUmakefile
1281:info:build config.status: WARNING:  'src/af/xap/qnx/GNUmakefile.in' seems to ignore the --datarootdir setting
1282:info:build config.status: creating src/af/xap/win/GNUmakefile
1283:info:build config.status: WARNING:  'src/af/xap/win/GNUmakefile.in' seems to ignore the --datarootdir setting
1284:info:build config.status: creating src/af/xap/unix/GNUmakefile
1285:info:build config.status: WARNING:  'src/af/xap/unix/GNUmakefile.in' seems to ignore the --datarootdir setting
1286:info:build config.status: creating src/af/xap/unix/t/GNUmakefile
1287:info:build config.status: WARNING:  'src/af/xap/unix/t/GNUmakefile.in' seems to ignore the --datarootdir setting
1288:info:build config.status: creating src/af/xap/unix/gnome/GNUmakefile
1289:info:build config.status: WARNING:  'src/af/xap/unix/gnome/GNUmakefile.in' seems to ignore the --datarootdir setting
1290:info:build config.status: creating src/af/xap/unix/hildon/GNUmakefile
1291:info:build config.status: WARNING:  'src/af/xap/unix/hildon/GNUmakefile.in' seems to ignore the --datarootdir setting
1292:info:build config.status: creating src/other/GNUmakefile
1293:info:build config.status: WARNING:  'src/other/GNUmakefile.in' seems to ignore the --datarootdir setting
1294:info:build config.status: creating src/other/spell/GNUmakefile
1295:info:build config.status: WARNING:  'src/other/spell/GNUmakefile.in' seems to ignore the --datarootdir setting
1296:info:build config.status: creating src/other/spell/xp/GNUmakefile
1297:info:build config.status: WARNING:  'src/other/spell/xp/GNUmakefile.in' seems to ignore the --datarootdir setting
1298:info:build config.status: creating src/other/ttftool/GNUmakefile
1299:info:build config.status: WARNING:  'src/other/ttftool/GNUmakefile.in' seems to ignore the --datarootdir setting
1300:info:build config.status: creating src/other/ttftool/unix/GNUmakefile
1301:info:build config.status: WARNING:  'src/other/ttftool/unix/GNUmakefile.in' seems to ignore the --datarootdir setting
1302:info:build config.status: creating src/pkg/GNUmakefile
1303:info:build config.status: WARNING:  'src/pkg/GNUmakefile.in' seems to ignore the --datarootdir setting
1304:info:build config.status: creating src/pkg/linux/GNUmakefile
1305:info:build config.status: WARNING:  'src/pkg/linux/GNUmakefile.in' seems to ignore the --datarootdir setting
1306:info:build config.status: creating src/pkg/linux/apkg/GNUmakefile
1307:info:build config.status: WARNING:  'src/pkg/linux/apkg/GNUmakefile.in' seems to ignore the --datarootdir setting
1308:info:build config.status: creating src/text/GNUmakefile
1309:info:build config.status: WARNING:  'src/text/GNUmakefile.in' seems to ignore the --datarootdir setting
1310:info:build config.status: creating src/text/fmt/GNUmakefile
1311:info:build config.status: WARNING:  'src/text/fmt/GNUmakefile.in' seems to ignore the --datarootdir setting
1312:info:build config.status: creating src/text/fmt/xp/GNUmakefile
1313:info:build config.status: WARNING:  'src/text/fmt/xp/GNUmakefile.in' seems to ignore the --datarootdir setting
1314:info:build config.status: creating src/text/ptbl/GNUmakefile
1315:info:build config.status: WARNING:  'src/text/ptbl/GNUmakefile.in' seems to ignore the --datarootdir setting
1316:info:build config.status: creating src/text/ptbl/xp/GNUmakefile
1317:info:build config.status: WARNING:  'src/text/ptbl/xp/GNUmakefile.in' seems to ignore the --datarootdir setting
1318:info:build config.status: creating src/text/ptbl/xp/t/GNUmakefile
1319:info:build config.status: WARNING:  'src/text/ptbl/xp/t/GNUmakefile.in' seems to ignore the --datarootdir setting
1320:info:build config.status: creating src/wp/GNUmakefile
1321:info:build config.status: WARNING:  'src/wp/GNUmakefile.in' seems to ignore the --datarootdir setting
1322:info:build config.status: creating src/wp/ap/GNUmakefile
1323:info:build config.status: WARNING:  'src/wp/ap/GNUmakefile.in' seems to ignore the --datarootdir setting
1324:info:build config.status: creating src/wp/ap/xp/GNUmakefile
1325:info:build config.status: WARNING:  'src/wp/ap/xp/GNUmakefile.in' seems to ignore the --datarootdir setting
1326:info:build config.status: creating src/wp/ap/cocoa/GNUmakefile
1327:info:build config.status: WARNING:  'src/wp/ap/cocoa/GNUmakefile.in' seems to ignore the --datarootdir setting
1328:info:build config.status: creating src/wp/ap/qnx/GNUmakefile
1329:info:build config.status: WARNING:  'src/wp/ap/qnx/GNUmakefile.in' seems to ignore the --datarootdir setting
1330:info:build config.status: creating src/wp/ap/unix/GNUmakefile
1331:info:build config.status: WARNING:  'src/wp/ap/unix/GNUmakefile.in' seems to ignore the --datarootdir setting
1332:info:build config.status: creating src/wp/ap/unix/gnome/GNUmakefile
1333:info:build config.status: WARNING:  'src/wp/ap/unix/gnome/GNUmakefile.in' seems to ignore the --datarootdir setting
1334:info:build config.status: creating src/wp/ap/unix/hildon/GNUmakefile
1335:info:build config.status: WARNING:  'src/wp/ap/unix/hildon/GNUmakefile.in' seems to ignore the --datarootdir setting
1336:info:build config.status: creating src/wp/ap/win/GNUmakefile
1337:info:build config.status: WARNING:  'src/wp/ap/win/GNUmakefile.in' seems to ignore the --datarootdir setting
1338:info:build config.status: creating src/wp/impexp/GNUmakefile
1339:info:build config.status: WARNING:  'src/wp/impexp/GNUmakefile.in' seems to ignore the --datarootdir setting
1340:info:build config.status: creating src/wp/impexp/cocoa/GNUmakefile
1341:info:build config.status: WARNING:  'src/wp/impexp/cocoa/GNUmakefile.in' seems to ignore the --datarootdir setting
1342:info:build config.status: creating src/wp/impexp/unix/GNUmakefile
1343:info:build config.status: WARNING:  'src/wp/impexp/unix/GNUmakefile.in' seems to ignore the --datarootdir setting
1344:info:build config.status: creating src/wp/impexp/qnx/GNUmakefile
1345:info:build config.status: WARNING:  'src/wp/impexp/qnx/GNUmakefile.in' seems to ignore the --datarootdir setting
1346:info:build config.status: creating src/wp/impexp/win/GNUmakefile
1347:info:build config.status: WARNING:  'src/wp/impexp/win/GNUmakefile.in' seems to ignore the --datarootdir setting
1348:info:build config.status: creating src/wp/impexp/xp/GNUmakefile
1349:info:build config.status: WARNING:  'src/wp/impexp/xp/GNUmakefile.in' seems to ignore the --datarootdir setting
1350:info:build config.status: creating src/wp/main/GNUmakefile
1351:info:build config.status: WARNING:  'src/wp/main/GNUmakefile.in' seems to ignore the --datarootdir setting
1352:info:build config.status: creating src/wp/main/xp/GNUmakefile
1353:info:build config.status: WARNING:  'src/wp/main/xp/GNUmakefile.in' seems to ignore the --datarootdir setting
1354:info:build config.status: creating src/wp/main/cocoa/GNUmakefile
1355:info:build config.status: WARNING:  'src/wp/main/cocoa/GNUmakefile.in' seems to ignore the --datarootdir setting
1356:info:build config.status: creating src/wp/main/cocoa/bundle/GNUmakefile
1357:info:build config.status: WARNING:  'src/wp/main/cocoa/bundle/GNUmakefile.in' seems to ignore the --datarootdir setting
1358:info:build config.status: creating src/wp/main/cocoa/bundle/Info.plist
1359:info:build config.status: creating src/wp/main/cocoa/AbiWord.app/GNUmakefile
1360:info:build config.status: WARNING:  'src/wp/main/cocoa/AbiWord.app/GNUmakefile.in' seems to ignore the --datarootdir setting
1361:info:build config.status: creating src/wp/main/cocoa/AbiWord.app/Contents/GNUmakefile
1362:info:build config.status: WARNING:  'src/wp/main/cocoa/AbiWord.app/Contents/GNUmakefile.in' seems to ignore the --datarootdir setting
1363:info:build config.status: creating src/wp/main/cocoa/AbiWord.app/Contents/MacOS/GNUmakefile
1364:info:build config.status: WARNING:  'src/wp/main/cocoa/AbiWord.app/Contents/MacOS/GNUmakefile.in' seems to ignore the --datarootdir setting
1365:info:build config.status: creating src/wp/main/cocoa/AbiWord.app/Contents/Frameworks/GNUmakefile
1366:info:build config.status: WARNING:  'src/wp/main/cocoa/AbiWord.app/Contents/Frameworks/GNUmakefile.in' seems to ignore the --datarootdir setting
1367:info:build config.status: creating src/wp/main/cocoa/AbiWord.app/Contents/Resources/GNUmakefile
1368:info:build config.status: WARNING:  'src/wp/main/cocoa/AbiWord.app/Contents/Resources/GNUmakefile.in' seems to ignore the --datarootdir setting
1369:info:build config.status: creating src/wp/main/cocoa/AbiWord.app/Contents/Resources/English.lproj/GNUmakefile
1370:info:build config.status: WARNING:  'src/wp/main/cocoa/AbiWord.app/Contents/Resources/English.lproj/GNUmakefile.in' seems to ignore the --datarootdir setting
1371:info:build config.status: creating src/wp/main/qnx/GNUmakefile
1372:info:build config.status: WARNING:  'src/wp/main/qnx/GNUmakefile.in' seems to ignore the --datarootdir setting
1373:info:build config.status: creating src/wp/main/unix/GNUmakefile
1374:info:build config.status: WARNING:  'src/wp/main/unix/GNUmakefile.in' seems to ignore the --datarootdir setting
1375:info:build config.status: creating src/wp/main/win/GNUmakefile
1376:info:build config.status: WARNING:  'src/wp/main/win/GNUmakefile.in' seems to ignore the --datarootdir setting
1377:info:build config.status: creating src/wp/test/GNUmakefile
1378:info:build config.status: WARNING:  'src/wp/test/GNUmakefile.in' seems to ignore the --datarootdir setting
1379:info:build config.status: creating src/wp/test/xp/GNUmakefile
1380:info:build config.status: WARNING:  'src/wp/test/xp/GNUmakefile.in' seems to ignore the --datarootdir setting
1381:info:build config.status: creating src/wp/test/unix/GNUmakefile
1382:info:build config.status: WARNING:  'src/wp/test/unix/GNUmakefile.in' seems to ignore the --datarootdir setting
1383:info:build config.status: creating src/wp/test/unix/testwrap.sh
1384:info:build config.status: creating src/wp/test/win/GNUmakefile
1385:info:build config.status: WARNING:  'src/wp/test/win/GNUmakefile.in' seems to ignore the --datarootdir setting
1386:info:build config.status: creating src/wp/test/win/testwrap.sh
1387:info:build config.status: creating src/tools/GNUmakefile
1388:info:build config.status: WARNING:  'src/tools/GNUmakefile.in' seems to ignore the --datarootdir setting
1389:info:build config.status: creating src/tools/cdump/GNUmakefile
1390:info:build config.status: WARNING:  'src/tools/cdump/GNUmakefile.in' seems to ignore the --datarootdir setting
1391:info:build config.status: creating src/tools/cdump/xp/GNUmakefile
1392:info:build config.status: WARNING:  'src/tools/cdump/xp/GNUmakefile.in' seems to ignore the --datarootdir setting
1393:info:build config.status: creating src/tools/cdump/qnx/GNUmakefile
1394:info:build config.status: WARNING:  'src/tools/cdump/qnx/GNUmakefile.in' seems to ignore the --datarootdir setting
1395:info:build config.status: creating src/tools/pfa2afm/GNUmakefile
1396:info:build config.status: WARNING:  'src/tools/pfa2afm/GNUmakefile.in' seems to ignore the --datarootdir setting
1397:info:build config.status: creating src/tools/pfa2afm/unix/GNUmakefile
1398:info:build config.status: WARNING:  'src/tools/pfa2afm/unix/GNUmakefile.in' seems to ignore the --datarootdir setting
1399:info:build config.status: creating src/tools/po2str/GNUmakefile
1400:info:build config.status: WARNING:  'src/tools/po2str/GNUmakefile.in' seems to ignore the --datarootdir setting
1401:info:build config.status: creating src/tools/po2str/xp/GNUmakefile
1402:info:build config.status: WARNING:  'src/tools/po2str/xp/GNUmakefile.in' seems to ignore the --datarootdir setting
1403:info:build config.status: creating src/tools/ttftool/GNUmakefile
1404:info:build config.status: WARNING:  'src/tools/ttftool/GNUmakefile.in' seems to ignore the --datarootdir setting
1405:info:build config.status: creating src/tools/ttftool/unix/GNUmakefile
1406:info:build config.status: WARNING:  'src/tools/ttftool/unix/GNUmakefile.in' seems to ignore the --datarootdir setting
1407:info:build config.status: creating src/tools/scripts/GNUmakefile
1408:info:build config.status: WARNING:  'src/tools/scripts/GNUmakefile.in' seems to ignore the --datarootdir setting
1409:info:build config.status: creating src/tools/scripts/unix/GNUmakefile
1410:info:build config.status: WARNING:  'src/tools/scripts/unix/GNUmakefile.in' seems to ignore the --datarootdir setting
1411:info:build config.status: creating src/bindings/GNUmakefile
1412:info:build config.status: WARNING:  'src/bindings/GNUmakefile.in' seems to ignore the --datarootdir setting
1413:info:build config.status: creating src/bindings/perl/GNUmakefile
1414:info:build config.status: WARNING:  'src/bindings/perl/GNUmakefile.in' seems to ignore the --datarootdir setting
1415:info:build config.status: creating src/pkg/linux/apkg/abiword-gnome.apspec
1416:info:build config.status: creating src/pkg/linux/apkg/abiword-gtk.apspec
1417:info:build config.status: creating src/pkg/maemo/debian/misc/abiword.desktop
1418:info:build config.status: creating src/pkg/maemo/debian/misc/osso-abiword.service
1419:info:build config.status: executing depfiles commands
1420:info:build make: Leaving directory `/opt/local/var/macports/build/_opt_local_var_macports_sources_rsync.macports.org_release_tarballs_ports_editors_abiword/abiword/work/abiword-2.4.5/abi'
1421:info:build make: Entering directory `/opt/local/var/macports/build/_opt_local_var_macports_sources_rsync.macports.org_release_tarballs_ports_editors_abiword/abiword/work/abiword-2.4.5/abi'
1422:info:build  cd . && /bin/sh /opt/local/var/macports/build/_opt_local_var_macports_sources_rsync.macports.org_release_tarballs_ports_editors_abiword/abiword/work/abiword-2.4.5/abi/ac-helpers/missing --run automake-1.9 --foreign
1423:info:build /opt/local/var/macports/build/_opt_local_var_macports_sources_rsync.macports.org_release_tarballs_ports_editors_abiword/abiword/work/abiword-2.4.5/abi/ac-helpers/missing: line 52: automake-1.9: command not found
1424:info:build WARNING: `automake-1.9' is missing on your system.  You should only need it if
1425:info:build          you modified `Makefile.am', `acinclude.m4' or `configure.ac'.
1426:info:build          You might want to install the `Automake' and `Perl' packages.
1427:info:build          Grab them from any GNU archive site.
1428:info:build /usr/bin/make -C ./../wv BUILD_FOR_ABIWORD=1
1429:info:build make[1]: Entering directory `/opt/local/var/macports/build/_opt_local_var_macports_sources_rsync.macports.org_release_tarballs_ports_editors_abiword/abiword/work/abiword-2.4.5/wv'
1430:info:build using system xml support... will not compile expat
1431:info:build making magick in magick
1432:info:build not making glib-wv... using system glib instead
1433:info:build /usr/bin/gcc-4.0 -I. -I../wv -I../wv/magick -I../wv/libole2  -DHAVE_CONFIG_H -DVERSION=\"1.0.3\" -DXMLCONFIG=\"/usr/local/share/wv/wvConfig.xml\" -DHTMLCONFIG=\"/usr/local/share/wv/wvHtml.xml\" -DWVDATADIR=\"/usr/local/share/wv\" -I/opt/local/include    -I/opt/local/include/libxml2 -I/opt/local/include/glib-2.0 -I/opt/local/lib/glib-2.0/include -I/opt/local/include   -I/opt/local/include -I/opt/local/include -pipe -O2 -arch i386 -Wno-long-long -no-cpp-precomp -ansi -pedantic  -c ../wv/winmmap.c
1434:info:build make[2]: Entering directory `/opt/local/var/macports/build/_opt_local_var_macports_sources_rsync.macports.org_release_tarballs_ports_editors_abiword/abiword/work/abiword-2.4.5/wv/magick'
1435:info:build /usr/bin/gcc-4.0 -I.. -I../../wv/magick -I../../wv/magick/.. -DHAVE_CONFIG_H -I/opt/local/include  -pipe -O2 -arch i386 -Wno-long-long -no-cpp-precomp -I/opt/local/include -I/opt/local/include  -c ../../wv/magick/magick.c
1436:info:build /usr/bin/gcc-4.0 -I. -I../wv -I../wv/magick -I../wv/libole2  -DHAVE_CONFIG_H -DVERSION=\"1.0.3\" -DXMLCONFIG=\"/usr/local/share/wv/wvConfig.xml\" -DHTMLCONFIG=\"/usr/local/share/wv/wvHtml.xml\" -DWVDATADIR=\"/usr/local/share/wv\" -I/opt/local/include    -I/opt/local/include/libxml2 -I/opt/local/include/glib-2.0 -I/opt/local/lib/glib-2.0/include -I/opt/local/include   -I/opt/local/include -I/opt/local/include -pipe -O2 -arch i386 -Wno-long-long -no-cpp-precomp -ansi -pedantic  -c ../wv/support.c
1437:info:build /usr/bin/gcc-4.0 -I.. -I../../wv/magick -I../../wv/magick/.. -DHAVE_CONFIG_H -I/opt/local/include  -pipe -O2 -arch i386 -Wno-long-long -no-cpp-precomp -I/opt/local/include -I/opt/local/include  -c ../../wv/magick/image.c
1438:info:build /usr/bin/gcc-4.0 -I. -I../wv -I../wv/magick -I../wv/libole2  -DHAVE_CONFIG_H -DVERSION=\"1.0.3\" -DXMLCONFIG=\"/usr/local/share/wv/wvConfig.xml\" -DHTMLCONFIG=\"/usr/local/share/wv/wvHtml.xml\" -DWVDATADIR=\"/usr/local/share/wv\" -I/opt/local/include    -I/opt/local/include/libxml2 -I/opt/local/include/glib-2.0 -I/opt/local/lib/glib-2.0/include -I/opt/local/include   -I/opt/local/include -I/opt/local/include -pipe -O2 -arch i386 -Wno-long-long -no-cpp-precomp -ansi -pedantic  -c ../wv/list.c
1439:info:build /usr/bin/gcc-4.0 -I.. -I../../wv/magick -I../../wv/magick/.. -DHAVE_CONFIG_H -I/opt/local/include  -pipe -O2 -arch i386 -Wno-long-long -no-cpp-precomp -I/opt/local/include -I/opt/local/include  -c ../../wv/magick/blob.c
1440:info:build /usr/bin/gcc-4.0 -I. -I../wv -I../wv/magick -I../wv/libole2  -DHAVE_CONFIG_H -DVERSION=\"1.0.3\" -DXMLCONFIG=\"/usr/local/share/wv/wvConfig.xml\" -DHTMLCONFIG=\"/usr/local/share/wv/wvHtml.xml\" -DWVDATADIR=\"/usr/local/share/wv\" -I/opt/local/include    -I/opt/local/include/libxml2 -I/opt/local/include/glib-2.0 -I/opt/local/lib/glib-2.0/include -I/opt/local/include   -I/opt/local/include -I/opt/local/include -pipe -O2 -arch i386 -Wno-long-long -no-cpp-precomp -ansi -pedantic  -c ../wv/stylesheet.c
1441:info:build /usr/bin/gcc-4.0 -I.. -I../../wv/magick -I../../wv/magick/.. -DHAVE_CONFIG_H -I/opt/local/include  -pipe -O2 -arch i386 -Wno-long-long -no-cpp-precomp -I/opt/local/include -I/opt/local/include  -c ../../wv/magick/colors.c
1442:info:build /usr/bin/gcc-4.0 -I.. -I../../wv/magick -I../../wv/magick/.. -DHAVE_CONFIG_H -I/opt/local/include  -pipe -O2 -arch i386 -Wno-long-long -no-cpp-precomp -I/opt/local/include -I/opt/local/include  -c ../../wv/magick/error.c
1443:info:build /usr/bin/gcc-4.0 -I.. -I../../wv/magick -I../../wv/magick/.. -DHAVE_CONFIG_H -I/opt/local/include  -pipe -O2 -arch i386 -Wno-long-long -no-cpp-precomp -I/opt/local/include -I/opt/local/include  -c ../../wv/magick/transform.c
1444:info:build /usr/bin/gcc-4.0 -I. -I../wv -I../wv/magick -I../wv/libole2  -DHAVE_CONFIG_H -DVERSION=\"1.0.3\" -DXMLCONFIG=\"/usr/local/share/wv/wvConfig.xml\" -DHTMLCONFIG=\"/usr/local/share/wv/wvHtml.xml\" -DWVDATADIR=\"/usr/local/share/wv\" -I/opt/local/include    -I/opt/local/include/libxml2 -I/opt/local/include/glib-2.0 -I/opt/local/lib/glib-2.0/include -I/opt/local/include   -I/opt/local/include -I/opt/local/include -pipe -O2 -arch i386 -Wno-long-long -no-cpp-precomp -ansi -pedantic  -c ../wv/sprm.c
1445:info:build /usr/bin/gcc-4.0 -I.. -I../../wv/magick -I../../wv/magick/.. -DHAVE_CONFIG_H -I/opt/local/include  -pipe -O2 -arch i386 -Wno-long-long -no-cpp-precomp -I/opt/local/include -I/opt/local/include  -c ../../wv/magick/compress.c
1446:info:build /usr/bin/gcc-4.0 -I.. -I../../wv/magick -I../../wv/magick/.. -DHAVE_CONFIG_H -I/opt/local/include  -pipe -O2 -arch i386 -Wno-long-long -no-cpp-precomp -I/opt/local/include -I/opt/local/include  -c ../../wv/magick/memory.c
1447:info:build /usr/bin/gcc-4.0 -I.. -I../../wv/magick -I../../wv/magick/.. -DHAVE_CONFIG_H -I/opt/local/include  -pipe -O2 -arch i386 -Wno-long-long -no-cpp-precomp -I/opt/local/include -I/opt/local/include  -c ../../wv/magick/utility.c
1448:info:build /usr/bin/gcc-4.0 -I.. -I../../wv/magick -I../../wv/magick/.. -DHAVE_CONFIG_H -I/opt/local/include  -pipe -O2 -arch i386 -Wno-long-long -no-cpp-precomp -I/opt/local/include -I/opt/local/include  -c ../../wv/magick/png.c
1449:info:build ../../wv/magick/png.c: In function ‘PNGErrorHandler’:
1450:info:build ../../wv/magick/png.c:475: warning: ‘jmpbuf’ is deprecated (declared at /opt/local/include/png.h:1114)
1451:info:build ../../wv/magick/png.c: In function ‘ReadTextChunk’:
1452:info:build ../../wv/magick/png.c:483: warning: ‘text’ is deprecated (declared at /opt/local/include/png.h:721)
1453:info:build ../../wv/magick/png.c:498: warning: ‘text’ is deprecated (declared at /opt/local/include/png.h:721)
1454:info:build ../../wv/magick/png.c: In function ‘ReadPNGImage’:
1455:info:build ../../wv/magick/png.c:1794: warning: ‘jmpbuf’ is deprecated (declared at /opt/local/include/png.h:1114)
1456:info:build ../../wv/magick/png.c:1834: warning: ‘bit_depth’ is deprecated (declared at /opt/local/include/png.h:667)
1457:info:build ../../wv/magick/png.c:1835: warning: ‘bit_depth’ is deprecated (declared at /opt/local/include/png.h:667)
1458:info:build ../../wv/magick/png.c:1837: warning: ‘color_type’ is deprecated (declared at /opt/local/include/png.h:669)
1459:info:build ../../wv/magick/png.c:1838: warning: ‘color_type’ is deprecated (declared at /opt/local/include/png.h:669)
1460:info:build ../../wv/magick/png.c:1845: warning: ‘valid’ is deprecated (declared at /opt/local/include/png.h:657)
1461:info:build ../../wv/magick/png.c:1846: warning: ‘srgb_intent’ is deprecated (declared at /opt/local/include/png.h:706)
1462:info:build ../../wv/magick/png.c:1850: warning: ‘valid’ is deprecated (declared at /opt/local/include/png.h:657)
1463:info:build ../../wv/magick/png.c:1851: warning: ‘gamma’ is deprecated (declared at /opt/local/include/png.h:699)
1464:info:build ../../wv/magick/png.c:1854: warning: ‘valid’ is deprecated (declared at /opt/local/include/png.h:657)
1465:info:build ../../wv/magick/png.c:1856: warning: ‘x_white’ is deprecated (declared at /opt/local/include/png.h:808)
1466:info:build ../../wv/magick/png.c:1857: warning: ‘y_white’ is deprecated (declared at /opt/local/include/png.h:809)
1467:info:build ../../wv/magick/png.c:1858: warning: ‘x_red’ is deprecated (declared at /opt/local/include/png.h:810)
1468:info:build ../../wv/magick/png.c:1859: warning: ‘y_red’ is deprecated (declared at /opt/local/include/png.h:811)
1469:info:build ../../wv/magick/png.c:1860: warning: ‘x_green’ is deprecated (declared at /opt/local/include/png.h:812)
1470:info:build ../../wv/magick/png.c:1861: warning: ‘y_green’ is deprecated (declared at /opt/local/include/png.h:813)
1471:info:build ../../wv/magick/png.c:1862: warning: ‘x_blue’ is deprecated (declared at /opt/local/include/png.h:814)
1472:info:build ../../wv/magick/png.c:1863: warning: ‘y_blue’ is deprecated (declared at /opt/local/include/png.h:815)
1473:info:build ../../wv/magick/png.c:1878: warning: ‘valid’ is deprecated (declared at /opt/local/include/png.h:657)
1474:info:build ../../wv/magick/png.c:1880: warning: ‘valid’ is deprecated (declared at /opt/local/include/png.h:657)
1475:info:build ../../wv/magick/png.c:1881: warning: ‘valid’ is deprecated (declared at /opt/local/include/png.h:657)
1476:info:build ../../wv/magick/png.c:1886: warning: ‘x_pixels_per_unit’ is deprecated (declared at /opt/local/include/png.h:784)
1477:info:build ../../wv/magick/png.c:1887: warning: ‘y_pixels_per_unit’ is deprecated (declared at /opt/local/include/png.h:785)
1478:info:build ../../wv/magick/png.c:1888: warning: ‘phys_unit_type’ is deprecated (declared at /opt/local/include/png.h:786)
1479:info:build ../../wv/magick/png.c:1891: warning: ‘x_pixels_per_unit’ is deprecated (declared at /opt/local/include/png.h:784)
1480:info:build ../../wv/magick/png.c:1892: warning: ‘y_pixels_per_unit’ is deprecated (declared at /opt/local/include/png.h:785)
1481:info:build ../../wv/magick/png.c:1907: warning: ‘valid’ is deprecated (declared at /opt/local/include/png.h:657)
1482:info:build ../../wv/magick/png.c:1911: warning: ‘valid’ is deprecated (declared at /opt/local/include/png.h:657)
1483:info:build ../../wv/magick/png.c:1920: warning: ‘color_type’ is deprecated (declared at /opt/local/include/png.h:669)
1484:info:build ../../wv/magick/png.c:1927: warning: ‘valid’ is deprecated (declared at /opt/local/include/png.h:657)
1485:info:build ../../wv/magick/png.c:1944: warning: ‘valid’ is deprecated (declared at /opt/local/include/png.h:657)
1486:info:build ../../wv/magick/png.c:1954: warning: ‘background’ is deprecated (declared at /opt/local/include/png.h:765)
1487:info:build ../../wv/magick/png.c:1972: warning: ‘valid’ is deprecated (declared at /opt/local/include/png.h:657)
1488:info:build ../../wv/magick/png.c:1985: warning: ‘valid’ is deprecated (declared at /opt/local/include/png.h:657)
1489:info:build ../../wv/magick/png.c:1990: warning: ‘bit_depth’ is deprecated (declared at /opt/local/include/png.h:667)
1490:info:build ../../wv/magick/png.c:1992: warning: ‘background’ is deprecated (declared at /opt/local/include/png.h:765)
1491:info:build ../../wv/magick/png.c:1993: warning: ‘background’ is deprecated (declared at /opt/local/include/png.h:765)
1492:info:build ../../wv/magick/png.c:1994: warning: ‘background’ is deprecated (declared at /opt/local/include/png.h:765)
1493:info:build ../../wv/magick/png.c:1999: warning: ‘background’ is deprecated (declared at /opt/local/include/png.h:765)
1494:info:build ../../wv/magick/png.c:2001: warning: ‘background’ is deprecated (declared at /opt/local/include/png.h:765)
1495:info:build ../../wv/magick/png.c:2003: warning: ‘background’ is deprecated (declared at /opt/local/include/png.h:765)
1496:info:build ../../wv/magick/png.c:2008: warning: ‘background’ is deprecated (declared at /opt/local/include/png.h:765)
1497:info:build ../../wv/magick/png.c:2009: warning: ‘background’ is deprecated (declared at /opt/local/include/png.h:765)
1498:info:build ../../wv/magick/png.c:2009: warning: ‘background’ is deprecated (declared at /opt/local/include/png.h:765)
1499:info:build ../../wv/magick/png.c:2013: warning: ‘valid’ is deprecated (declared at /opt/local/include/png.h:657)
1500:info:build ../../wv/magick/png.c:2018: error: ‘struct png_info_struct’ has no member named ‘trans_values’
1501:info:build ../../wv/magick/png.c:2019: error: ‘struct png_info_struct’ has no member named ‘trans_values’
1502:info:build ../../wv/magick/png.c:2020: error: ‘struct png_info_struct’ has no member named ‘trans_values’
1503:info:build ../../wv/magick/png.c:2021: error: ‘struct png_info_struct’ has no member named ‘trans_values’
1504:info:build ../../wv/magick/png.c:2022: warning: ‘color_type’ is deprecated (declared at /opt/local/include/png.h:669)
1505:info:build ../../wv/magick/png.c:2032: error: ‘struct png_info_struct’ has no member named ‘trans_values’
1506:info:build ../../wv/magick/png.c:2033: error: ‘struct png_info_struct’ has no member named ‘trans_values’
1507:info:build ../../wv/magick/png.c:2033: error: ‘struct png_info_struct’ has no member named ‘trans_values’
1508:info:build ../../wv/magick/png.c:2034: error: ‘struct png_info_struct’ has no member named ‘trans_values’
1509:info:build ../../wv/magick/png.c:2035: warning: ‘color_type’ is deprecated (declared at /opt/local/include/png.h:669)
1510:info:build ../../wv/magick/png.c:2041: warning: ‘valid’ is deprecated (declared at /opt/local/include/png.h:657)
1511:info:build ../../wv/magick/png.c:2049: warning: ‘width’ is deprecated (declared at /opt/local/include/png.h:655)
1512:info:build ../../wv/magick/png.c:2051: warning: ‘height’ is deprecated (declared at /opt/local/include/png.h:656)
1513:info:build ../../wv/magick/png.c:2054: warning: ‘width’ is deprecated (declared at /opt/local/include/png.h:655)
1514:info:build ../../wv/magick/png.c:2055: warning: ‘height’ is deprecated (declared at /opt/local/include/png.h:656)
1515:info:build ../../wv/magick/png.c:2063: warning: ‘width’ is deprecated (declared at /opt/local/include/png.h:655)
1516:info:build ../../wv/magick/png.c:2063: warning: ‘height’ is deprecated (declared at /opt/local/include/png.h:656)
1517:info:build ../../wv/magick/png.c:2066: warning: ‘width’ is deprecated (declared at /opt/local/include/png.h:655)
1518:info:build ../../wv/magick/png.c:2067: warning: ‘height’ is deprecated (declared at /opt/local/include/png.h:656)
1519:info:build ../../wv/magick/png.c:2068: warning: ‘color_type’ is deprecated (declared at /opt/local/include/png.h:669)
1520:info:build ../../wv/magick/png.c:2069: warning: ‘color_type’ is deprecated (declared at /opt/local/include/png.h:669)
1521:info:build ../../wv/magick/png.c:2072: warning: ‘bit_depth’ is deprecated (declared at /opt/local/include/png.h:667)
1522:info:build ../../wv/magick/png.c:2072: warning: ‘bit_depth’ is deprecated (declared at /opt/local/include/png.h:667)
1523:info:build ../../wv/magick/png.c:2073: warning: ‘color_type’ is deprecated (declared at /opt/local/include/png.h:669)
1524:info:build ../../wv/magick/png.c:2074: warning: ‘num_palette’ is deprecated (declared at /opt/local/include/png.h:663)
1525:info:build ../../wv/magick/png.c:2084: warning: ‘rowbytes’ is deprecated (declared at /opt/local/include/png.h:659)
1526:info:build ../../wv/magick/png.c:2086: warning: ‘rowbytes’ is deprecated (declared at /opt/local/include/png.h:659)
1527:info:build ../../wv/magick/png.c:2107: warning: ‘color_type’ is deprecated (declared at /opt/local/include/png.h:669)
1528:info:build ../../wv/magick/png.c:2111: warning: ‘palette’ is deprecated (declared at /opt/local/include/png.h:661)
1529:info:build ../../wv/magick/png.c:2113: warning: ‘palette’ is deprecated (declared at /opt/local/include/png.h:661)
1530:info:build ../../wv/magick/png.c:2115: warning: ‘palette’ is deprecated (declared at /opt/local/include/png.h:661)
1531:info:build ../../wv/magick/png.c:2131: warning: ‘rowbytes’ is deprecated (declared at /opt/local/include/png.h:659)
1532:info:build ../../wv/magick/png.c:2151: warning: ‘color_type’ is deprecated (declared at /opt/local/include/png.h:669)
1533:info:build ../../wv/magick/png.c:2152: warning: ‘color_type’ is deprecated (declared at /opt/local/include/png.h:669)
1534:info:build ../../wv/magick/png.c:2153: warning: ‘valid’ is deprecated (declared at /opt/local/include/png.h:657)
1535:info:build ../../wv/magick/png.c:2163: warning: ‘color_type’ is deprecated (declared at /opt/local/include/png.h:669)
1536:info:build ../../wv/magick/png.c:2164: warning: ‘color_type’ is deprecated (declared at /opt/local/include/png.h:669)
1537:info:build ../../wv/magick/png.c:2170: warning: ‘color_type’ is deprecated (declared at /opt/local/include/png.h:669)
1538:info:build ../../wv/magick/png.c:2171: warning: ‘color_type’ is deprecated (declared at /opt/local/include/png.h:669)
1539:info:build ../../wv/magick/png.c:2173: warning: ‘valid’ is deprecated (declared at /opt/local/include/png.h:657)
1540:info:build ../../wv/magick/png.c:2174: warning: ‘color_type’ is deprecated (declared at /opt/local/include/png.h:669)
1541:info:build ../../wv/magick/png.c:2177: warning: ‘bit_depth’ is deprecated (declared at /opt/local/include/png.h:667)
1542:info:build ../../wv/magick/png.c:2193: warning: ‘color_type’ is deprecated (declared at /opt/local/include/png.h:669)
1543:info:build ../../wv/magick/png.c:2223: warning: ‘bit_depth’ is deprecated (declared at /opt/local/include/png.h:667)
1544:info:build ../../wv/magick/png.c:2225: warning: ‘color_type’ is deprecated (declared at /opt/local/include/png.h:669)
1545:info:build ../../wv/magick/png.c:2227: warning: ‘color_type’ is deprecated (declared at /opt/local/include/png.h:669)
1546:info:build ../../wv/magick/png.c:2229: warning: ‘color_type’ is deprecated (declared at /opt/local/include/png.h:669)
1547:info:build ../../wv/magick/png.c:2277: warning: ‘bit_depth’ is deprecated (declared at /opt/local/include/png.h:667)
1548:info:build ../../wv/magick/png.c:2379: warning: ‘valid’ is deprecated (declared at /opt/local/include/png.h:657)
1549:info:build ../../wv/magick/png.c:2391: warning: ‘color_type’ is deprecated (declared at /opt/local/include/png.h:669)
1550:info:build ../../wv/magick/png.c:2393: warning: ‘num_trans’ is deprecated (declared at /opt/local/include/png.h:665)
1551:info:build ../../wv/magick/png.c:2394: error: ‘struct png_info_struct’ has no member named ‘trans’
1552:info:build ../../wv/magick/png.c:2409: warning: ‘num_text’ is deprecated (declared at /opt/local/include/png.h:719)
1553:info:build ../../wv/magick/png.c:2410: warning: ‘num_text’ is deprecated (declared at /opt/local/include/png.h:719)
1554:info:build ../../wv/magick/png.c:2412: warning: ‘text’ is deprecated (declared at /opt/local/include/png.h:721)
1555:info:build ../../wv/magick/png.c:2414: warning: ‘text’ is deprecated (declared at /opt/local/include/png.h:721)
1556:info:build ../../wv/magick/png.c:2425: warning: ‘text’ is deprecated (declared at /opt/local/include/png.h:721)
1557:info:build ../../wv/magick/png.c:2427: warning: ‘text’ is deprecated (declared at /opt/local/include/png.h:721)
1558:info:build ../../wv/magick/png.c:2429: warning: ‘text’ is deprecated (declared at /opt/local/include/png.h:721)
1559:info:build ../../wv/magick/png.c:2431: warning: ‘text’ is deprecated (declared at /opt/local/include/png.h:721)
1560:info:build ../../wv/magick/png.c:2433: warning: ‘text’ is deprecated (declared at /opt/local/include/png.h:721)
1561:info:build ../../wv/magick/png.c:2438: warning: ‘text’ is deprecated (declared at /opt/local/include/png.h:721)
1562:info:build ../../wv/magick/png.c:2448: warning: ‘text’ is deprecated (declared at /opt/local/include/png.h:721)
1563:info:build ../../wv/magick/png.c:2450: warning: ‘text’ is deprecated (declared at /opt/local/include/png.h:721)
1564:info:build ../../wv/magick/png.c: In function ‘WriteTextChunk’:
1565:info:build ../../wv/magick/png.c:2915: warning: ‘num_text’ is deprecated (declared at /opt/local/include/png.h:719)
1566:info:build ../../wv/magick/png.c:2916: warning: ‘text’ is deprecated (declared at /opt/local/include/png.h:721)
1567:info:build ../../wv/magick/png.c:2917: warning: ‘text’ is deprecated (declared at /opt/local/include/png.h:721)
1568:info:build ../../wv/magick/png.c:2918: warning: ‘text’ is deprecated (declared at /opt/local/include/png.h:721)
1569:info:build ../../wv/magick/png.c:2919: warning: ‘text’ is deprecated (declared at /opt/local/include/png.h:721)
1570:info:build ../../wv/magick/png.c:2922: warning: ‘text’ is deprecated (declared at /opt/local/include/png.h:721)
1571:info:build ../../wv/magick/png.c: In function ‘WritePNGImage’:
1572:info:build ../../wv/magick/png.c:3514: warning: ‘jmpbuf’ is deprecated (declared at /opt/local/include/png.h:1114)
1573:info:build ../../wv/magick/png.c:3533: warning: ‘width’ is deprecated (declared at /opt/local/include/png.h:655)
1574:info:build ../../wv/magick/png.c:3534: warning: ‘height’ is deprecated (declared at /opt/local/include/png.h:656)
1575:info:build ../../wv/magick/png.c:3536: warning: ‘bit_depth’ is deprecated (declared at /opt/local/include/png.h:667)
1576:info:build ../../wv/magick/png.c:3538: warning: ‘bit_depth’ is deprecated (declared at /opt/local/include/png.h:667)
1577:info:build ../../wv/magick/png.c:3585: warning: ‘color_type’ is deprecated (declared at /opt/local/include/png.h:669)
1578:info:build ../../wv/magick/png.c:3589: warning: ‘valid’ is deprecated (declared at /opt/local/include/png.h:657)
1579:info:build ../../wv/magick/png.c:3590: warning: ‘phys_unit_type’ is deprecated (declared at /opt/local/include/png.h:786)
1580:info:build ../../wv/magick/png.c:3591: warning: ‘x_pixels_per_unit’ is deprecated (declared at /opt/local/include/png.h:784)
1581:info:build ../../wv/magick/png.c:3592: warning: ‘y_pixels_per_unit’ is deprecated (declared at /opt/local/include/png.h:785)
1582:info:build ../../wv/magick/png.c:3595: warning: ‘phys_unit_type’ is deprecated (declared at /opt/local/include/png.h:786)
1583:info:build ../../wv/magick/png.c:3596: warning: ‘x_pixels_per_unit’ is deprecated (declared at /opt/local/include/png.h:784)
1584:info:build ../../wv/magick/png.c:3598: warning: ‘y_pixels_per_unit’ is deprecated (declared at /opt/local/include/png.h:785)
1585:info:build ../../wv/magick/png.c:3603: warning: ‘phys_unit_type’ is deprecated (declared at /opt/local/include/png.h:786)
1586:info:build ../../wv/magick/png.c:3604: warning: ‘x_pixels_per_unit’ is deprecated (declared at /opt/local/include/png.h:784)
1587:info:build ../../wv/magick/png.c:3606: warning: ‘y_pixels_per_unit’ is deprecated (declared at /opt/local/include/png.h:785)
1588:info:build ../../wv/magick/png.c:3612: warning: ‘valid’ is deprecated (declared at /opt/local/include/png.h:657)
1589:info:build ../../wv/magick/png.c:3613: warning: ‘background’ is deprecated (declared at /opt/local/include/png.h:765)
1590:info:build ../../wv/magick/png.c:3615: warning: ‘background’ is deprecated (declared at /opt/local/include/png.h:765)
1591:info:build ../../wv/magick/png.c:3617: warning: ‘background’ is deprecated (declared at /opt/local/include/png.h:765)
1592:info:build ../../wv/magick/png.c:3619: warning: ‘background’ is deprecated (declared at /opt/local/include/png.h:765)
1593:info:build ../../wv/magick/png.c:3621: warning: ‘background’ is deprecated (declared at /opt/local/include/png.h:765)
1594:info:build ../../wv/magick/png.c:3621: warning: ‘background’ is deprecated (declared at /opt/local/include/png.h:765)
1595:info:build ../../wv/magick/png.c:3629: warning: ‘color_type’ is deprecated (declared at /opt/local/include/png.h:669)
1596:info:build ../../wv/magick/png.c:3635: warning: ‘color_type’ is deprecated (declared at /opt/local/include/png.h:669)
1597:info:build ../../wv/magick/png.c:3648: warning: ‘valid’ is deprecated (declared at /opt/local/include/png.h:657)
1598:info:build ../../wv/magick/png.c:3649: error: ‘struct png_info_struct’ has no member named ‘trans_values’
1599:info:build ../../wv/magick/png.c:3650: error: ‘struct png_info_struct’ has no member named ‘trans_values’
1600:info:build ../../wv/magick/png.c:3651: error: ‘struct png_info_struct’ has no member named ‘trans_values’
1601:info:build ../../wv/magick/png.c:3652: error: ‘struct png_info_struct’ has no member named ‘trans_values’
1602:info:build ../../wv/magick/png.c:3653: error: ‘struct png_info_struct’ has no member named ‘trans_values’
1603:info:build ../../wv/magick/png.c:3663: warning: ‘color_type’ is deprecated (declared at /opt/local/include/png.h:669)
1604:info:build ../../wv/magick/png.c:3665: warning: ‘valid’ is deprecated (declared at /opt/local/include/png.h:657)
1605:info:build ../../wv/magick/png.c:3676: error: ‘struct png_info_struct’ has no member named ‘trans_values’
1606:info:build ../../wv/magick/png.c:3676: error: ‘struct png_info_struct’ has no member named ‘trans_values’
1607:info:build ../../wv/magick/png.c:3676: error: ‘struct png_info_struct’ has no member named ‘trans_values’
1608:info:build ../../wv/magick/png.c:3676: error: ‘struct png_info_struct’ has no member named ‘trans_values’
1609:info:build ../../wv/magick/png.c:3676: error: ‘struct png_info_struct’ has no member named ‘trans_values’
1610:info:build ../../wv/magick/png.c:3676: error: ‘struct png_info_struct’ has no member named ‘trans_values’
1611:info:build ../../wv/magick/png.c:3676: error: ‘struct png_info_struct’ has no member named ‘trans_values’
1612:info:build ../../wv/magick/png.c:3676: error: ‘struct png_info_struct’ has no member named ‘trans_values’
1613:info:build ../../wv/magick/png.c:3676: error: ‘struct png_info_struct’ has no member named ‘trans_values’
1614:info:build ../../wv/magick/png.c:3678: warning: ‘valid’ is deprecated (declared at /opt/local/include/png.h:657)
1615:info:build ../../wv/magick/png.c:3685: warning: ‘valid’ is deprecated (declared at /opt/local/include/png.h:657)
1616:info:build ../../wv/magick/png.c:3692: error: ‘struct png_info_struct’ has no member named ‘trans_values’
1617:info:build ../../wv/magick/png.c:3692: error: ‘struct png_info_struct’ has no member named ‘trans_values’
1618:info:build ../../wv/magick/png.c:3692: error: ‘struct png_info_struct’ has no member named ‘trans_values’
1619:info:build ../../wv/magick/png.c:3692: error: ‘struct png_info_struct’ has no member named ‘trans_values’
1620:info:build ../../wv/magick/png.c:3692: error: ‘struct png_info_struct’ has no member named ‘trans_values’
1621:info:build ../../wv/magick/png.c:3692: error: ‘struct png_info_struct’ has no member named ‘trans_values’
1622:info:build ../../wv/magick/png.c:3692: error: ‘struct png_info_struct’ has no member named ‘trans_values’
1623:info:build ../../wv/magick/png.c:3692: error: ‘struct png_info_struct’ has no member named ‘trans_values’
1624:info:build ../../wv/magick/png.c:3692: error: ‘struct png_info_struct’ has no member named ‘trans_values’
1625:info:build ../../wv/magick/png.c:3695: warning: ‘valid’ is deprecated (declared at /opt/local/include/png.h:657)
1626:info:build ../../wv/magick/png.c:3704: warning: ‘valid’ is deprecated (declared at /opt/local/include/png.h:657)
1627:info:build ../../wv/magick/png.c:3707: warning: ‘color_type’ is deprecated (declared at /opt/local/include/png.h:669)
1628:info:build ../../wv/magick/png.c:3712: error: ‘struct png_info_struct’ has no member named ‘trans_values’
1629:info:build ../../wv/magick/png.c:3713: error: ‘struct png_info_struct’ has no member named ‘trans_values’
1630:info:build ../../wv/magick/png.c:3714: error: ‘struct png_info_struct’ has no member named ‘trans_values’
1631:info:build ../../wv/magick/png.c:3715: error: ‘struct png_info_struct’ has no member named ‘trans_values’
1632:info:build ../../wv/magick/png.c:3720: warning: ‘valid’ is deprecated (declared at /opt/local/include/png.h:657)
1633:info:build ../../wv/magick/png.c:3723: warning: ‘color_type’ is deprecated (declared at /opt/local/include/png.h:669)
1634:info:build ../../wv/magick/png.c:3730: warning: ‘color_type’ is deprecated (declared at /opt/local/include/png.h:669)
1635:info:build ../../wv/magick/png.c:3731: warning: ‘valid’ is deprecated (declared at /opt/local/include/png.h:657)
1636:info:build ../../wv/magick/png.c:3736: warning: ‘num_palette’ is deprecated (declared at /opt/local/include/png.h:663)
1637:info:build ../../wv/magick/png.c:3740: warning: ‘num_palette’ is deprecated (declared at /opt/local/include/png.h:663)
1638:info:build ../../wv/magick/png.c:3743: warning: ‘palette’ is deprecated (declared at /opt/local/include/png.h:661)
1639:info:build ../../wv/magick/png.c:3745: warning: ‘palette’ is deprecated (declared at /opt/local/include/png.h:661)
1640:info:build ../../wv/magick/png.c:3750: warning: ‘palette’ is deprecated (declared at /opt/local/include/png.h:661)
1641:info:build ../../wv/magick/png.c:3752: warning: ‘palette’ is deprecated (declared at /opt/local/include/png.h:661)
1642:info:build ../../wv/magick/png.c:3754: warning: ‘palette’ is deprecated (declared at /opt/local/include/png.h:661)
1643:info:build ../../wv/magick/png.c:3758: warning: ‘bit_depth’ is deprecated (declared at /opt/local/include/png.h:667)
1644:info:build ../../wv/magick/png.c:3759: warning: ‘bit_depth’ is deprecated (declared at /opt/local/include/png.h:667)
1645:info:build ../../wv/magick/png.c:3760: warning: ‘bit_depth’ is deprecated (declared at /opt/local/include/png.h:667)
1646:info:build ../../wv/magick/png.c:3761: warning: ‘valid’ is deprecated (declared at /opt/local/include/png.h:657)
1647:info:build ../../wv/magick/png.c:3767: error: ‘struct png_info_struct’ has no member named ‘trans_values’
1648:info:build ../../wv/magick/png.c:3768: error: ‘struct png_info_struct’ has no member named ‘trans_values’
1649:info:build ../../wv/magick/png.c:3769: error: ‘struct png_info_struct’ has no member named ‘trans_values’
1650:info:build ../../wv/magick/png.c:3770: error: ‘struct png_info_struct’ has no member named ‘trans_values’
1651:info:build ../../wv/magick/png.c:3777: error: ‘struct png_info_struct’ has no member named ‘trans’
1652:info:build ../../wv/magick/png.c:3779: error: ‘struct png_info_struct’ has no member named ‘trans’
1653:info:build ../../wv/magick/png.c:3784: error: ‘struct png_info_struct’ has no member named ‘trans’
1654:info:build ../../wv/magick/png.c:3785: error: ‘struct png_info_struct’ has no member named ‘trans_values’
1655:info:build ../../wv/magick/png.c:3785: error: ‘struct png_info_struct’ has no member named ‘trans_values’
1656:info:build ../../wv/magick/png.c:3785: error: ‘struct png_info_struct’ has no member named ‘trans_values’
1657:info:build ../../wv/magick/png.c:3785: error: ‘struct png_info_struct’ has no member named ‘trans_values’
1658:info:build ../../wv/magick/png.c:3785: error: ‘struct png_info_struct’ has no member named ‘trans_values’
1659:info:build ../../wv/magick/png.c:3785: error: ‘struct png_info_struct’ has no member named ‘trans_values’
1660:info:build ../../wv/magick/png.c:3785: error: ‘struct png_info_struct’ has no member named ‘trans_values’
1661:info:build ../../wv/magick/png.c:3785: error: ‘struct png_info_struct’ has no member named ‘trans_values’
1662:info:build ../../wv/magick/png.c:3785: error: ‘struct png_info_struct’ has no member named ‘trans_values’
1663:info:build ../../wv/magick/png.c:3787: error: ‘struct png_info_struct’ has no member named ‘trans’
1664:info:build ../../wv/magick/png.c:3787: error: ‘struct png_info_struct’ has no member named ‘trans_values’
1665:info:build ../../wv/magick/png.c:3791: warning: ‘num_trans’ is deprecated (declared at /opt/local/include/png.h:665)
1666:info:build ../../wv/magick/png.c:3800: warning: ‘background’ is deprecated (declared at /opt/local/include/png.h:765)
1667:info:build ../../wv/magick/png.c:3800: warning: ‘background’ is deprecated (declared at /opt/local/include/png.h:765)
1668:info:build ../../wv/magick/png.c:3800: warning: ‘background’ is deprecated (declared at /opt/local/include/png.h:765)
1669:info:build ../../wv/magick/png.c:3800: warning: ‘background’ is deprecated (declared at /opt/local/include/png.h:765)
1670:info:build ../../wv/magick/png.c:3800: warning: ‘background’ is deprecated (declared at /opt/local/include/png.h:765)
1671:info:build ../../wv/magick/png.c:3800: warning: ‘background’ is deprecated (declared at /opt/local/include/png.h:765)
1672:info:build ../../wv/magick/png.c:3800: warning: ‘background’ is deprecated (declared at /opt/local/include/png.h:765)
1673:info:build ../../wv/magick/png.c:3800: warning: ‘background’ is deprecated (declared at /opt/local/include/png.h:765)
1674:info:build ../../wv/magick/png.c:3800: warning: ‘background’ is deprecated (declared at /opt/local/include/png.h:765)
1675:info:build ../../wv/magick/png.c:3805: warning: ‘background’ is deprecated (declared at /opt/local/include/png.h:765)
1676:info:build ../../wv/magick/png.c:3811: warning: ‘color_type’ is deprecated (declared at /opt/local/include/png.h:669)
1677:info:build ../../wv/magick/png.c:3822: warning: ‘valid’ is deprecated (declared at /opt/local/include/png.h:657)
1678:info:build ../../wv/magick/png.c:3824: warning: ‘srgb_intent’ is deprecated (declared at /opt/local/include/png.h:706)
1679:info:build ../../wv/magick/png.c:3826: warning: ‘srgb_intent’ is deprecated (declared at /opt/local/include/png.h:706)
1680:info:build ../../wv/magick/png.c:3829: warning: ‘valid’ is deprecated (declared at /opt/local/include/png.h:657)
1681:info:build ../../wv/magick/png.c:3838: warning: ‘valid’ is deprecated (declared at /opt/local/include/png.h:657)
1682:info:build ../../wv/magick/png.c:3839: warning: ‘gamma’ is deprecated (declared at /opt/local/include/png.h:699)
1683:info:build ../../wv/magick/png.c:3847: warning: ‘valid’ is deprecated (declared at /opt/local/include/png.h:657)
1684:info:build ../../wv/magick/png.c:3848: warning: ‘x_red’ is deprecated (declared at /opt/local/include/png.h:810)
1685:info:build ../../wv/magick/png.c:3849: warning: ‘y_red’ is deprecated (declared at /opt/local/include/png.h:811)
1686:info:build ../../wv/magick/png.c:3850: warning: ‘x_green’ is deprecated (declared at /opt/local/include/png.h:812)
1687:info:build ../../wv/magick/png.c:3851: warning: ‘y_green’ is deprecated (declared at /opt/local/include/png.h:813)
1688:info:build ../../wv/magick/png.c:3852: warning: ‘x_blue’ is deprecated (declared at /opt/local/include/png.h:814)
1689:info:build ../../wv/magick/png.c:3853: warning: ‘y_blue’ is deprecated (declared at /opt/local/include/png.h:815)
1690:info:build ../../wv/magick/png.c:3854: warning: ‘x_white’ is deprecated (declared at /opt/local/include/png.h:808)
1691:info:build ../../wv/magick/png.c:3855: warning: ‘y_white’ is deprecated (declared at /opt/local/include/png.h:809)
1692:info:build ../../wv/magick/png.c:3858: warning: ‘interlace_type’ is deprecated (declared at /opt/local/include/png.h:676)
1693:info:build ../../wv/magick/png.c:3869: warning: ‘color_type’ is deprecated (declared at /opt/local/include/png.h:669)
1694:info:build ../../wv/magick/png.c:3870: warning: ‘color_type’ is deprecated (declared at /opt/local/include/png.h:669)
1695:info:build ../../wv/magick/png.c:4018: warning: ‘color_type’ is deprecated (declared at /opt/local/include/png.h:669)
1696:info:build ../../wv/magick/png.c:4041: warning: ‘color_type’ is deprecated (declared at /opt/local/include/png.h:669)
1697:info:build ../../wv/magick/png.c:4061: warning: ‘num_text’ is deprecated (declared at /opt/local/include/png.h:719)
1698:info:build ../../wv/magick/png.c:4062: warning: ‘text’ is deprecated (declared at /opt/local/include/png.h:721)
1699:info:build ../../wv/magick/png.c:4063: warning: ‘text’ is deprecated (declared at /opt/local/include/png.h:721)
1700:info:build ../../wv/magick/png.c:4104: warning: ‘width’ is deprecated (declared at /opt/local/include/png.h:655)
1701:info:build ../../wv/magick/png.c:4105: warning: ‘height’ is deprecated (declared at /opt/local/include/png.h:656)
1702:info:build ../../wv/magick/png.c:4121: warning: ‘width’ is deprecated (declared at /opt/local/include/png.h:655)
1703:info:build ../../wv/magick/png.c:4123: warning: ‘height’ is deprecated (declared at /opt/local/include/png.h:656)
1704:info:build ../../wv/magick/png.c:4139: warning: ‘valid’ is deprecated (declared at /opt/local/include/png.h:657)
1705:info:build ../../wv/magick/png.c:4140: warning: ‘palette’ is deprecated (declared at /opt/local/include/png.h:661)
1706:info:build make[2]: *** [png.o] Error 1
1707:info:build make[2]: Leaving directory `/opt/local/var/macports/build/_opt_local_var_macports_sources_rsync.macports.org_release_tarballs_ports_editors_abiword/abiword/work/abiword-2.4.5/wv/magick'
1708:info:build make[1]: *** [BMAGICK] Error 1
1709:info:build make[1]: *** Waiting for unfinished jobs....
1710:info:build make[1]: Leaving directory `/opt/local/var/macports/build/_opt_local_var_macports_sources_rsync.macports.org_release_tarballs_ports_editors_abiword/abiword/work/abiword-2.4.5/wv'
1711:info:build make: *** [wv] Error 2
1712:info:build make: Leaving directory `/opt/local/var/macports/build/_opt_local_var_macports_sources_rsync.macports.org_release_tarballs_ports_editors_abiword/abiword/work/abiword-2.4.5/abi'
1713:info:build shell command " cd "/opt/local/var/macports/build/_opt_local_var_macports_sources_rsync.macports.org_release_tarballs_ports_editors_abiword/abiword/work/abiword-2.4.5/abi" && /usr/bin/make -j2 -w  " returned error 2
1714:error:build Target org.macports.build returned: shell command failed (see log for details)
1715:debug:build Backtrace: shell command failed (see log for details)
1716    while executing
1717"command_exec build"
1718    (procedure "portbuild::build_main" line 8)
1719    invoked from within
1720"$procedure $targetname"
1721:info:build Warning: the following items did not execute (for abiword): org.macports.activate org.macports.build org.macports.destroot org.macports.install
1722:notice:build Log for abiword is at: /opt/local/var/macports/logs/_opt_local_var_macports_sources_rsync.macports.org_release_tarballs_ports_editors_abiword/abiword/main.log