Ticket #32381: main.log

File main.log, 61.0 KB (added by yuriy.dedkov@…, 9 years ago)
Line 
1version:1
2:debug:main Attempting ln -sf /opt/local/var/macports/build/_opt_local_var_macports_sources_rsync.macports.org_release_tarballs_ports_devel_gtkglext/gtkglext/work /opt/local/var/macports/sources/rsync.macports.org/release/tarballs/ports/devel/gtkglext/work
3:debug:main changing euid/egid - current euid: 0 - current egid: 0
4:debug:main egid changed to: 501
5:debug:main euid changed to: 502
6:debug:main Executing org.macports.main (gtkglext)
7:debug:main Privilege de-escalation not attempted as not running as root.
8:debug:archivefetch archivefetch phase started at Sat Dec  3 13:21:54 CET 2011
9:msg:archivefetch --->  Fetching archive for gtkglext
10:debug:archivefetch Executing org.macports.archivefetch (gtkglext)
11:debug:archivefetch euid/egid changed to: 0/0
12:debug:archivefetch chowned /opt/local/var/macports/software/gtkglext to macports
13:debug:archivefetch euid/egid changed to: 502/501
14:debug:archivefetch euid/egid changed to: 0/0
15:debug:archivefetch chowned /opt/local/var/macports/incoming to macports
16:debug:archivefetch euid/egid changed to: 502/501
17:info:archivefetch --->  gtkglext-1.2.0_6.darwin_11.x86_64.tbz2 doesn't seem to exist in /opt/local/var/macports/software/gtkglext
18:msg:archivefetch --->  Attempting to fetch gtkglext-1.2.0_6.darwin_11.x86_64.tbz2 from http://packages.macports.org/gtkglext
19:debug:archivefetch Fetching archive failed:: The requested URL returned error: 404
20:debug:archivefetch Privilege de-escalation not attempted as not running as root.
21:debug:fetch fetch phase started at Sat Dec  3 13:21:56 CET 2011
22:notice:fetch --->  Fetching gtkglext
23:debug:fetch euid/egid changed to: 0/0
24:debug:fetch chowned /opt/local/var/macports/distfiles/gtkglext to macports
25:debug:fetch euid/egid changed to: 502/501
26:debug:fetch Executing org.macports.fetch (gtkglext)
27:debug:fetch Privilege de-escalation not attempted as not running as root.
28:debug:checksum checksum phase started at Sat Dec  3 13:21:56 CET 2011
29:notice:checksum --->  Verifying checksum(s) for gtkglext
30:debug:checksum Executing org.macports.checksum (gtkglext)
31:info:checksum --->  Checksumming gtkglext-1.2.0.tar.gz
32:debug:checksum Correct (md5) checksum for gtkglext-1.2.0.tar.gz
33:debug:checksum Privilege de-escalation not attempted as not running as root.
34:debug:extract extract phase started at Sat Dec  3 13:21:56 CET 2011
35:notice:extract --->  Extracting gtkglext
36:debug:extract Executing org.macports.extract (gtkglext)
37:info:extract --->  Extracting gtkglext-1.2.0.tar.gz
38:debug:extract setting option extract.args to '/opt/local/var/macports/distfiles/gtkglext/gtkglext-1.2.0.tar.gz'
39:debug:extract Environment: CPATH='/opt/local/include' CC_PRINT_OPTIONS_FILE='/opt/local/var/macports/build/_opt_local_var_macports_sources_rsync.macports.org_release_tarballs_ports_devel_gtkglext/gtkglext/work/.CC_PRINT_OPTIONS' LIBRARY_PATH='/opt/local/lib' CC_PRINT_OPTIONS='YES' MACOSX_DEPLOYMENT_TARGET='10.7'
40:debug:extract Assembled command: 'cd "/opt/local/var/macports/build/_opt_local_var_macports_sources_rsync.macports.org_release_tarballs_ports_devel_gtkglext/gtkglext/work" && /usr/bin/gzip -dc '/opt/local/var/macports/distfiles/gtkglext/gtkglext-1.2.0.tar.gz' | /usr/bin/gnutar --no-same-owner -xf -'
41:debug:extract Executing command line:  cd "/opt/local/var/macports/build/_opt_local_var_macports_sources_rsync.macports.org_release_tarballs_ports_devel_gtkglext/gtkglext/work" && /usr/bin/gzip -dc '/opt/local/var/macports/distfiles/gtkglext/gtkglext-1.2.0.tar.gz' | /usr/bin/gnutar --no-same-owner -xf -
42:debug:extract euid/egid changed to: 0/0
43:debug:extract chowned /opt/local/var/macports/build/_opt_local_var_macports_sources_rsync.macports.org_release_tarballs_ports_devel_gtkglext/gtkglext/work to macports
44:debug:extract euid/egid changed to: 502/501
45:debug:extract Privilege de-escalation not attempted as not running as root.
46:debug:patch patch phase started at Sat Dec  3 13:21:56 CET 2011
47:debug:patch Executing org.macports.patch (gtkglext)
48:notice:patch --->  Applying patches to gtkglext
49:info:patch --->  Applying /opt/local/var/macports/sources/rsync.macports.org/release/tarballs/ports/devel/gtkglext/files/patch-examples-pixmap-mixed.c.diff
50:debug:patch Environment: CPATH='/opt/local/include' CC_PRINT_OPTIONS_FILE='/opt/local/var/macports/build/_opt_local_var_macports_sources_rsync.macports.org_release_tarballs_ports_devel_gtkglext/gtkglext/work/.CC_PRINT_OPTIONS' LIBRARY_PATH='/opt/local/lib' CC_PRINT_OPTIONS='YES' MACOSX_DEPLOYMENT_TARGET='10.7'
51:debug:patch Assembled command: 'cd "/opt/local/var/macports/build/_opt_local_var_macports_sources_rsync.macports.org_release_tarballs_ports_devel_gtkglext/gtkglext/work/gtkglext-1.2.0" && /usr/bin/patch -p0'
52:debug:patch Executing command line:  cd "/opt/local/var/macports/build/_opt_local_var_macports_sources_rsync.macports.org_release_tarballs_ports_devel_gtkglext/gtkglext/work/gtkglext-1.2.0" && /usr/bin/patch -p0 < '/opt/local/var/macports/sources/rsync.macports.org/release/tarballs/ports/devel/gtkglext/files/patch-examples-pixmap-mixed.c.diff'
53:info:patch patching file examples/pixmap-mixed.c
54:info:patch --->  Applying /opt/local/var/macports/sources/rsync.macports.org/release/tarballs/ports/devel/gtkglext/files/patch-examples-pixmap.c.diff
55:debug:patch Environment: CPATH='/opt/local/include' CC_PRINT_OPTIONS_FILE='/opt/local/var/macports/build/_opt_local_var_macports_sources_rsync.macports.org_release_tarballs_ports_devel_gtkglext/gtkglext/work/.CC_PRINT_OPTIONS' LIBRARY_PATH='/opt/local/lib' CC_PRINT_OPTIONS='YES' MACOSX_DEPLOYMENT_TARGET='10.7'
56:debug:patch Assembled command: 'cd "/opt/local/var/macports/build/_opt_local_var_macports_sources_rsync.macports.org_release_tarballs_ports_devel_gtkglext/gtkglext/work/gtkglext-1.2.0" && /usr/bin/patch -p0'
57:debug:patch Executing command line:  cd "/opt/local/var/macports/build/_opt_local_var_macports_sources_rsync.macports.org_release_tarballs_ports_devel_gtkglext/gtkglext/work/gtkglext-1.2.0" && /usr/bin/patch -p0 < '/opt/local/var/macports/sources/rsync.macports.org/release/tarballs/ports/devel/gtkglext/files/patch-examples-pixmap.c.diff'
58:info:patch patching file examples/pixmap.c
59:info:patch --->  Applying /opt/local/var/macports/sources/rsync.macports.org/release/tarballs/ports/devel/gtkglext/files/patch-gtk-gtkglwidget.c.diff
60:debug:patch Environment: CPATH='/opt/local/include' CC_PRINT_OPTIONS_FILE='/opt/local/var/macports/build/_opt_local_var_macports_sources_rsync.macports.org_release_tarballs_ports_devel_gtkglext/gtkglext/work/.CC_PRINT_OPTIONS' LIBRARY_PATH='/opt/local/lib' CC_PRINT_OPTIONS='YES' MACOSX_DEPLOYMENT_TARGET='10.7'
61:debug:patch Assembled command: 'cd "/opt/local/var/macports/build/_opt_local_var_macports_sources_rsync.macports.org_release_tarballs_ports_devel_gtkglext/gtkglext/work/gtkglext-1.2.0" && /usr/bin/patch -p0'
62:debug:patch Executing command line:  cd "/opt/local/var/macports/build/_opt_local_var_macports_sources_rsync.macports.org_release_tarballs_ports_devel_gtkglext/gtkglext/work/gtkglext-1.2.0" && /usr/bin/patch -p0 < '/opt/local/var/macports/sources/rsync.macports.org/release/tarballs/ports/devel/gtkglext/files/patch-gtk-gtkglwidget.c.diff'
63:info:patch patching file gtk/gtkglwidget.c
64:debug:patch Privilege de-escalation not attempted as not running as root.
65:debug:configure configure phase started at Sat Dec  3 13:21:56 CET 2011
66:notice:configure --->  Configuring gtkglext
67:debug:configure Using compiler 'Mac OS X clang'
68:debug:configure Executing org.macports.configure (gtkglext)
69:debug:configure Environment: CPATH='/opt/local/include' CFLAGS='-pipe -O2 -arch x86_64' CPPFLAGS='-I/opt/local/include' CXXFLAGS='-pipe -O2 -arch x86_64' LIBRARY_PATH='/opt/local/lib' MACOSX_DEPLOYMENT_TARGET='10.7' CXX='/Developer/usr/bin/clang++' CC_PRINT_OPTIONS_FILE='/opt/local/var/macports/build/_opt_local_var_macports_sources_rsync.macports.org_release_tarballs_ports_devel_gtkglext/gtkglext/work/.CC_PRINT_OPTIONS' F90FLAGS='-pipe -O2 -m64' LDFLAGS='-L/opt/local/lib -arch x86_64' OBJC='/Developer/usr/bin/clang' FCFLAGS='-pipe -O2 -m64' INSTALL='/usr/bin/install -c' OBJCFLAGS='-pipe -O2 -arch x86_64' FFLAGS='-pipe -O2 -m64' CC_PRINT_OPTIONS='YES' CC='/Developer/usr/bin/clang'
70:debug:configure Assembled command: 'cd "/opt/local/var/macports/build/_opt_local_var_macports_sources_rsync.macports.org_release_tarballs_ports_devel_gtkglext/gtkglext/work/gtkglext-1.2.0" && ./configure --prefix=/opt/local --x-include=/opt/local/include --x-lib=/opt/local/lib'
71:debug:configure Executing command line:  cd "/opt/local/var/macports/build/_opt_local_var_macports_sources_rsync.macports.org_release_tarballs_ports_devel_gtkglext/gtkglext/work/gtkglext-1.2.0" && ./configure --prefix=/opt/local --x-include=/opt/local/include --x-lib=/opt/local/lib
72:info:configure checking for a BSD-compatible install... /usr/bin/install -c
73:info:configure checking whether build environment is sane... yes
74:info:configure checking for gawk... no
75:info:configure checking for mawk... no
76:info:configure checking for nawk... no
77:info:configure checking for awk... awk
78:info:configure checking whether make sets $(MAKE)... yes
79:info:configure checking whether to enable maintainer-specific portions of Makefiles... no
80:info:configure checking build system type... i386-apple-darwin11.2.0
81:info:configure checking host system type... i386-apple-darwin11.2.0
82:info:configure checking for gcc... /Developer/usr/bin/clang
83:info:configure checking for C compiler default output file name... a.out
84:info:configure checking whether the C compiler works... yes
85:info:configure checking whether we are cross compiling... no
86:info:configure checking for suffix of executables...
87:info:configure checking for suffix of object files... o
88:info:configure checking whether we are using the GNU C compiler... yes
89:info:configure checking whether /Developer/usr/bin/clang accepts -g... yes
90:info:configure checking for /Developer/usr/bin/clang option to accept ANSI C... none needed
91:info:configure checking for style of include used by make... GNU
92:info:configure checking dependency style of /Developer/usr/bin/clang... gcc3
93:info:configure checking how to run the C preprocessor... /Developer/usr/bin/clang -E
94:info:configure checking for strerror in -lcposix... no
95:info:configure checking for a sed that does not truncate output... /usr/bin/sed
96:info:configure checking for egrep... grep -E
97:info:configure checking for ld used by /Developer/usr/bin/clang... /Developer/usr/bin/ld
98:info:configure checking if the linker (/Developer/usr/bin/ld) is GNU ld... no
99:info:configure checking for /Developer/usr/bin/ld option to reload object files... -r
100:info:configure checking for BSD-compatible nm... /usr/bin/nm
101:info:configure checking whether ln -s works... yes
102:info:configure checking how to recognise dependent libraries... pass_all
103:info:configure checking for ANSI C header files... yes
104:info:configure checking for sys/types.h... yes
105:info:configure checking for sys/stat.h... yes
106:info:configure checking for stdlib.h... yes
107:info:configure checking for string.h... yes
108:info:configure checking for memory.h... yes
109:info:configure checking for strings.h... yes
110:info:configure checking for inttypes.h... yes
111:info:configure checking for stdint.h... yes
112:info:configure checking for unistd.h... yes
113:info:configure checking dlfcn.h usability... yes
114:info:configure checking dlfcn.h presence... yes
115:info:configure checking for dlfcn.h... yes
116:info:configure checking whether we are using the GNU C++ compiler... yes
117:info:configure checking whether /Developer/usr/bin/clang++ accepts -g... yes
118:info:configure checking dependency style of /Developer/usr/bin/clang++... gcc3
119:info:configure checking how to run the C++ preprocessor... /Developer/usr/bin/clang++ -E
120:info:configure checking for g77... no
121:info:configure checking for f77... no
122:info:configure checking for xlf... no
123:info:configure checking for frt... no
124:info:configure checking for pgf77... no
125:info:configure checking for fort77... no
126:info:configure checking for fl32... no
127:info:configure checking for af77... no
128:info:configure checking for f90... no
129:info:configure checking for xlf90... no
130:info:configure checking for pgf90... no
131:info:configure checking for epcf90... no
132:info:configure checking for f95... no
133:info:configure checking for fort... no
134:info:configure checking for xlf95... no
135:info:configure checking for ifc... no
136:info:configure checking for efc... no
137:info:configure checking for pgf95... no
138:info:configure checking for lf95... no
139:info:configure checking for gfortran... no
140:info:configure checking whether we are using the GNU Fortran 77 compiler... no
141:info:configure checking whether  accepts -g... no
142:info:configure checking the maximum length of command line arguments... 196608
143:info:configure checking command to parse /usr/bin/nm output from /Developer/usr/bin/clang object... ok
144:info:configure checking for objdir... .libs
145:info:configure checking for ar... ar
146:info:configure checking for ranlib... ranlib
147:info:configure checking for strip... strip
148:info:configure checking for correct ltmain.sh version... yes
149:info:configure checking if /Developer/usr/bin/clang supports -fno-rtti -fno-exceptions... yes
150:info:configure checking for /Developer/usr/bin/clang option to produce PIC... -fno-common
151:info:configure checking if /Developer/usr/bin/clang PIC flag -fno-common works... yes
152:info:configure checking if /Developer/usr/bin/clang static flag -static works... no
153:info:configure checking if /Developer/usr/bin/clang supports -c -o file.o... yes
154:info:configure checking whether the /Developer/usr/bin/clang linker (/Developer/usr/bin/ld) supports shared libraries... yes
155:info:configure checking dynamic linker characteristics... darwin11.2.0 dyld
156:info:configure checking how to hardcode library paths into programs... immediate
157:info:configure checking whether stripping libraries is possible... yes
158:info:configure checking if libtool supports shared libraries... yes
159:info:configure checking whether to build shared libraries... yes
160:info:configure checking whether to build static libraries... yes
161:info:configure configure: creating libtool
162:info:configure appending configuration tag "CXX" to libtool
163:info:configure checking for ld used by /Developer/usr/bin/clang++... /Developer/usr/bin/ld
164:info:configure checking if the linker (/Developer/usr/bin/ld) is GNU ld... no
165:info:configure checking whether the /Developer/usr/bin/clang++ linker (/Developer/usr/bin/ld) supports shared libraries... yes
166:info:configure checking for /Developer/usr/bin/clang++ option to produce PIC... -fno-common
167:info:configure checking if /Developer/usr/bin/clang++ PIC flag -fno-common works... yes
168:info:configure checking if /Developer/usr/bin/clang++ static flag -static works... no
169:info:configure checking if /Developer/usr/bin/clang++ supports -c -o file.o... yes
170:info:configure checking whether the /Developer/usr/bin/clang++ linker (/Developer/usr/bin/ld) supports shared libraries... yes
171:info:configure checking dynamic linker characteristics... darwin11.2.0 dyld
172:info:configure checking how to hardcode library paths into programs... immediate
173:info:configure appending configuration tag "F77" to libtool
174:info:configure checking for some Win32 platform... no
175:info:configure checking for native Win32... no
176:info:configure checking whether build environment is sane... yes
177:info:configure checking for /Developer/usr/bin/clang option to accept ANSI C... none needed
178:info:configure checking for a BSD-compatible install... /usr/bin/install -c
179:info:configure checking whether make sets $(MAKE)... (cached) yes
180:info:configure checking whether ln -s works... yes
181:info:configure checking for gawk... (cached) awk
182:info:configure checking for perl5... /opt/local/bin/perl5
183:info:configure checking for indent... indent
184:info:configure checking for pkg-config... /opt/local/bin/pkg-config
185:info:configure checking pkg-config is at least version 0.9.0... yes
186:info:configure checking for BASE_DEPENDENCIES... yes
187:info:configure checking for pkg-config... /opt/local/bin/pkg-config
188:info:configure checking for GLIB - version >= 2.0.0... yes (version 2.30.2)
189:info:configure checking for pkg-config... (cached) /opt/local/bin/pkg-config
190:info:configure checking for GTK+ - version >= 2.0.0... yes (version 2.24.8)
191:info:configure checking for ANSI C header files... (cached) yes
192:info:configure checking for inttypes.h... (cached) yes
193:info:configure checking for stdlib.h... (cached) yes
194:info:configure checking for string.h... (cached) yes
195:info:configure checking for an ANSI C-conforming const... yes
196:info:configure checking for stdlib.h... (cached) yes
197:info:configure checking for GNU libc compatible malloc... yes
198:info:configure checking for memset... yes
199:info:configure checking for sqrt... yes
200:info:configure checking for strchr... yes
201:info:configure checking for strrchr... yes
202:info:configure checking for strstr... yes
203:info:configure checking gdk/gdkdisplay.h usability... yes
204:info:configure checking gdk/gdkdisplay.h presence... yes
205:info:configure checking for gdk/gdkdisplay.h... yes
206:info:configure checking gdk/gdkscreen.h usability... yes
207:info:configure checking gdk/gdkscreen.h presence... yes
208:info:configure checking for gdk/gdkscreen.h... yes
209:info:configure checking for gdk_display_get_default in GDK library... yes
210:info:configure configure: GDK supports multihead
211:info:configure checking for gdk_x11_colormap_foreign_new... yes
212:info:configure checking for X... libraries /opt/local/lib, headers /opt/local/include
213:info:configure checking for gethostbyname... yes
214:info:configure checking for connect... yes
215:info:configure checking for remove... yes
216:info:configure checking for shmat... yes
217:info:configure checking for IceConnectionNumber in -lICE... yes
218:info:configure checking for X11/Xmu/StdCmap.h... yes
219:info:configure checking for Xmu/StdCmap.h... no
220:info:configure checking for XmuLookupStandardColormap in -lXmu... yes
221:info:configure checking GL/glx.h usability... yes
222:info:configure checking GL/glx.h presence... yes
223:info:configure checking for GL/glx.h... yes
224:info:configure checking GL/gl.h usability... yes
225:info:configure checking GL/gl.h presence... yes
226:info:configure checking for GL/gl.h... yes
227:info:configure checking GL/glu.h usability... yes
228:info:configure checking GL/glu.h presence... yes
229:info:configure checking for GL/glu.h... yes
230:info:configure checking for glVertex3d in -lGLcore... no
231:info:configure checking for glVertex3d in -lGL... yes
232:info:configure checking for gluSphere in -lGLU... yes
233:info:configure checking for gluBeginCurve in -lGLU... yes
234:info:configure checking whether libGLU needs to be linked with the std C++ library... no
235:info:configure checking for GLXFBConfigSGIX... yes
236:info:configure checking for GLXFBConfigIDSGIX... yes
237:info:configure checking for GLXPbufferSGIX... yes
238:info:configure checking for GLXVideoSourceSGIX... yes
239:info:configure checking for __GLXextFuncPtr... yes
240:info:configure checking for GLhalfNV... yes
241:info:configure configure: creating ./config.status
242:info:configure config.status: creating gdkglext.pc
243:info:configure config.status: creating gtkglext.pc
244:info:configure config.status: creating gdkglext-uninstalled.pc
245:info:configure config.status: creating gtkglext-uninstalled.pc
246:info:configure config.status: creating gtkglext.spec
247:info:configure config.status: creating gtkglext.nsi
248:info:configure config.status: creating Makefile
249:info:configure config.status: creating gdk/Makefile
250:info:configure config.status: creating gdk/gdkglversion.h
251:info:configure config.status: creating gdk/glext/Makefile
252:info:configure config.status: creating gdk/x11/Makefile
253:info:configure config.status: creating gdk/win32/Makefile
254:info:configure config.status: creating gtk/Makefile
255:info:configure config.status: creating gtk/gtkglversion.h
256:info:configure config.status: creating m4macros/Makefile
257:info:configure config.status: creating docs/Makefile
258:info:configure config.status: creating docs/reference/Makefile
259:info:configure config.status: creating docs/reference/gtkglext/Makefile
260:info:configure config.status: creating docs/reference/gtkglext/version.xml
261:info:configure config.status: creating examples/Makefile
262:info:configure config.status: creating examples/glade/Makefile
263:info:configure config.status: creating config.h
264:info:configure config.status: executing depfiles commands
265:info:configure config.status: executing gdk/gdkglext-config.h commands
266:info:configure
267:info:configure configuration:
268:info:configure         OpenGL CFLAGS:         
269:info:configure         OpenGL LIBS:             -lGLU -lGL
270:info:configure         multihead support:      yes
271:info:configure         debug:                  minimum
272:info:configure         extra defs:             
273:info:configure
274:debug:configure Privilege de-escalation not attempted as not running as root.
275:debug:build build phase started at Sat Dec  3 13:22:11 CET 2011
276:notice:build --->  Building gtkglext
277:debug:build Executing org.macports.build (gtkglext)
278:debug:build Environment: CPATH='/opt/local/include' CC_PRINT_OPTIONS_FILE='/opt/local/var/macports/build/_opt_local_var_macports_sources_rsync.macports.org_release_tarballs_ports_devel_gtkglext/gtkglext/work/.CC_PRINT_OPTIONS' LIBRARY_PATH='/opt/local/lib' CC_PRINT_OPTIONS='YES' MACOSX_DEPLOYMENT_TARGET='10.7'
279:debug:build Assembled command: 'cd "/opt/local/var/macports/build/_opt_local_var_macports_sources_rsync.macports.org_release_tarballs_ports_devel_gtkglext/gtkglext/work/gtkglext-1.2.0" && /usr/bin/make -j4 -w all'
280:debug:build Executing command line:  cd "/opt/local/var/macports/build/_opt_local_var_macports_sources_rsync.macports.org_release_tarballs_ports_devel_gtkglext/gtkglext/work/gtkglext-1.2.0" && /usr/bin/make -j4 -w all
281:info:build make: Entering directory `/opt/local/var/macports/build/_opt_local_var_macports_sources_rsync.macports.org_release_tarballs_ports_devel_gtkglext/gtkglext/work/gtkglext-1.2.0'
282:info:build /usr/bin/make  all-recursive
283:info:build make[1]: Entering directory `/opt/local/var/macports/build/_opt_local_var_macports_sources_rsync.macports.org_release_tarballs_ports_devel_gtkglext/gtkglext/work/gtkglext-1.2.0'
284:info:build Making all in gdk
285:info:build make[2]: Entering directory `/opt/local/var/macports/build/_opt_local_var_macports_sources_rsync.macports.org_release_tarballs_ports_devel_gtkglext/gtkglext/work/gtkglext-1.2.0/gdk'
286:info:build ( cd . && glib-mkenums \
287:info:build                     --fhead "#ifndef __GDK_GL_ENUM_TYPES_H__\n#define __GDK_GL_ENUM_TYPES_H__\n\n#include <glib-object.h>\n\nG_BEGIN_DECLS\n" \
288:info:build                     --fprod "/* enumerations from \"@filename@\" */\n" \
289:info:build                     --vhead "GType @enum_name@_get_type (void);\n#define GDK_TYPE_@ENUMSHORT@ (@enum_name@_get_type())\n" \
290:info:build                     --ftail "G_END_DECLS\n\n#endif /* __GDK_GL_ENUM_TYPES_H__ */" \
291:info:build             gdkgl.h gdkgldefs.h gdkglversion.h gdkgltokens.h gdkgltypes.h gdkglinit.h gdkglquery.h gdkglconfig.h gdkglcontext.h gdkgldrawable.h gdkglpixmap.h gdkglwindow.h gdkglfont.h gdkglshapes.h gdkglglext.h ) >> xgen-geth \
292:info:build     && (cmp -s xgen-geth ./gdkglenumtypes.h || cp xgen-geth ./gdkglenumtypes.h ) \
293:info:build     && rm -f xgen-geth \
294:info:build     && echo timestamp > stamp-gdkglenumtypes-h
295:info:build ( cd . && glib-mkenums \
296:info:build                     --fhead "#include \"gdkgl.h\"" \
297:info:build                     --fprod "\n/* enumerations from \"@filename@\" */" \
298:info:build                     --vhead "GType\n@enum_name@_get_type (void)\n{\n  static GType etype = 0;\n  if (etype == 0) {\n    static const G@Type@Value values[] = {" \
299:info:build                     --vprod "      { @VALUENAME@, \"@VALUENAME@\", \"@valuenick@\" }," \
300:info:build                     --vtail "      { 0, NULL, NULL }\n    };\n    etype = g_@type@_register_static (\"@EnumName@\", values);\n  }\n  return etype;\n}\n" \
301:info:build             gdkgl.h gdkgldefs.h gdkglversion.h gdkgltokens.h gdkgltypes.h gdkglinit.h gdkglquery.h gdkglconfig.h gdkglcontext.h gdkgldrawable.h gdkglpixmap.h gdkglwindow.h gdkglfont.h gdkglshapes.h gdkglglext.h ) > xgen-getc \
302:info:build     && cp xgen-getc ./gdkglenumtypes.c  \
303:info:build     && rm -f xgen-getc
304:info:build /usr/bin/make  all-recursive
305:info:build make[3]: Entering directory `/opt/local/var/macports/build/_opt_local_var_macports_sources_rsync.macports.org_release_tarballs_ports_devel_gtkglext/gtkglext/work/gtkglext-1.2.0/gdk'
306:info:build Making all in glext
307:info:build make[4]: Entering directory `/opt/local/var/macports/build/_opt_local_var_macports_sources_rsync.macports.org_release_tarballs_ports_devel_gtkglext/gtkglext/work/gtkglext-1.2.0/gdk/glext'
308:info:build make[4]: Nothing to be done for `all'.
309:info:build make[4]: Leaving directory `/opt/local/var/macports/build/_opt_local_var_macports_sources_rsync.macports.org_release_tarballs_ports_devel_gtkglext/gtkglext/work/gtkglext-1.2.0/gdk/glext'
310:info:build Making all in x11
311:info:build make[4]: Entering directory `/opt/local/var/macports/build/_opt_local_var_macports_sources_rsync.macports.org_release_tarballs_ports_devel_gtkglext/gtkglext/work/gtkglext-1.2.0/gdk/x11'
312:info:build if /bin/sh ../../libtool --mode=compile /Developer/usr/bin/clang -DHAVE_CONFIG_H -I. -I. -I../.. -DG_LOG_DOMAIN=\"GdkGLExt\" -DGDK_GL_COMPILATION -DINSIDE_GDK_GL_X11 -I../.. -I../../gdk -I../../gdk -DG_DISABLE_CAST_CHECKS -I/opt/local/include -D_REENTRANT -I/opt/local/include/gtk-2.0 -I/opt/local/lib/gtk-2.0/include -I/opt/local/include/pango-1.0 -I/opt/local/include/gio-unix-2.0/ -I/opt/local/include -I/opt/local/include/gdk-pixbuf-2.0 -I/opt/local/include/cairo -I/opt/local/include/glib-2.0 -I/opt/local/lib/glib-2.0/include -I/opt/local/include/pixman-1 -I/opt/local/include/freetype2 -I/opt/local/include/libpng14    -DG_DISABLE_DEPRECATED -DGDK_DISABLE_DEPRECATED -DGDK_PIXBUF_DISABLE_DEPRECATED  -I/opt/local/include  -pipe -O2 -arch x86_64 -Wall -MT gdkglquery-x11.lo -MD -MP -MF ".deps/gdkglquery-x11.Tpo" \
313:info:build       -c -o gdkglquery-x11.lo `test -f 'gdkglquery-x11.c' || echo './'`gdkglquery-x11.c; \
314:info:build     then mv -f ".deps/gdkglquery-x11.Tpo" ".deps/gdkglquery-x11.Plo"; \
315:info:build     else rm -f ".deps/gdkglquery-x11.Tpo"; exit 1; \
316:info:build     fi
317:info:build if /bin/sh ../../libtool --mode=compile /Developer/usr/bin/clang -DHAVE_CONFIG_H -I. -I. -I../.. -DG_LOG_DOMAIN=\"GdkGLExt\" -DGDK_GL_COMPILATION -DINSIDE_GDK_GL_X11 -I../.. -I../../gdk -I../../gdk -DG_DISABLE_CAST_CHECKS -I/opt/local/include -D_REENTRANT -I/opt/local/include/gtk-2.0 -I/opt/local/lib/gtk-2.0/include -I/opt/local/include/pango-1.0 -I/opt/local/include/gio-unix-2.0/ -I/opt/local/include -I/opt/local/include/gdk-pixbuf-2.0 -I/opt/local/include/cairo -I/opt/local/include/glib-2.0 -I/opt/local/lib/glib-2.0/include -I/opt/local/include/pixman-1 -I/opt/local/include/freetype2 -I/opt/local/include/libpng14    -DG_DISABLE_DEPRECATED -DGDK_DISABLE_DEPRECATED -DGDK_PIXBUF_DISABLE_DEPRECATED  -I/opt/local/include  -pipe -O2 -arch x86_64 -Wall -MT gdkglconfig-x11.lo -MD -MP -MF ".deps/gdkglconfig-x11.Tpo" \
318:info:build       -c -o gdkglconfig-x11.lo `test -f 'gdkglconfig-x11.c' || echo './'`gdkglconfig-x11.c; \
319:info:build     then mv -f ".deps/gdkglconfig-x11.Tpo" ".deps/gdkglconfig-x11.Plo"; \
320:info:build     else rm -f ".deps/gdkglconfig-x11.Tpo"; exit 1; \
321:info:build     fi
322:info:build if /bin/sh ../../libtool --mode=compile /Developer/usr/bin/clang -DHAVE_CONFIG_H -I. -I. -I../.. -DG_LOG_DOMAIN=\"GdkGLExt\" -DGDK_GL_COMPILATION -DINSIDE_GDK_GL_X11 -I../.. -I../../gdk -I../../gdk -DG_DISABLE_CAST_CHECKS -I/opt/local/include -D_REENTRANT -I/opt/local/include/gtk-2.0 -I/opt/local/lib/gtk-2.0/include -I/opt/local/include/pango-1.0 -I/opt/local/include/gio-unix-2.0/ -I/opt/local/include -I/opt/local/include/gdk-pixbuf-2.0 -I/opt/local/include/cairo -I/opt/local/include/glib-2.0 -I/opt/local/lib/glib-2.0/include -I/opt/local/include/pixman-1 -I/opt/local/include/freetype2 -I/opt/local/include/libpng14    -DG_DISABLE_DEPRECATED -DGDK_DISABLE_DEPRECATED -DGDK_PIXBUF_DISABLE_DEPRECATED  -I/opt/local/include  -pipe -O2 -arch x86_64 -Wall -MT gdkgloverlay-x11.lo -MD -MP -MF ".deps/gdkgloverlay-x11.Tpo" \
323:info:build       -c -o gdkgloverlay-x11.lo `test -f 'gdkgloverlay-x11.c' || echo './'`gdkgloverlay-x11.c; \
324:info:build     then mv -f ".deps/gdkgloverlay-x11.Tpo" ".deps/gdkgloverlay-x11.Plo"; \
325:info:build     else rm -f ".deps/gdkgloverlay-x11.Tpo"; exit 1; \
326:info:build     fi
327:info:build if /bin/sh ../../libtool --mode=compile /Developer/usr/bin/clang -DHAVE_CONFIG_H -I. -I. -I../.. -DG_LOG_DOMAIN=\"GdkGLExt\" -DGDK_GL_COMPILATION -DINSIDE_GDK_GL_X11 -I../.. -I../../gdk -I../../gdk -DG_DISABLE_CAST_CHECKS -I/opt/local/include -D_REENTRANT -I/opt/local/include/gtk-2.0 -I/opt/local/lib/gtk-2.0/include -I/opt/local/include/pango-1.0 -I/opt/local/include/gio-unix-2.0/ -I/opt/local/include -I/opt/local/include/gdk-pixbuf-2.0 -I/opt/local/include/cairo -I/opt/local/include/glib-2.0 -I/opt/local/lib/glib-2.0/include -I/opt/local/include/pixman-1 -I/opt/local/include/freetype2 -I/opt/local/include/libpng14    -DG_DISABLE_DEPRECATED -DGDK_DISABLE_DEPRECATED -DGDK_PIXBUF_DISABLE_DEPRECATED  -I/opt/local/include  -pipe -O2 -arch x86_64 -Wall -MT gdkglcontext-x11.lo -MD -MP -MF ".deps/gdkglcontext-x11.Tpo" \
328:info:build       -c -o gdkglcontext-x11.lo `test -f 'gdkglcontext-x11.c' || echo './'`gdkglcontext-x11.c; \
329:info:build     then mv -f ".deps/gdkglcontext-x11.Tpo" ".deps/gdkglcontext-x11.Plo"; \
330:info:build     else rm -f ".deps/gdkglcontext-x11.Tpo"; exit 1; \
331:info:build     fi
332:info:build mkdir .libs
333:info:build  /Developer/usr/bin/clang -DHAVE_CONFIG_H -I. -I. -I../.. -DG_LOG_DOMAIN=\"GdkGLExt\" -DGDK_GL_COMPILATION -DINSIDE_GDK_GL_X11 -I../.. -I../../gdk -I../../gdk -DG_DISABLE_CAST_CHECKS -I/opt/local/include -D_REENTRANT -I/opt/local/include/gtk-2.0 -I/opt/local/lib/gtk-2.0/include -I/opt/local/include/pango-1.0 -I/opt/local/include/gio-unix-2.0/ -I/opt/local/include -I/opt/local/include/gdk-pixbuf-2.0 -I/opt/local/include/cairo -I/opt/local/include/glib-2.0 -I/opt/local/lib/glib-2.0/include -I/opt/local/include/pixman-1 -I/opt/local/include/freetype2 -I/opt/local/include/libpng14 -DG_DISABLE_DEPRECATED -DGDK_DISABLE_DEPRECATED -DGDK_PIXBUF_DISABLE_DEPRECATED -I/opt/local/include -pipe -O2 -arch x86_64 -Wall -MT gdkglquery-x11.lo -MD -MP -MF .deps/gdkglquery-x11.Tpo -c gdkglquery-x11.c  -fno-common -DPIC -o .libs/gdkglquery-x11.o
334:info:build  /Developer/usr/bin/clang -DHAVE_CONFIG_H -I. -I. -I../.. -DG_LOG_DOMAIN=\"GdkGLExt\" -DGDK_GL_COMPILATION -DINSIDE_GDK_GL_X11 -I../.. -I../../gdk -I../../gdk -DG_DISABLE_CAST_CHECKS -I/opt/local/include -D_REENTRANT -I/opt/local/include/gtk-2.0 -I/opt/local/lib/gtk-2.0/include -I/opt/local/include/pango-1.0 -I/opt/local/include/gio-unix-2.0/ -I/opt/local/include -I/opt/local/include/gdk-pixbuf-2.0 -I/opt/local/include/cairo -I/opt/local/include/glib-2.0 -I/opt/local/lib/glib-2.0/include -I/opt/local/include/pixman-1 -I/opt/local/include/freetype2 -I/opt/local/include/libpng14 -DG_DISABLE_DEPRECATED -DGDK_DISABLE_DEPRECATED -DGDK_PIXBUF_DISABLE_DEPRECATED -I/opt/local/include -pipe -O2 -arch x86_64 -Wall -MT gdkglcontext-x11.lo -MD -MP -MF .deps/gdkglcontext-x11.Tpo -c gdkglcontext-x11.c  -fno-common -DPIC -o .libs/gdkglcontext-x11.o
335:info:build  /Developer/usr/bin/clang -DHAVE_CONFIG_H -I. -I. -I../.. -DG_LOG_DOMAIN=\"GdkGLExt\" -DGDK_GL_COMPILATION -DINSIDE_GDK_GL_X11 -I../.. -I../../gdk -I../../gdk -DG_DISABLE_CAST_CHECKS -I/opt/local/include -D_REENTRANT -I/opt/local/include/gtk-2.0 -I/opt/local/lib/gtk-2.0/include -I/opt/local/include/pango-1.0 -I/opt/local/include/gio-unix-2.0/ -I/opt/local/include -I/opt/local/include/gdk-pixbuf-2.0 -I/opt/local/include/cairo -I/opt/local/include/glib-2.0 -I/opt/local/lib/glib-2.0/include -I/opt/local/include/pixman-1 -I/opt/local/include/freetype2 -I/opt/local/include/libpng14 -DG_DISABLE_DEPRECATED -DGDK_DISABLE_DEPRECATED -DGDK_PIXBUF_DISABLE_DEPRECATED -I/opt/local/include -pipe -O2 -arch x86_64 -Wall -MT gdkgloverlay-x11.lo -MD -MP -MF .deps/gdkgloverlay-x11.Tpo -c gdkgloverlay-x11.c  -fno-common -DPIC -o .libs/gdkgloverlay-x11.o
336:info:build  /Developer/usr/bin/clang -DHAVE_CONFIG_H -I. -I. -I../.. -DG_LOG_DOMAIN=\"GdkGLExt\" -DGDK_GL_COMPILATION -DINSIDE_GDK_GL_X11 -I../.. -I../../gdk -I../../gdk -DG_DISABLE_CAST_CHECKS -I/opt/local/include -D_REENTRANT -I/opt/local/include/gtk-2.0 -I/opt/local/lib/gtk-2.0/include -I/opt/local/include/pango-1.0 -I/opt/local/include/gio-unix-2.0/ -I/opt/local/include -I/opt/local/include/gdk-pixbuf-2.0 -I/opt/local/include/cairo -I/opt/local/include/glib-2.0 -I/opt/local/lib/glib-2.0/include -I/opt/local/include/pixman-1 -I/opt/local/include/freetype2 -I/opt/local/include/libpng14 -DG_DISABLE_DEPRECATED -DGDK_DISABLE_DEPRECATED -DGDK_PIXBUF_DISABLE_DEPRECATED -I/opt/local/include -pipe -O2 -arch x86_64 -Wall -MT gdkglconfig-x11.lo -MD -MP -MF .deps/gdkglconfig-x11.Tpo -c gdkglconfig-x11.c  -fno-common -DPIC -o .libs/gdkglconfig-x11.o
337:info:build In file included from gdkglcontext-x11.c:19:
338:info:build In file included from /opt/local/include/gtk-2.0/gdk/gdk.h:33:
339:info:build In file included from /opt/local/include/gtk-2.0/gdk/gdkcairo.h:28:
340:info:build In file included from /opt/local/include/gtk-2.0/gdk/gdkpixbuf.h:37:
341:info:build In file included from /opt/local/include/gdk-pixbuf-2.0/gdk-pixbuf/gdk-pixbuf.h:35:
342:info:build /opt/local/include/gdk-pixbuf-2.0/gdk-pixbuf/gdk-pixbuf-core.h:260:1: error: unknown type name 'G_CONST_RETURN'
343:info:build G_CONST_RETURN gchar * gdk_pixbuf_get_option (GdkPixbuf   *pixbuf,
344:info:build ^
345:info:build /opt/local/include/gdk-pixbuf-2.0/gdk-pixbuf/gdk-pixbuf-core.h:260:21: error: expected ';' after top level declarator
346:info:build G_CONST_RETURN gchar * gdk_pixbuf_get_option (GdkPixbuf   *pixbuf,
347:info:build                     ^
348:info:build                     ;
349:info:build In file included from gdkglcontext-x11.c:19:
350:info:build In file included from /opt/local/include/gtk-2.0/gdk/gdk.h:33:
351:info:build In file included from /opt/local/include/gtk-2.0/gdk/gdkcairo.h:28:
352:info:build In file included from /opt/local/include/gtk-2.0/gdk/gdkpixbuf.h:37:
353:info:build In file included from /opt/local/include/gdk-pixbuf-2.0/gdk-pixbuf/gdk-pixbuf.h:39:
354:info:build /opt/local/include/gdk-pixbuf-2.0/gdk-pixbuf/gdk-pixbuf-io.h:49:1: error: unknown type name 'gchar'
355:info:build gchar     *gdk_pixbuf_format_get_name        (GdkPixbufFormat *format);
356:info:build ^
357:info:build /opt/local/include/gdk-pixbuf-2.0/gdk-pixbuf/gdk-pixbuf-io.h:50:1: error: unknown type name 'gchar'
358:info:build gchar     *gdk_pixbuf_format_get_description (GdkPixbufFormat *format);
359:info:build ^
360:info:build /opt/local/include/gdk-pixbuf-2.0/gdk-pixbuf/gdk-pixbuf-io.h:51:1: error: unknown type name 'gchar'
361:info:build gchar    **gdk_pixbuf_format_get_mime_types  (GdkPixbufFormat *format);
362:info:build ^
363:info:build /opt/local/include/gdk-pixbuf-2.0/gdk-pixbuf/gdk-pixbuf-io.h:52:1: error: unknown type name 'gchar'
364:info:build gchar    **gdk_pixbuf_format_get_extensions  (GdkPixbufFormat *format);
365:info:build ^
366:info:build /opt/local/include/gdk-pixbuf-2.0/gdk-pixbuf/gdk-pixbuf-io.h:58:1: error: unknown type name 'gchar'
367:info:build gchar     *gdk_pixbuf_format_get_license     (GdkPixbufFormat *format);
368:info:build ^
369:info:build /opt/local/include/gdk-pixbuf-2.0/gdk-pixbuf/gdk-pixbuf-io.h:60:53: error: unknown type name 'gchar'
370:info:build GdkPixbufFormat *gdk_pixbuf_get_file_info    (const gchar     *filename,
371:info:build                                                     ^
372:info:build In file included from gdkglcontext-x11.c:19:
373:info:build In file included from /opt/local/include/gtk-2.0/gdk/gdk.h:35:
374:info:build /opt/local/include/gtk-2.0/gdk/gdkcursor.h:158:14: error: unknown type name 'gchar'
375:info:build                                           const gchar     *name);
376:info:build                                                 ^
377:info:build In file included from gdkglcontext-x11.c:19:
378:info:build In file included from /opt/local/include/gtk-2.0/gdk/gdk.h:39:
379:info:build /opt/local/include/gtk-2.0/gdk/gdkdrawable.h:91:12: error: unknown type name 'gchar'
380:info:build                           const gchar  *text,
381:info:build                                 ^
382:info:build In file included from gdkglcontext-x11.c:19:
383:info:build In file included from /opt/local/include/gtk-2.0/gdk/gdk.h:46:
384:info:build /opt/local/include/gtk-2.0/gdk/gdkkeys.h:118:1: error: unknown type name 'gchar'
385:info:build gchar*   gdk_keyval_name         (guint        keyval) G_GNUC_CONST;
386:info:build ^
387:info:build /opt/local/include/gtk-2.0/gdk/gdkkeys.h:119:41: error: unknown type name 'gchar'
388:info:build guint    gdk_keyval_from_name    (const gchar *keyval_name);
389:info:build                                         ^
390:info:build In file included from gdkglcontext-x11.c:19:
391:info:build In file included from /opt/local/include/gtk-2.0/gdk/gdk.h:50:
392:info:build /opt/local/include/gtk-2.0/gdk/gdkproperty.h:45:32: error: unknown type name 'gchar'
393:info:build GdkAtom gdk_atom_intern (const gchar *atom_name,
394:info:build                                ^
395:info:build /opt/local/include/gtk-2.0/gdk/gdkproperty.h:47:46: error: unknown type name 'gchar'
396:info:build GdkAtom gdk_atom_intern_static_string (const gchar *atom_name);
397:info:build                                              ^
398:info:build /opt/local/include/gtk-2.0/gdk/gdkproperty.h:48:1: error: unknown type name 'gchar'
399:info:build gchar*  gdk_atom_name   (GdkAtom      atom);
400:info:build ^
401:info:build /opt/local/include/gtk-2.0/gdk/gdkproperty.h:99:8: error: unknown type name 'gchar'
402:info:build                                                  gchar        ***list);
403:info:build                                                  ^
404:info:build /opt/local/include/gtk-2.0/gdk/gdkproperty.h:101:1: error: unknown type name 'gchar'
405:info:build gchar   *gdk_utf8_to_string_target   (const gchar *str);
406:info:build ^
407:info:build /opt/local/include/gtk-2.0/gdk/gdkproperty.h:101:45: error: unknown type name 'gchar'
408:info:build gchar   *gdk_utf8_to_string_target   (const gchar *str);
409:info:build                                             ^
410:info:build In file included from gdkglcontext-x11.c:19:
411:info:build In file included from /opt/local/include/gtk-2.0/gdk/gdk.h:56:
412:info:build In file included from /opt/local/include/gtk-2.0/gdk/gdktestutils.h:28:
413:info:build /opt/local/include/gtk-2.0/gdk/gdkwindow.h:210:3: error: unknown type name 'gchar'
414:info:build   gchar *title;
415:info:build   ^
416:info:build fatal error: too many errors emitted, stopping now [-ferror-limit=]
417:info:build In file included from gdkgloverlay-x11.c:19:
418:info:build In file included from ./gdkglx.h:22:
419:info:build In file included from /opt/local/include/gtk-2.0/gdk/gdkx.h:30:
420:info:build In file included from /opt/local/include/gtk-2.0/gdk/gdkprivate.h:30:
421:info:build In file included from /opt/local/include/gtk-2.0/gdk/gdk.h:33:
422:info:build In file included from /opt/local/include/gtk-2.0/gdk/gdkcairo.h:28:
423:info:build In file included from /opt/local/include/gtk-2.0/gdk/gdkpixbuf.h:37:
424:info:build In file included from /opt/local/include/gdk-pixbuf-2.0/gdk-pixbuf/gdk-pixbuf.h:35:
425:info:build /opt/local/include/gdk-pixbuf-2.0/gdk-pixbuf/gdk-pixbuf-core.h:260:1: error: unknown type name 'G_CONST_RETURN'
426:info:build G_CONST_RETURN gchar * gdk_pixbuf_get_option (GdkPixbuf   *pixbuf,
427:info:build ^
428:info:build /opt/local/include/gdk-pixbuf-2.0/gdk-pixbuf/gdk-pixbuf-core.h:260:21: error: expected ';' after top level declarator
429:info:build G_CONST_RETURN gchar * gdk_pixbuf_get_option (GdkPixbuf   *pixbuf,
430:info:build                     ^
431:info:build                     ;
432:info:build In file included from gdkgloverlay-x11.c:19:
433:info:build In file included from ./gdkglx.h:22:
434:info:build In file included from /opt/local/include/gtk-2.0/gdk/gdkx.h:30:
435:info:build In file included from /opt/local/include/gtk-2.0/gdk/gdkprivate.h:30:
436:info:build In file included from /opt/local/include/gtk-2.0/gdk/gdk.h:33:
437:info:build In file included from /opt/local/include/gtk-2.0/gdk/gdkcairo.h:28:
438:info:build In file included from /opt/local/include/gtk-2.0/gdk/gdkpixbuf.h:37:
439:info:build In file included from /opt/local/include/gdk-pixbuf-2.0/gdk-pixbuf/gdk-pixbuf.h:39:
440:info:build /opt/local/include/gdk-pixbuf-2.0/gdk-pixbuf/gdk-pixbuf-io.h:49:1: error: unknown type name 'gchar'
441:info:build gchar     *gdk_pixbuf_format_get_name        (GdkPixbufFormat *format);
442:info:build ^
443:info:build /opt/local/include/gdk-pixbuf-2.0/gdk-pixbuf/gdk-pixbuf-io.h:50:1: error: unknown type name 'gchar'
444:info:build gchar     *gdk_pixbuf_format_get_description (GdkPixbufFormat *format);
445:info:build ^
446:info:build /opt/local/include/gdk-pixbuf-2.0/gdk-pixbuf/gdk-pixbuf-io.h:51:1: error: unknown type name 'gchar'
447:info:build gchar    **gdk_pixbuf_format_get_mime_types  (GdkPixbufFormat *format);
448:info:build ^
449:info:build /opt/local/include/gdk-pixbuf-2.0/gdk-pixbuf/gdk-pixbuf-io.h:52:1: error: unknown type name 'gchar'
450:info:build gchar    **gdk_pixbuf_format_get_extensions  (GdkPixbufFormat *format);
451:info:build ^
452:info:build /opt/local/include/gdk-pixbuf-2.0/gdk-pixbuf/gdk-pixbuf-io.h:58:1: error: unknown type name 'gchar'
453:info:build gchar     *gdk_pixbuf_format_get_license     (GdkPixbufFormat *format);
454:info:build ^
455:info:build /opt/local/include/gdk-pixbuf-2.0/gdk-pixbuf/gdk-pixbuf-io.h:60:53: error: unknown type name 'gchar'
456:info:build GdkPixbufFormat *gdk_pixbuf_get_file_info    (const gchar     *filename,
457:info:build                                                     ^
458:info:build In file included from gdkglconfig-x11.c:25:
459:info:build In file included from ./gdkglx.h:22:
460:info:build In file included from /opt/local/include/gtk-2.0/gdk/gdkx.h:30:
461:info:build In file included from /opt/local/include/gtk-2.0/gdk/gdkprivate.h:30:
462:info:build In file included from /opt/local/include/gtk-2.0/gdk/gdk.h:33:
463:info:build In file included from /opt/local/include/gtk-2.0/gdk/gdkcairo.h:28:
464:info:build In file included from /opt/local/include/gtk-2.0/gdk/gdkpixbuf.h:37:
465:info:build In file included from /opt/local/include/gdk-pixbuf-2.0/gdk-pixbuf/gdk-pixbuf.h:35:
466:info:build /opt/local/include/gdk-pixbuf-2.0/gdk-pixbuf/gdk-pixbuf-core.h:260:1: error: unknown type name 'G_CONST_RETURN'
467:info:build G_CONST_RETURN gchar * gdk_pixbuf_get_option (GdkPixbuf   *pixbuf,
468:info:build ^
469:info:build /opt/local/include/gdk-pixbuf-2.0/gdk-pixbuf/gdk-pixbuf-core.h:260:21: error: expected ';' after top level declarator
470:info:build G_CONST_RETURN gchar * gdk_pixbuf_get_option (GdkPixbuf   *pixbuf,
471:info:build                     ^
472:info:build                     ;
473:info:build In file included from gdkgloverlay-x11.c:19:
474:info:build In file included from ./gdkglx.h:22:
475:info:build In file included from /opt/local/include/gtk-2.0/gdk/gdkx.h:30:
476:info:build In file included from /opt/local/include/gtk-2.0/gdk/gdkprivate.h:30:
477:info:build In file included from /opt/local/include/gtk-2.0/gdk/gdk.h:35:
478:info:build /opt/local/include/gtk-2.0/gdk/gdkcursor.h:158:14: error: unknown type name 'gchar'
479:info:build                                           const gchar     *name);
480:info:build                                                 ^
481:info:build In file included from gdkgloverlay-x11.c:19:
482:info:build In file included from ./gdkglx.h:22:
483:info:build In file included from /opt/local/include/gtk-2.0/gdk/gdkx.h:30:
484:info:build In file included from /opt/local/include/gtk-2.0/gdk/gdkprivate.h:30:
485:info:build In file included from /opt/local/include/gtk-2.0/gdk/gdk.h:39:
486:info:build /opt/local/include/gtk-2.0/gdk/gdkdrawable.h:91:12: error: unknown type name 'gchar'
487:info:build                           const gchar  *text,
488:info:build                                 ^
489:info:build In file included from gdkglconfig-x11.c:25:
490:info:build In file included from ./gdkglx.h:22:
491:info:build In file included from /opt/local/include/gtk-2.0/gdk/gdkx.h:30:
492:info:build In file included from /opt/local/include/gtk-2.0/gdk/gdkprivate.h:30:
493:info:build In file included from /opt/local/include/gtk-2.0/gdk/gdk.h:33:
494:info:build In file included from /opt/local/include/gtk-2.0/gdk/gdkcairo.h:28:
495:info:build In file included from /opt/local/include/gtk-2.0/gdk/gdkpixbuf.h:37:
496:info:build In file included from /opt/local/include/gdk-pixbuf-2.0/gdk-pixbuf/gdk-pixbuf.h:39:
497:info:build /opt/local/include/gdk-pixbuf-2.0/gdk-pixbuf/gdk-pixbuf-io.h:49:1: error: unknown type name 'gchar'
498:info:build gchar     *gdk_pixbuf_format_get_name        (GdkPixbufFormat *format);
499:info:build ^
500:info:build /opt/local/include/gdk-pixbuf-2.0/gdk-pixbuf/gdk-pixbuf-io.h:50:1: error: unknown type name 'gchar'
501:info:build gchar     *gdk_pixbuf_format_get_description (GdkPixbufFormat *format);
502:info:build ^
503:info:build In file included from gdkgloverlay-x11.c:19:
504:info:build In file included from ./gdkglx.h:22:
505:info:build In file included from /opt/local/include/gtk-2.0/gdk/gdkx.h/opt/local/include/gdk-pixbuf-2.0/gdk-pixbuf/gdk-pixbuf-io.h:51:1: :30error: :
506:info:build In file included from unknown type name 'gchar'/opt/local/include/gtk-2.0/gdk/gdkprivate.h
507:info:build :30:
508:info:build In file included from /opt/local/include/gtk-2.0/gdk/gdk.h:46:
509:info:build gchar    **gdk_pixbuf_format_get_mime_types  (GdkPixbufFormat *format);/opt/local/include/gtk-2.0/gdk/gdkkeys.h
510:info:build :^118
511:info:build :1: error: unknown type name 'gchar'
512:info:build gchar*   gdk_keyval_name         (guint        keyval) G_GNUC_CONST;
513:info:build ^
514:info:build /opt/local/include/gdk-pixbuf-2.0/gdk-pixbuf/gdk-pixbuf-io.h:52:1: error: unknown type name 'gchar'
515:info:build gchar    **gdk_pixbuf_format_get_extensions  (GdkPixbufFormat *format);
516:info:build /opt/local/include/gtk-2.0/gdk/gdkkeys.h:^
517:info:build 119:41: error: unknown type name 'gchar'
518:info:build guint    gdk_keyval_from_name    (const gchar *keyval_name);
519:info:build                                         ^
520:info:build /opt/local/include/gdk-pixbuf-2.0/gdk-pixbuf/gdk-pixbuf-io.h:58:1: error: unknown type name 'gchar'
521:info:build gchar     *gdk_pixbuf_format_get_license     (GdkPixbufFormat *format);
522:info:build ^
523:info:build /opt/local/include/gdk-pixbuf-2.0/gdk-pixbuf/gdk-pixbuf-io.h:60:53: error: unknown type name 'gchar'
524:info:build GdkPixbufFormat *gdk_pixbuf_get_file_info    (const gchar     *filename,
525:info:build                                                     ^
526:info:build In file included from gdkgloverlay-x11.c:19:
527:info:build In file included from ./gdkglx.h:22:
528:info:build In file included from /opt/local/include/gtk-2.0/gdk/gdkx.h:30:
529:info:build In file included from /opt/local/include/gtk-2.0/gdk/gdkprivate.h:30:
530:info:build In file included from /opt/local/include/gtk-2.0/gdk/gdk.h:50:
531:info:build /opt/local/include/gtk-2.0/gdk/gdkproperty.h:45:32: error: unknown type name 'gchar'
532:info:build GdkAtom gdk_atom_intern (const gchar *atom_name,
533:info:build                                ^
534:info:build /opt/local/include/gtk-2.0/gdk/gdkproperty.h:47:46: error: unknown type name 'gchar'
535:info:build GdkAtom gdk_atom_intern_static_string (const gchar *atom_name);
536:info:build                                              ^
537:info:build /opt/local/include/gtk-2.0/gdk/gdkproperty.h:48:1: error: unknown type name 'gchar'
538:info:build gchar*  gdk_atom_name   (GdkAtom      atom);
539:info:build ^
540:info:build /opt/local/include/gtk-2.0/gdk/gdkproperty.h:99:8: error: unknown type name 'gchar'
541:info:build                                                  gchar        ***list);
542:info:build                                                  ^
543:info:build /opt/local/include/gtk-2.0/gdk/gdkproperty.h:101:1: error: unknown type name 'gchar'
544:info:build gchar   *gdk_utf8_to_string_target   (const gchar *str);
545:info:build ^
546:info:build /opt/local/include/gtk-2.0/gdk/gdkproperty.h:101:45: error: unknown type name 'gchar'
547:info:build gchar   *gdk_utf8_to_string_target   (const gchar *str);
548:info:build                                             ^
549:info:build In file included from gdkglconfig-x11.c:25:
550:info:build In file included from ./gdkglx.h:22:
551:info:build In file included from /opt/local/include/gtk-2.0/gdk/gdkx.h:30:
552:info:build In file included from /opt/local/include/gtk-2.0/gdk/gdkprivate.h:30:
553:info:build In file included from /opt/local/include/gtk-2.0/gdk/gdk.h:35:
554:info:build /opt/local/include/gtk-2.0/gdk/gdkcursor.h:158:14: error: unknown type name 'gchar'
555:info:build                                           const gchar     *name);
556:info:build                                                 ^
557:info:build In file included from gdkgloverlay-x11.c:19:
558:info:build In file included from ./gdkglx.h:22:
559:info:build In file included from /opt/local/include/gtk-2.0/gdk/gdkx.h:30:
560:info:build In file included from /opt/local/include/gtk-2.0/gdk/gdkprivate.h:30:
561:info:build In file included from /opt/local/include/gtk-2.0/gdk/gdk.h:56:
562:info:build In file included from /opt/local/include/gtk-2.0/gdk/gdktestutils.h:28:
563:info:build /opt/local/include/gtk-2.0/gdk/gdkwindow.h:210:3: error: unknown type name 'gchar'
564:info:build   gchar *title;
565:info:build   ^
566:info:build fatal error: too many errors emitted, stopping now [-ferror-limit=]
567:info:build In file included from gdkglconfig-x11.c:25:
568:info:build In file included from ./gdkglx.h:22:
569:info:build In file included from /opt/local/include/gtk-2.0/gdk/gdkx.h:30:
570:info:build In file included from /opt/local/include/gtk-2.0/gdk/gdkprivate.h:30:
571:info:build In file included from /opt/local/include/gtk-2.0/gdk/gdk.h:39:
572:info:build /opt/local/include/gtk-2.0/gdk/gdkdrawable.h:91:12: error: unknown type name 'gchar'
573:info:build                           const gchar  *text,
574:info:build                                 ^
575:info:build In file included from gdkglconfig-x11.c:25:
576:info:build In file included from ./gdkglx.h:22:
577:info:build In file included from /opt/local/include/gtk-2.0/gdk/gdkx.h:30:
578:info:build In file included from /opt/local/include/gtk-2.0/gdk/gdkprivate.h:30:
579:info:build In file included from /opt/local/include/gtk-2.0/gdk/gdk.h:46:
580:info:build /opt/local/include/gtk-2.0/gdk/gdkkeys.h:118:1: error: unknown type name 'gchar'
581:info:build gchar*   gdk_keyval_name         (guint        keyval) G_GNUC_CONST;
582:info:build ^
583:info:build /opt/local/include/gtk-2.0/gdk/gdkkeys.h:119:41: error: unknown type name 'gchar'
584:info:build guint    gdk_keyval_from_name    (const gchar *keyval_name);
585:info:build                                         ^
586:info:build In file included from gdkglconfig-x11.c:25:
587:info:build In file included from ./gdkglx.h:22:
588:info:build In file included from /opt/local/include/gtk-2.0/gdk/gdkx.h:30:
589:info:build In file included from /opt/local/include/gtk-2.0/gdk/gdkprivate.h:30:
590:info:build In file included from /opt/local/include/gtk-2.0/gdk/gdk.h:50:
591:info:build /opt/local/include/gtk-2.0/gdk/gdkproperty.h:45:32: error: unknown type name 'gchar'
592:info:build GdkAtom gdk_atom_intern (const gchar *atom_name,
593:info:build                                ^
594:info:build /opt/local/include/gtk-2.0/gdk/gdkproperty.h:47:46: error: unknown type name 'gchar'
595:info:build GdkAtom gdk_atom_intern_static_string (const gchar *atom_name);
596:info:build                                              ^
597:info:build /opt/local/include/gtk-2.0/gdk/gdkproperty.h:48:1: error: unknown type name 'gchar'
598:info:build gchar*  gdk_atom_name   (GdkAtom      atom);
599:info:build ^
600:info:build /opt/local/include/gtk-2.0/gdk/gdkproperty.h:99:8: error: unknown type name 'gchar'
601:info:build                                                  gchar        ***list);
602:info:build                                                  ^
603:info:build /opt/local/include/gtk-2.0/gdk/gdkproperty.h:101:1: error: unknown type name 'gchar'
604:info:build gchar   *gdk_utf8_to_string_target   (const gchar *str);
605:info:build ^
606:info:build /opt/local/include/gtk-2.0/gdk/gdkproperty.h:101:45: error: unknown type name 'gchar'
607:info:build gchar   *gdk_utf8_to_string_target   (const gchar *str);
608:info:build                                             ^
609:info:build In file included from gdkglconfig-x11.c:25:
610:info:build In file included from ./gdkglx.h:22:
611:info:build In file included from /opt/local/include/gtk-2.0/gdk/gdkx.h:30:
612:info:build In file included from /opt/local/include/gtk-2.0/gdk/gdkprivate.h:30:
613:info:build In file included from /opt/local/include/gtk-2.0/gdk/gdk.h:56:
614:info:build In file included from /opt/local/include/gtk-2.0/gdk/gdktestutils.h:28:
615:info:build /opt/local/include/gtk-2.0/gdk/gdkwindow.h:210:3: error: unknown type name 'gchar'
616:info:build   gchar *title;
617:info:build   ^
618:info:build fatal error: too many errors emitted, stopping now [-ferror-limit=]
619:info:build 20 errors generated.
620:info:build make[4]: *** [gdkglcontext-x11.lo] Error 1
621:info:build make[4]: *** Waiting for unfinished jobs....
622:info:build 20 errors generated.
623:info:build make[4]: *** [gdkglconfig-x11.lo] Error 1
624:info:build 20 errors generated.
625:info:build make[4]: *** [gdkgloverlay-x11.lo] Error 1
626:info:build In file included from gdkglquery-x11.c:27:
627:info:build In file included from ./gdkglx.h:22:
628:info:build In file included from /opt/local/include/gtk-2.0/gdk/gdkx.h:30:
629:info:build In file included from /opt/local/include/gtk-2.0/gdk/gdkprivate.h:30:
630:info:build In file included from /opt/local/include/gtk-2.0/gdk/gdk.h:33:
631:info:build In file included from /opt/local/include/gtk-2.0/gdk/gdkcairo.h:28:
632:info:build In file included from /opt/local/include/gtk-2.0/gdk/gdkpixbuf.h:37:
633:info:build In file included from /opt/local/include/gdk-pixbuf-2.0/gdk-pixbuf/gdk-pixbuf.h:35:
634:info:build /opt/local/include/gdk-pixbuf-2.0/gdk-pixbuf/gdk-pixbuf-core.h:260:1: error: unknown type name 'G_CONST_RETURN'
635:info:build G_CONST_RETURN gchar * gdk_pixbuf_get_option (GdkPixbuf   *pixbuf,
636:info:build ^
637:info:build /opt/local/include/gdk-pixbuf-2.0/gdk-pixbuf/gdk-pixbuf-core.h:260:21: error: expected ';' after top level declarator
638:info:build G_CONST_RETURN gchar * gdk_pixbuf_get_option (GdkPixbuf   *pixbuf,
639:info:build                     ^
640:info:build                     ;
641:info:build In file included from gdkglquery-x11.c:27:
642:info:build In file included from ./gdkglx.h:22:
643:info:build In file included from /opt/local/include/gtk-2.0/gdk/gdkx.h:30:
644:info:build In file included from /opt/local/include/gtk-2.0/gdk/gdkprivate.h:30:
645:info:build In file included from /opt/local/include/gtk-2.0/gdk/gdk.h:33:
646:info:build In file included from /opt/local/include/gtk-2.0/gdk/gdkcairo.h:28:
647:info:build In file included from /opt/local/include/gtk-2.0/gdk/gdkpixbuf.h:37:
648:info:build In file included from /opt/local/include/gdk-pixbuf-2.0/gdk-pixbuf/gdk-pixbuf.h:39:
649:info:build /opt/local/include/gdk-pixbuf-2.0/gdk-pixbuf/gdk-pixbuf-io.h:49:1: error: unknown type name 'gchar'
650:info:build gchar     *gdk_pixbuf_format_get_name        (GdkPixbufFormat *format);
651:info:build ^
652:info:build /opt/local/include/gdk-pixbuf-2.0/gdk-pixbuf/gdk-pixbuf-io.h:50:1: error: unknown type name 'gchar'
653:info:build gchar     *gdk_pixbuf_format_get_description (GdkPixbufFormat *format);
654:info:build ^
655:info:build /opt/local/include/gdk-pixbuf-2.0/gdk-pixbuf/gdk-pixbuf-io.h:51:1: error: unknown type name 'gchar'
656:info:build gchar    **gdk_pixbuf_format_get_mime_types  (GdkPixbufFormat *format);
657:info:build ^
658:info:build /opt/local/include/gdk-pixbuf-2.0/gdk-pixbuf/gdk-pixbuf-io.h:52:1: error: unknown type name 'gchar'
659:info:build gchar    **gdk_pixbuf_format_get_extensions  (GdkPixbufFormat *format);
660:info:build ^
661:info:build /opt/local/include/gdk-pixbuf-2.0/gdk-pixbuf/gdk-pixbuf-io.h:58:1: error: unknown type name 'gchar'
662:info:build gchar     *gdk_pixbuf_format_get_license     (GdkPixbufFormat *format);
663:info:build ^
664:info:build /opt/local/include/gdk-pixbuf-2.0/gdk-pixbuf/gdk-pixbuf-io.h:60:53: error: unknown type name 'gchar'
665:info:build GdkPixbufFormat *gdk_pixbuf_get_file_info    (const gchar     *filename,
666:info:build                                                     ^
667:info:build In file included from gdkglquery-x11.c:27:
668:info:build In file included from ./gdkglx.h:22:
669:info:build In file included from /opt/local/include/gtk-2.0/gdk/gdkx.h:30:
670:info:build In file included from /opt/local/include/gtk-2.0/gdk/gdkprivate.h:30:
671:info:build In file included from /opt/local/include/gtk-2.0/gdk/gdk.h:35:
672:info:build /opt/local/include/gtk-2.0/gdk/gdkcursor.h:158:14: error: unknown type name 'gchar'
673:info:build                                           const gchar     *name);
674:info:build                                                 ^
675:info:build In file included from gdkglquery-x11.c:27:
676:info:build In file included from ./gdkglx.h:22:
677:info:build In file included from /opt/local/include/gtk-2.0/gdk/gdkx.h:30:
678:info:build In file included from /opt/local/include/gtk-2.0/gdk/gdkprivate.h:30:
679:info:build In file included from /opt/local/include/gtk-2.0/gdk/gdk.h:39:
680:info:build /opt/local/include/gtk-2.0/gdk/gdkdrawable.h:91:12: error: unknown type name 'gchar'
681:info:build                           const gchar  *text,
682:info:build                                 ^
683:info:build In file included from gdkglquery-x11.c:27:
684:info:build In file included from ./gdkglx.h:22:
685:info:build In file included from /opt/local/include/gtk-2.0/gdk/gdkx.h:30:
686:info:build In file included from /opt/local/include/gtk-2.0/gdk/gdkprivate.h:30:
687:info:build In file included from /opt/local/include/gtk-2.0/gdk/gdk.h:46:
688:info:build /opt/local/include/gtk-2.0/gdk/gdkkeys.h:118:1: error: unknown type name 'gchar'
689:info:build gchar*   gdk_keyval_name         (guint        keyval) G_GNUC_CONST;
690:info:build ^
691:info:build /opt/local/include/gtk-2.0/gdk/gdkkeys.h:119:41: error: unknown type name 'gchar'
692:info:build guint    gdk_keyval_from_name    (const gchar *keyval_name);
693:info:build                                         ^
694:info:build In file included from gdkglquery-x11.c:27:
695:info:build In file included from ./gdkglx.h:22:
696:info:build In file included from /opt/local/include/gtk-2.0/gdk/gdkx.h:30:
697:info:build In file included from /opt/local/include/gtk-2.0/gdk/gdkprivate.h:30:
698:info:build In file included from /opt/local/include/gtk-2.0/gdk/gdk.h:50:
699:info:build /opt/local/include/gtk-2.0/gdk/gdkproperty.h:45:32: error: unknown type name 'gchar'
700:info:build GdkAtom gdk_atom_intern (const gchar *atom_name,
701:info:build                                ^
702:info:build /opt/local/include/gtk-2.0/gdk/gdkproperty.h:47:46: error: unknown type name 'gchar'
703:info:build GdkAtom gdk_atom_intern_static_string (const gchar *atom_name);
704:info:build                                              ^
705:info:build /opt/local/include/gtk-2.0/gdk/gdkproperty.h:48:1: error: unknown type name 'gchar'
706:info:build gchar*  gdk_atom_name   (GdkAtom      atom);
707:info:build ^
708:info:build /opt/local/include/gtk-2.0/gdk/gdkproperty.h:99:8: error: unknown type name 'gchar'
709:info:build                                                  gchar        ***list);
710:info:build                                                  ^
711:info:build /opt/local/include/gtk-2.0/gdk/gdkproperty.h:101:1: error: unknown type name 'gchar'
712:info:build gchar   *gdk_utf8_to_string_target   (const gchar *str);
713:info:build ^
714:info:build /opt/local/include/gtk-2.0/gdk/gdkproperty.h:101:45: error: unknown type name 'gchar'
715:info:build gchar   *gdk_utf8_to_string_target   (const gchar *str);
716:info:build                                             ^
717:info:build In file included from gdkglquery-x11.c:27:
718:info:build In file included from ./gdkglx.h:22:
719:info:build In file included from /opt/local/include/gtk-2.0/gdk/gdkx.h:30:
720:info:build In file included from /opt/local/include/gtk-2.0/gdk/gdkprivate.h:30:
721:info:build In file included from /opt/local/include/gtk-2.0/gdk/gdk.h:56:
722:info:build In file included from /opt/local/include/gtk-2.0/gdk/gdktestutils.h:28:
723:info:build /opt/local/include/gtk-2.0/gdk/gdkwindow.h:210:3: error: unknown type name 'gchar'
724:info:build   gchar *title;
725:info:build   ^
726:info:build fatal error: too many errors emitted, stopping now [-ferror-limit=]
727:info:build 20 errors generated.
728:info:build make[4]: *** [gdkglquery-x11.lo] Error 1
729:info:build make[4]: Leaving directory `/opt/local/var/macports/build/_opt_local_var_macports_sources_rsync.macports.org_release_tarballs_ports_devel_gtkglext/gtkglext/work/gtkglext-1.2.0/gdk/x11'
730:info:build make[3]: *** [all-recursive] Error 1
731:info:build make[3]: Leaving directory `/opt/local/var/macports/build/_opt_local_var_macports_sources_rsync.macports.org_release_tarballs_ports_devel_gtkglext/gtkglext/work/gtkglext-1.2.0/gdk'
732:info:build make[2]: *** [all] Error 2
733:info:build make[2]: Leaving directory `/opt/local/var/macports/build/_opt_local_var_macports_sources_rsync.macports.org_release_tarballs_ports_devel_gtkglext/gtkglext/work/gtkglext-1.2.0/gdk'
734:info:build make[1]: *** [all-recursive] Error 1
735:info:build make[1]: Leaving directory `/opt/local/var/macports/build/_opt_local_var_macports_sources_rsync.macports.org_release_tarballs_ports_devel_gtkglext/gtkglext/work/gtkglext-1.2.0'
736:info:build make: *** [all] Error 2
737:info:build make: Leaving directory `/opt/local/var/macports/build/_opt_local_var_macports_sources_rsync.macports.org_release_tarballs_ports_devel_gtkglext/gtkglext/work/gtkglext-1.2.0'
738:info:build shell command " cd "/opt/local/var/macports/build/_opt_local_var_macports_sources_rsync.macports.org_release_tarballs_ports_devel_gtkglext/gtkglext/work/gtkglext-1.2.0" && /usr/bin/make -j4 -w all " returned error 2
739:error:build Target org.macports.build returned: shell command failed (see log for details)
740:debug:build Backtrace: shell command failed (see log for details)
741    while executing
742"command_exec build"
743    (procedure "portbuild::build_main" line 8)
744    invoked from within
745"$procedure $targetname"
746:info:build Warning: the following items did not execute (for gtkglext): org.macports.activate org.macports.build org.macports.destroot org.macports.install
747:error:build Failed to install gtkglext
748:debug:build couldn't open "/System/Library/Frameworks/Tcl.framework/Versions/8.5/Resources/tclIndex": no such file or directory
749    while executing
750"open [file join $dir tclIndex]"
751:notice:build Log for gtkglext is at: /opt/local/var/macports/logs/_opt_local_var_macports_sources_rsync.macports.org_release_tarballs_ports_devel_gtkglext/gtkglext/main.log