Ticket #32561: config.log

File config.log, 18.3 KB (added by mlewis1973, 9 years ago)
Line 
1This file contains any messages produced by compilers while
2running configure, to aid debugging if configure makes a mistake.
3
4configure:661: checking for a BSD compatible install
5configure:714: checking whether build environment is sane
6configure:771: checking whether make sets ${MAKE}
7configure:810: checking for working aclocal
8configure:823: checking for working autoconf
9configure:836: checking for working automake
10configure:849: checking for working autoheader
11configure:862: checking for working makeinfo
12configure:957: checking host system type
13configure:978: checking build system type
14configure:998: checking for ranlib
15configure:1028: checking for gcc
16configure:1141: checking whether the C compiler (/Developer/usr/bin/clang -pipe -O2 -arch x86_64 -arch x86_64) works
17configure:1157: /Developer/usr/bin/clang -o conftest -pipe -O2 -arch x86_64  -arch x86_64 conftest.c  1>&5
18configure:1154:1: warning: type specifier missing, defaults to 'int' [-Wimplicit-int]
19main(){return(0);}
20^~~~
211 warning generated.
22configure:1183: checking whether the C compiler (/Developer/usr/bin/clang -pipe -O2 -arch x86_64 -arch x86_64) is a cross-compiler
23configure:1188: checking whether we are using GNU C
24configure:1216: checking whether /Developer/usr/bin/clang accepts -g
25configure:1259: checking for ld used by GCC
26configure:1321: checking if the linker (/Developer/usr/bin/ld) is GNU ld
27configure:1337: checking for BSD-compatible nm
28configure:1373: checking whether ln -s works
29ltconfig:603: checking for object suffix
30ltconfig:604: /Developer/usr/bin/clang -c -pipe -O2 -arch x86_64  conftest.c 1>&5
31ltconfig:781: checking if /Developer/usr/bin/clang PIC flag -fno-common works
32ltconfig:782: /Developer/usr/bin/clang -c -pipe -O2 -arch x86_64 -fno-common -DPIC  conftest.c 1>&5
33ltconfig:834: checking if /Developer/usr/bin/clang supports -c -o file.o
34ltconfig:835: /Developer/usr/bin/clang -c -pipe -O2 -arch x86_64 -o out/conftest2.o  conftest.c 1>&5
35ltconfig:867: checking if /Developer/usr/bin/clang supports -c -o file.lo
36ltconfig:868: /Developer/usr/bin/clang -c -pipe -O2 -arch x86_64 -c -o conftest.lo  conftest.c 1>&5
37ltconfig:919: checking if /Developer/usr/bin/clang supports -fno-rtti -fno-exceptions
38ltconfig:920: /Developer/usr/bin/clang -c -pipe -O2 -arch x86_64 -fno-rtti -fno-exceptions -c conftest.c  conftest.c 1>&5
39ltconfig:963: checking if /Developer/usr/bin/clang static flag -static works
40ltconfig:964: /Developer/usr/bin/clang -o conftest -pipe -O2 -arch x86_64  -arch x86_64 -static conftest.c  1>&5
41conftest.c:1:1: warning: type specifier missing, defaults to 'int' [-Wimplicit-int]
42main(){return(0);}
43^~~~
441 warning generated.
45ld: library not found for -lcrt0.o
46clang: error: linker command failed with exit code 1 (use -v to see invocation)
47ltconfig:1669: checking if global_symbol_pipe works
48ltconfig:1670: /Developer/usr/bin/clang -c -pipe -O2 -arch x86_64  conftest.c 1>&5
49conftest.c:9:1: warning: type specifier missing, defaults to 'int' [-Wimplicit-int]
50main(){nm_test_var='a';nm_test_func();return(0);}
51^~~~
521 warning generated.
53ltconfig:1673: eval "/usr/bin/nm conftest.o | sed -n -e 's/^.*[         ]\([BCDEGRST]\)[        ][      ]*\(\)\([_A-Za-z][_A-Za-z0-9]*\)$/\1 \2\3 \3/p' > conftest.nm"
54cannot find nm_test_var in conftest.nm
55ltconfig:1669: checking if global_symbol_pipe works
56ltconfig:1670: /Developer/usr/bin/clang -c -pipe -O2 -arch x86_64  conftest.c 1>&5
57conftest.c:9:1: warning: type specifier missing, defaults to 'int' [-Wimplicit-int]
58main(){nm_test_var='a';nm_test_func();return(0);}
59^~~~
601 warning generated.
61ltconfig:1673: eval "/usr/bin/nm conftest.o | sed -n -e 's/^.*[         ]\([BCDEGRST]\)[        ][      ]*\(_\)\([_A-Za-z][_A-Za-z0-9]*\)$/\1 \2\3 \3/p' > conftest.nm"
62ltconfig:1725: /Developer/usr/bin/clang -o conftest -pipe -O2 -arch x86_64 -fno-builtin -fno-rtti -fno-exceptions  -arch x86_64 conftest.c conftstm.o 1>&5
63configure:1559: checking whether to enable maintainer-specific portions of Makefiles
64configure:1589: checking host system type
65configure:1705: checking whether build environment is sane
66configure:1747: checking for gcc
67configure:1860: checking whether the C compiler (/Developer/usr/bin/clang -pipe -O2 -arch x86_64 -arch x86_64) works
68configure:1876: /Developer/usr/bin/clang -o conftest -pipe -O2 -arch x86_64  -arch x86_64 conftest.c  1>&5
69configure:1873:1: warning: type specifier missing, defaults to 'int' [-Wimplicit-int]
70main(){return(0);}
71^~~~
721 warning generated.
73configure:1902: checking whether the C compiler (/Developer/usr/bin/clang -pipe -O2 -arch x86_64 -arch x86_64) is a cross-compiler
74configure:1907: checking whether we are using GNU C
75configure:1935: checking whether /Developer/usr/bin/clang accepts -g
76configure:1967: checking for POSIXized ISC
77configure:1991: checking for /Developer/usr/bin/clang option to accept ANSI C
78configure:2044: /Developer/usr/bin/clang  -c -pipe -O2 -arch x86_64  conftest.c 1>&5
79configure:2079: checking for a BSD compatible install
80configure:2132: checking whether make sets ${MAKE}
81configure:2189: checking for gawk
82configure:2189: checking for mawk
83configure:2189: checking for nawk
84configure:2189: checking for awk
85configure:2223: checking for perl5
86configure:2257: checking for indent
87configure:2294: checking whether make is GNU Make
88configure:2312: checking how to run the C preprocessor
89configure:2333: /Developer/usr/bin/clang -E  conftest.c >/dev/null 2>conftest.out
90configure:2392: checking for ANSI C header files
91configure:2405: /Developer/usr/bin/clang -E  conftest.c >/dev/null 2>conftest.out
92configure:2472: /Developer/usr/bin/clang -o conftest -pipe -O2 -arch x86_64 -Wall  -arch x86_64 conftest.c  1>&5
93configure:2467:67: warning: implicitly declaring C library function 'exit' with type 'void (int) __attribute__((noreturn))'
94if (XOR (islower (i), ISLOWER (i)) || toupper (i) != TOUPPER (i)) exit(2);
95                                                                  ^
96configure:2467:67: note: please include the header <stdlib.h> or explicitly provide a declaration for 'exit'
971 warning generated.
98configure:2496: checking for working const
99configure:2550: /Developer/usr/bin/clang -c -pipe -O2 -arch x86_64 -Wall  conftest.c 1>&5
100configure:2524:15: warning: unused variable 's' [-Wunused-variable]
101  char const *s = 0 ? (char *) 0 : (char const *) 0;
102              ^
103configure:2544:13: warning: unused variable 'foo' [-Wunused-variable]
104  const int foo = 10;
105            ^
106configure:2506:39: warning: unused variable 'x' [-Wunused-variable]
107typedef int charset[2]; const charset x;
108                                      ^
109configure:2512:27: warning: unused variable 'zero' [-Wunused-variable]
110static struct point const zero = {0,0};
111                          ^
112configure:2541:16: warning: variable 'b' is uninitialized when used here [-Wuninitialized]
113  struct s *b; b->j = 5;
114               ^
115configure:2541:3: note: variable 'b' is declared here
116  struct s *b; b->j = 5;
117  ^
118configure:2541:14: note: add initialization to silence this warning
119  struct s *b; b->j = 5;
120             ^
121              = 0
122configure:2526:4: warning: variable 't' is uninitialized when used here [-Wuninitialized]
123  *t++ = 0;
124   ^
125configure:2523:3: note: variable 't' is declared here
126  char *t;
127  ^
128configure:2523:10: note: add initialization to silence this warning
129  char *t;
130         ^
131          = 0
1326 warnings generated.
133configure:2571: checking for inline
134configure:2585: /Developer/usr/bin/clang -c -pipe -O2 -arch x86_64 -Wall  conftest.c 1>&5
135configure:2581:10: warning: type specifier missing, defaults to 'int' [-Wimplicit-int]
136} inline foo() {
137  ~~~~~~ ^
1381 warning generated.
139configure:2611: checking for off_t
140configure:2644: checking for size_t
141configure:2679: checking for working alloca.h
142configure:2691: /Developer/usr/bin/clang -o conftest -pipe -O2 -arch x86_64 -Wall  -arch x86_64 conftest.c  1>&5
143configure:2687:7: warning: unused variable 'p' [-Wunused-variable]
144char *p = alloca(2 * sizeof(int));
145      ^
1461 warning generated.
147configure:2712: checking for alloca
148configure:2745: /Developer/usr/bin/clang -o conftest -pipe -O2 -arch x86_64 -Wall  -arch x86_64 conftest.c  1>&5
149configure:2741:7: warning: unused variable 'p' [-Wunused-variable]
150char *p = (char *) alloca(1);
151      ^
1521 warning generated.
153configure:2914: checking for unistd.h
154configure:2924: /Developer/usr/bin/clang -E  conftest.c >/dev/null 2>conftest.out
155configure:2953: checking for getpagesize
156configure:2981: /Developer/usr/bin/clang -o conftest -pipe -O2 -arch x86_64 -Wall  -arch x86_64 conftest.c  1>&5
157configure:3006: checking for working mmap
158configure:3154: /Developer/usr/bin/clang -o conftest -pipe -O2 -arch x86_64 -Wall  -arch x86_64 conftest.c  1>&5
159configure:3085:7: warning: incompatible redeclaration of library function 'malloc'
160char *malloc();
161      ^
162configure:3085:7: note: 'malloc' is a builtin with type 'void *(unsigned long)'
163configure:3095:13: warning: implicit declaration of function 'getpagesize' is invalid in C99 [-Wimplicit-function-declaration]
164        pagesize = getpagesize();
165                   ^
166configure:3102:3: warning: implicitly declaring C library function 'exit' with type 'void (int) __attribute__((noreturn))'
167                exit(1);
168                ^
169configure:3102:3: note: please include the header <stdlib.h> or explicitly provide a declaration for 'exit'
170configure:3104:17: warning: implicit declaration of function 'rand' is invalid in C99 [-Wimplicit-function-declaration]
171                *(data + i) = rand();
172                              ^
173configure:3105:2: warning: implicit declaration of function 'umask' is invalid in C99 [-Wimplicit-function-declaration]
174        umask(0);
175        ^
176configure:3109:6: warning: implicit declaration of function 'write' is invalid in C99 [-Wimplicit-function-declaration]
177        if (write(fd, data, pagesize) != pagesize)
178            ^
179configure:3111:2: warning: implicit declaration of function 'close' is invalid in C99 [-Wimplicit-function-declaration]
180        close(fd);
181        ^
182configure:3142:6: warning: implicit declaration of function 'read' is invalid in C99 [-Wimplicit-function-declaration]
183        if (read(fd, data3, pagesize) != pagesize)
184            ^
185configure:3148:2: warning: implicit declaration of function 'unlink' is invalid in C99 [-Wimplicit-function-declaration]
186        unlink("conftestmmap");
187        ^
1889 warnings generated.
189configure:3182: checking for argz.h
190configure:3192: /Developer/usr/bin/clang -E  conftest.c >/dev/null 2>conftest.out
191configure:3188:10: fatal error: 'argz.h' file not found
192#include <argz.h>
193         ^
1941 error generated.
195configure: failed program was:
196#line 3187 "configure"
197#include "confdefs.h"
198#include <argz.h>
199configure:3182: checking for limits.h
200configure:3192: /Developer/usr/bin/clang -E  conftest.c >/dev/null 2>conftest.out
201configure:3182: checking for locale.h
202configure:3192: /Developer/usr/bin/clang -E  conftest.c >/dev/null 2>conftest.out
203configure:3182: checking for nl_types.h
204configure:3192: /Developer/usr/bin/clang -E  conftest.c >/dev/null 2>conftest.out
205configure:3182: checking for malloc.h
206configure:3192: /Developer/usr/bin/clang -E  conftest.c >/dev/null 2>conftest.out
207configure:3188:10: fatal error: 'malloc.h' file not found
208#include <malloc.h>
209         ^
2101 error generated.
211configure: failed program was:
212#line 3187 "configure"
213#include "confdefs.h"
214#include <malloc.h>
215configure:3182: checking for string.h
216configure:3192: /Developer/usr/bin/clang -E  conftest.c >/dev/null 2>conftest.out
217configure:3182: checking for unistd.h
218configure:3182: checking for sys/param.h
219configure:3192: /Developer/usr/bin/clang -E  conftest.c >/dev/null 2>conftest.out
220configure:3222: checking for getcwd
221configure:3250: /Developer/usr/bin/clang -o conftest -pipe -O2 -arch x86_64 -Wall  -arch x86_64 conftest.c  1>&5
222configure:3222: checking for munmap
223configure:3250: /Developer/usr/bin/clang -o conftest -pipe -O2 -arch x86_64 -Wall  -arch x86_64 conftest.c  1>&5
224configure:3222: checking for putenv
225configure:3250: /Developer/usr/bin/clang -o conftest -pipe -O2 -arch x86_64 -Wall  -arch x86_64 conftest.c  1>&5
226configure:3222: checking for setenv
227configure:3250: /Developer/usr/bin/clang -o conftest -pipe -O2 -arch x86_64 -Wall  -arch x86_64 conftest.c  1>&5
228configure:3222: checking for setlocale
229configure:3250: /Developer/usr/bin/clang -o conftest -pipe -O2 -arch x86_64 -Wall  -arch x86_64 conftest.c  1>&5
230configure:3222: checking for strchr
231configure:3250: /Developer/usr/bin/clang -o conftest -pipe -O2 -arch x86_64 -Wall  -arch x86_64 conftest.c  1>&5
232configure:3234:6: warning: incompatible redeclaration of library function 'strchr'
233char strchr();
234     ^
235configure:3234:6: note: 'strchr' is a builtin with type 'char *(const char *, int)'
2361 warning generated.
237configure:3222: checking for strcasecmp
238configure:3250: /Developer/usr/bin/clang -o conftest -pipe -O2 -arch x86_64 -Wall  -arch x86_64 conftest.c  1>&5
239configure:3222: checking for strdup
240configure:3250: /Developer/usr/bin/clang -o conftest -pipe -O2 -arch x86_64 -Wall  -arch x86_64 conftest.c  1>&5
241configure:3234:6: warning: incompatible redeclaration of library function 'strdup'
242char strdup();
243     ^
244configure:3234:6: note: 'strdup' is a builtin with type 'char *(const char *)'
2451 warning generated.
246configure:3222: checking for __argz_count
247configure:3250: /Developer/usr/bin/clang -o conftest -pipe -O2 -arch x86_64 -Wall  -arch x86_64 conftest.c  1>&5
248Undefined symbols for architecture x86_64:
249  "___argz_count", referenced from:
250      _main in cc-pxRyoy.o
251ld: symbol(s) not found for architecture x86_64
252clang: error: linker command failed with exit code 1 (use -v to see invocation)
253configure: failed program was:
254#line 3227 "configure"
255#include "confdefs.h"
256/* System header to define __stub macros and hopefully few prototypes,
257    which can conflict with char __argz_count(); below.  */
258#include <assert.h>
259/* Override any gcc2 internal prototype to avoid an error.  */
260/* We use char because int might match the return type of a gcc2
261    builtin and then its argument prototype would still apply.  */
262char __argz_count();
263
264int main() {
265
266/* The GNU C library defines this for functions which it implements
267    to always fail with ENOSYS.  Some functions are actually named
268    something starting with __ and the normal name is an alias.  */
269#if defined (__stub___argz_count) || defined (__stub_____argz_count)
270choke me
271#else
272__argz_count();
273#endif
274
275; return 0; }
276configure:3222: checking for __argz_stringify
277configure:3250: /Developer/usr/bin/clang -o conftest -pipe -O2 -arch x86_64 -Wall  -arch x86_64 conftest.c  1>&5
278Undefined symbols for architecture x86_64:
279  "___argz_stringify", referenced from:
280      _main in cc-Ar5L8e.o
281ld: symbol(s) not found for architecture x86_64
282clang: error: linker command failed with exit code 1 (use -v to see invocation)
283configure: failed program was:
284#line 3227 "configure"
285#include "confdefs.h"
286/* System header to define __stub macros and hopefully few prototypes,
287    which can conflict with char __argz_stringify(); below.  */
288#include <assert.h>
289/* Override any gcc2 internal prototype to avoid an error.  */
290/* We use char because int might match the return type of a gcc2
291    builtin and then its argument prototype would still apply.  */
292char __argz_stringify();
293
294int main() {
295
296/* The GNU C library defines this for functions which it implements
297    to always fail with ENOSYS.  Some functions are actually named
298    something starting with __ and the normal name is an alias.  */
299#if defined (__stub___argz_stringify) || defined (__stub_____argz_stringify)
300choke me
301#else
302__argz_stringify();
303#endif
304
305; return 0; }
306configure:3222: checking for __argz_next
307configure:3250: /Developer/usr/bin/clang -o conftest -pipe -O2 -arch x86_64 -Wall  -arch x86_64 conftest.c  1>&5
308Undefined symbols for architecture x86_64:
309  "___argz_next", referenced from:
310      _main in cc-9fhHc5.o
311ld: symbol(s) not found for architecture x86_64
312clang: error: linker command failed with exit code 1 (use -v to see invocation)
313configure: failed program was:
314#line 3227 "configure"
315#include "confdefs.h"
316/* System header to define __stub macros and hopefully few prototypes,
317    which can conflict with char __argz_next(); below.  */
318#include <assert.h>
319/* Override any gcc2 internal prototype to avoid an error.  */
320/* We use char because int might match the return type of a gcc2
321    builtin and then its argument prototype would still apply.  */
322char __argz_next();
323
324int main() {
325
326/* The GNU C library defines this for functions which it implements
327    to always fail with ENOSYS.  Some functions are actually named
328    something starting with __ and the normal name is an alias.  */
329#if defined (__stub___argz_next) || defined (__stub_____argz_next)
330choke me
331#else
332__argz_next();
333#endif
334
335; return 0; }
336configure:3279: checking for stpcpy
337configure:3307: /Developer/usr/bin/clang -o conftest -pipe -O2 -arch x86_64 -Wall  -arch x86_64 conftest.c  1>&5
338configure:3291:6: warning: incompatible redeclaration of library function 'stpcpy'
339char stpcpy();
340     ^
341configure:3291:6: note: 'stpcpy' is a builtin with type 'char *(char *, const char *)'
3421 warning generated.
343configure:3341: checking for LC_MESSAGES
344configure:3353: /Developer/usr/bin/clang -o conftest -pipe -O2 -arch x86_64 -Wall  -arch x86_64 conftest.c  1>&5
345configure:3374: checking whether NLS is requested
346configure:4114: checking for extra flags to get ANSI library prototypes
347configure:4128: /Developer/usr/bin/clang -o conftest -pipe -O2 -arch x86_64 -Wall  -arch x86_64 conftest.c   -lm 1>&5
348configure:4168: checking for extra flags for POSIX compliance
349configure:4177: /Developer/usr/bin/clang -c -pipe -O2 -arch x86_64 -Wall  conftest.c 1>&5
350configure:4173:6: warning: unused variable 'dir' [-Wunused-variable]
351DIR *dir;
352     ^
3531 warning generated.
354configure:4270: checking for glib-config
355configure:4305: checking for GLIB - version >= 1.2.8
356configure:4404: /Developer/usr/bin/clang -o conftest -pipe -O2 -arch x86_64 -Wall -I/opt/local/include/glib-1.2 -I/opt/local/lib/glib/include -D_REENTRANT  -arch x86_64 conftest.c -L/opt/local/lib -lgmodule -lgthread -lglib -lpthread   1>&5
357configure:4544: checking for X
358configure:4611: /Developer/usr/bin/clang -E  conftest.c >/dev/null 2>conftest.out
359configure:4687: /Developer/usr/bin/clang -o conftest -pipe -O2 -arch x86_64 -Wall  -arch x86_64 conftest.c -lXt   1>&5
360configure:4683:1: warning: implicit declaration of function 'XtMalloc' is invalid in C99 [-Wimplicit-function-declaration]
361XtMalloc()
362^
3631 warning generated.
364ld: library not found for -lXt
365clang: error: linker command failed with exit code 1 (use -v to see invocation)
366configure: failed program was:
367#line 4680 "configure"
368#include "confdefs.h"
369
370int main() {
371XtMalloc()
372; return 0; }