Ticket #32561: main.2.log

File main.2.log, 84.2 KB (added by mlewis1973, 9 years ago)
Line 
1version:1
2:debug:main epoch: in tree: 0 installed: 0
3:debug:main glib1 1.2.10_6 exists in the ports tree
4:debug:main glib1 1.2.10_6  is the latest installed
5:debug:main glib1 1.2.10_6  is active
6:debug:main Merging existing variants '' into variants
7:debug:main new fully merged portvariants:
8:debug:main Changing to port directory: /opt/local/var/macports/sources/rsync.macports.org/release/tarballs/ports/devel/glib1
9:debug:main OS darwin/11.1.0 (Mac OS X 10.7) arch i386
10:debug:main org.macports.load registered provides 'load', a pre-existing procedure. Target override will not be provided
11:debug:main org.macports.unload registered provides 'unload', a pre-existing procedure. Target override will not be provided
12:debug:main org.macports.distfiles registered provides 'distfiles', a pre-existing procedure. Target override will not be provided
13:debug:main adding the default universal variant
14:debug:main Reading variant descriptions from /opt/local/var/macports/sources/rsync.macports.org/release/tarballs/ports/_resources/port1.0/variant_descriptions.conf
15:debug:main No need to upgrade! glib1 1.2.10_6 >= glib1 1.2.10_6
16:debug:main epoch: in tree: 0 installed: 0
17:debug:main gettext 0.18.1.1_2 exists in the ports tree
18:debug:main gettext 0.18.1.1_2  is the latest installed
19:debug:main gettext 0.18.1.1_2  is active
20:debug:main Merging existing variants '' into variants
21:debug:main new fully merged portvariants:
22:debug:main Changing to port directory: /opt/local/var/macports/sources/rsync.macports.org/release/tarballs/ports/devel/gettext
23:debug:main OS darwin/11.1.0 (Mac OS X 10.7) arch i386
24:debug:main org.macports.load registered provides 'load', a pre-existing procedure. Target override will not be provided
25:debug:main org.macports.unload registered provides 'unload', a pre-existing procedure. Target override will not be provided
26:debug:main org.macports.distfiles registered provides 'distfiles', a pre-existing procedure. Target override will not be provided
27:debug:main Using group file /opt/local/var/macports/sources/rsync.macports.org/release/tarballs/ports/_resources/port1.0/group/muniversal-1.0.tcl
28:debug:main Reading variant descriptions from /opt/local/var/macports/sources/rsync.macports.org/release/tarballs/ports/_resources/port1.0/variant_descriptions.conf
29:debug:main Using group file /opt/local/var/macports/sources/rsync.macports.org/release/tarballs/ports/_resources/port1.0/group/archcheck-1.0.tcl
30:debug:main universal variant already exists, so not adding the default one
31:debug:main No need to upgrade! gettext 0.18.1.1_2 >= gettext 0.18.1.1_2
32:debug:main epoch: in tree: 0 installed: 0
33:debug:main libiconv 1.14_0 exists in the ports tree
34:debug:main libiconv 1.14_0  is the latest installed
35:debug:main libiconv 1.14_0  is active
36:debug:main Merging existing variants '' into variants
37:debug:main new fully merged portvariants:
38:debug:main Changing to port directory: /opt/local/var/macports/sources/rsync.macports.org/release/tarballs/ports/textproc/libiconv
39:debug:main OS darwin/11.1.0 (Mac OS X 10.7) arch i386
40:debug:main org.macports.load registered provides 'load', a pre-existing procedure. Target override will not be provided
41:debug:main org.macports.unload registered provides 'unload', a pre-existing procedure. Target override will not be provided
42:debug:main org.macports.distfiles registered provides 'distfiles', a pre-existing procedure. Target override will not be provided
43:debug:main Using group file /opt/local/var/macports/sources/rsync.macports.org/release/tarballs/ports/_resources/port1.0/group/muniversal-1.0.tcl
44:debug:main Reading variant descriptions from /opt/local/var/macports/sources/rsync.macports.org/release/tarballs/ports/_resources/port1.0/variant_descriptions.conf
45:debug:main universal variant already exists, so not adding the default one
46:debug:main No need to upgrade! libiconv 1.14_0 >= libiconv 1.14_0
47:debug:main epoch: in tree: 0 installed: 0
48:debug:main ncurses 5.9_1 exists in the ports tree
49:debug:main ncurses 5.9_1  is the latest installed
50:debug:main ncurses 5.9_1  is active
51:debug:main Merging existing variants '' into variants
52:debug:main new fully merged portvariants:
53:debug:main Changing to port directory: /opt/local/var/macports/sources/rsync.macports.org/release/tarballs/ports/devel/ncurses
54:debug:main OS darwin/11.1.0 (Mac OS X 10.7) arch i386
55:debug:main org.macports.load registered provides 'load', a pre-existing procedure. Target override will not be provided
56:debug:main org.macports.unload registered provides 'unload', a pre-existing procedure. Target override will not be provided
57:debug:main org.macports.distfiles registered provides 'distfiles', a pre-existing procedure. Target override will not be provided
58:debug:main adding the default universal variant
59:debug:main Reading variant descriptions from /opt/local/var/macports/sources/rsync.macports.org/release/tarballs/ports/_resources/port1.0/variant_descriptions.conf
60:debug:main No need to upgrade! ncurses 5.9_1 >= ncurses 5.9_1
61:debug:main epoch: in tree: 0 installed: 0
62:debug:main expat 2.0.1_1 exists in the ports tree
63:debug:main expat 2.0.1_1  is the latest installed
64:debug:main expat 2.0.1_1  is active
65:debug:main Merging existing variants '' into variants
66:debug:main new fully merged portvariants:
67:debug:main Changing to port directory: /opt/local/var/macports/sources/rsync.macports.org/release/tarballs/ports/textproc/expat
68:debug:main OS darwin/11.1.0 (Mac OS X 10.7) arch i386
69:debug:main org.macports.load registered provides 'load', a pre-existing procedure. Target override will not be provided
70:debug:main org.macports.unload registered provides 'unload', a pre-existing procedure. Target override will not be provided
71:debug:main org.macports.distfiles registered provides 'distfiles', a pre-existing procedure. Target override will not be provided
72:debug:main adding the default universal variant
73:debug:main Reading variant descriptions from /opt/local/var/macports/sources/rsync.macports.org/release/tarballs/ports/_resources/port1.0/variant_descriptions.conf
74:debug:main No need to upgrade! expat 2.0.1_1 >= expat 2.0.1_1
75:debug:main epoch: in tree: 0 installed: 0
76:debug:main xorg-libXext 1.3.0_0 exists in the ports tree
77:debug:main xorg-libXext 1.3.0_0  is the latest installed
78:debug:main xorg-libXext 1.3.0_0  is active
79:debug:main Merging existing variants '' into variants
80:debug:main new fully merged portvariants:
81:debug:main Changing to port directory: /opt/local/var/macports/sources/rsync.macports.org/release/tarballs/ports/x11/xorg-libXext
82:debug:main OS darwin/11.1.0 (Mac OS X 10.7) arch i386
83:debug:main org.macports.load registered provides 'load', a pre-existing procedure. Target override will not be provided
84:debug:main org.macports.unload registered provides 'unload', a pre-existing procedure. Target override will not be provided
85:debug:main org.macports.distfiles registered provides 'distfiles', a pre-existing procedure. Target override will not be provided
86:debug:main adding the default universal variant
87:debug:main Reading variant descriptions from /opt/local/var/macports/sources/rsync.macports.org/release/tarballs/ports/_resources/port1.0/variant_descriptions.conf
88:debug:main No need to upgrade! xorg-libXext 1.3.0_0 >= xorg-libXext 1.3.0_0
89:debug:main epoch: in tree: 0 installed: 0
90:debug:main xorg-libX11 1.4.4_0 exists in the ports tree
91:debug:main xorg-libX11 1.4.4_0  is the latest installed
92:debug:main xorg-libX11 1.4.4_0  is active
93:debug:main Merging existing variants '' into variants
94:debug:main new fully merged portvariants:
95:debug:main Changing to port directory: /opt/local/var/macports/sources/rsync.macports.org/release/tarballs/ports/x11/xorg-libX11
96:debug:main OS darwin/11.1.0 (Mac OS X 10.7) arch i386
97:debug:main org.macports.load registered provides 'load', a pre-existing procedure. Target override will not be provided
98:debug:main org.macports.unload registered provides 'unload', a pre-existing procedure. Target override will not be provided
99:debug:main org.macports.distfiles registered provides 'distfiles', a pre-existing procedure. Target override will not be provided
100:debug:main adding the default universal variant
101:debug:main Reading variant descriptions from /opt/local/var/macports/sources/rsync.macports.org/release/tarballs/ports/_resources/port1.0/variant_descriptions.conf
102:debug:main No need to upgrade! xorg-libX11 1.4.4_0 >= xorg-libX11 1.4.4_0
103:debug:main epoch: in tree: 0 installed: 0
104:debug:main xorg-libXdmcp 1.1.0_0 exists in the ports tree
105:debug:main xorg-libXdmcp 1.1.0_0  is the latest installed
106:debug:main xorg-libXdmcp 1.1.0_0  is active
107:debug:main Merging existing variants '' into variants
108:debug:main new fully merged portvariants:
109:debug:main Changing to port directory: /opt/local/var/macports/sources/rsync.macports.org/release/tarballs/ports/x11/xorg-libXdmcp
110:debug:main OS darwin/11.1.0 (Mac OS X 10.7) arch i386
111:debug:main org.macports.load registered provides 'load', a pre-existing procedure. Target override will not be provided
112:debug:main org.macports.unload registered provides 'unload', a pre-existing procedure. Target override will not be provided
113:debug:main org.macports.distfiles registered provides 'distfiles', a pre-existing procedure. Target override will not be provided
114:debug:main adding the default universal variant
115:debug:main Reading variant descriptions from /opt/local/var/macports/sources/rsync.macports.org/release/tarballs/ports/_resources/port1.0/variant_descriptions.conf
116:debug:main No need to upgrade! xorg-libXdmcp 1.1.0_0 >= xorg-libXdmcp 1.1.0_0
117:debug:main epoch: in tree: 0 installed: 0
118:debug:main xorg-libXau 1.0.6_0 exists in the ports tree
119:debug:main xorg-libXau 1.0.6_0  is the latest installed
120:debug:main xorg-libXau 1.0.6_0  is active
121:debug:main Merging existing variants '' into variants
122:debug:main new fully merged portvariants:
123:debug:main Changing to port directory: /opt/local/var/macports/sources/rsync.macports.org/release/tarballs/ports/x11/xorg-libXau
124:debug:main OS darwin/11.1.0 (Mac OS X 10.7) arch i386
125:debug:main org.macports.load registered provides 'load', a pre-existing procedure. Target override will not be provided
126:debug:main org.macports.unload registered provides 'unload', a pre-existing procedure. Target override will not be provided
127:debug:main org.macports.distfiles registered provides 'distfiles', a pre-existing procedure. Target override will not be provided
128:debug:main adding the default universal variant
129:debug:main Reading variant descriptions from /opt/local/var/macports/sources/rsync.macports.org/release/tarballs/ports/_resources/port1.0/variant_descriptions.conf
130:debug:main No need to upgrade! xorg-libXau 1.0.6_0 >= xorg-libXau 1.0.6_0
131:debug:main epoch: in tree: 0 installed: 0
132:debug:main xorg-xproto 7.0.22_0 exists in the ports tree
133:debug:main xorg-xproto 7.0.22_0  is the latest installed
134:debug:main xorg-xproto 7.0.22_0  is active
135:debug:main Merging existing variants '' into variants
136:debug:main new fully merged portvariants:
137:debug:main Changing to port directory: /opt/local/var/macports/sources/rsync.macports.org/release/tarballs/ports/x11/xorg-xproto
138:debug:main OS darwin/11.1.0 (Mac OS X 10.7) arch i386
139:debug:main org.macports.load registered provides 'load', a pre-existing procedure. Target override will not be provided
140:debug:main org.macports.unload registered provides 'unload', a pre-existing procedure. Target override will not be provided
141:debug:main org.macports.distfiles registered provides 'distfiles', a pre-existing procedure. Target override will not be provided
142:debug:main only one arch supported, so not adding the default universal variant
143:debug:main No need to upgrade! xorg-xproto 7.0.22_0 >= xorg-xproto 7.0.22_0
144:debug:main epoch: in tree: 0 installed: 0
145:debug:main xorg-libxcb 1.7_0 exists in the ports tree
146:debug:main xorg-libxcb 1.7_0 +python27 is the latest installed
147:debug:main xorg-libxcb 1.7_0 +python27 is active
148:debug:main Merging existing variants '+python27' into variants
149:debug:main new fully merged portvariants: python27 +
150:debug:main Changing to port directory: /opt/local/var/macports/sources/rsync.macports.org/release/tarballs/ports/x11/xorg-libxcb
151:debug:main OS darwin/11.1.0 (Mac OS X 10.7) arch i386
152:debug:main org.macports.load registered provides 'load', a pre-existing procedure. Target override will not be provided
153:debug:main org.macports.unload registered provides 'unload', a pre-existing procedure. Target override will not be provided
154:debug:main org.macports.distfiles registered provides 'distfiles', a pre-existing procedure. Target override will not be provided
155:debug:main adding the default universal variant
156:debug:main Reading variant descriptions from /opt/local/var/macports/sources/rsync.macports.org/release/tarballs/ports/_resources/port1.0/variant_descriptions.conf
157:debug:main Executing variant python27 provides python27
158:debug:main No need to upgrade! xorg-libxcb 1.7_0 >= xorg-libxcb 1.7_0
159:debug:main epoch: in tree: 0 installed: 0
160:debug:main xorg-xcb-proto 1.6_0 exists in the ports tree
161:debug:main xorg-xcb-proto 1.6_0 +python27 is the latest installed
162:debug:main xorg-xcb-proto 1.6_0 +python27 is active
163:debug:main Merging existing variants '+python27' into variants
164:debug:main new fully merged portvariants: python27 +
165:debug:main Changing to port directory: /opt/local/var/macports/sources/rsync.macports.org/release/tarballs/ports/x11/xorg-xcb-proto
166:debug:main OS darwin/11.1.0 (Mac OS X 10.7) arch i386
167:debug:main org.macports.load registered provides 'load', a pre-existing procedure. Target override will not be provided
168:debug:main org.macports.unload registered provides 'unload', a pre-existing procedure. Target override will not be provided
169:debug:main org.macports.distfiles registered provides 'distfiles', a pre-existing procedure. Target override will not be provided
170:debug:main only one arch supported, so not adding the default universal variant
171:debug:main Executing variant python27 provides python27
172:debug:main No need to upgrade! xorg-xcb-proto 1.6_0 >= xorg-xcb-proto 1.6_0
173:debug:main epoch: in tree: 0 installed: 0
174:debug:main libxml2 2.7.8_0 exists in the ports tree
175:debug:main libxml2 2.7.8_0  is the latest installed
176:debug:main libxml2 2.7.8_0  is active
177:debug:main Merging existing variants '' into variants
178:debug:main new fully merged portvariants:
179:debug:main Changing to port directory: /opt/local/var/macports/sources/rsync.macports.org/release/tarballs/ports/textproc/libxml2
180:debug:main OS darwin/11.1.0 (Mac OS X 10.7) arch i386
181:debug:main org.macports.load registered provides 'load', a pre-existing procedure. Target override will not be provided
182:debug:main org.macports.unload registered provides 'unload', a pre-existing procedure. Target override will not be provided
183:debug:main org.macports.distfiles registered provides 'distfiles', a pre-existing procedure. Target override will not be provided
184:debug:main Using group file /opt/local/var/macports/sources/rsync.macports.org/release/tarballs/ports/_resources/port1.0/group/archcheck-1.0.tcl
185:debug:main adding the default universal variant
186:debug:main Reading variant descriptions from /opt/local/var/macports/sources/rsync.macports.org/release/tarballs/ports/_resources/port1.0/variant_descriptions.conf
187:debug:main No need to upgrade! libxml2 2.7.8_0 >= libxml2 2.7.8_0
188:debug:main epoch: in tree: 0 installed: 0
189:debug:main zlib 1.2.5_0 exists in the ports tree
190:debug:main zlib 1.2.5_0  is the latest installed
191:debug:main zlib 1.2.5_0  is active
192:debug:main Merging existing variants '' into variants
193:debug:main new fully merged portvariants:
194:debug:main Changing to port directory: /opt/local/var/macports/sources/rsync.macports.org/release/tarballs/ports/archivers/zlib
195:debug:main OS darwin/11.1.0 (Mac OS X 10.7) arch i386
196:debug:main org.macports.load registered provides 'load', a pre-existing procedure. Target override will not be provided
197:debug:main org.macports.unload registered provides 'unload', a pre-existing procedure. Target override will not be provided
198:debug:main org.macports.distfiles registered provides 'distfiles', a pre-existing procedure. Target override will not be provided
199:debug:main Using group file /opt/local/var/macports/sources/rsync.macports.org/release/tarballs/ports/_resources/port1.0/group/xcodeversion-1.0.tcl
200:debug:main adding the default universal variant
201:debug:main Reading variant descriptions from /opt/local/var/macports/sources/rsync.macports.org/release/tarballs/ports/_resources/port1.0/variant_descriptions.conf
202:debug:main No need to upgrade! zlib 1.2.5_0 >= zlib 1.2.5_0
203:debug:main epoch: in tree: 2 installed: 2
204:debug:main python27 2.7.2_3 exists in the ports tree
205:debug:main python27 2.7.2_3  is the latest installed
206:debug:main python27 2.7.2_3  is active
207:debug:main Merging existing variants '' into variants
208:debug:main new fully merged portvariants:
209:debug:main Changing to port directory: /opt/local/var/macports/sources/rsync.macports.org/release/tarballs/ports/lang/python27
210:debug:main OS darwin/11.1.0 (Mac OS X 10.7) arch i386
211:debug:main org.macports.load registered provides 'load', a pre-existing procedure. Target override will not be provided
212:debug:main org.macports.unload registered provides 'unload', a pre-existing procedure. Target override will not be provided
213:debug:main org.macports.distfiles registered provides 'distfiles', a pre-existing procedure. Target override will not be provided
214:debug:main Using group file /opt/local/var/macports/sources/rsync.macports.org/release/tarballs/ports/_resources/port1.0/group/select-1.0.tcl
215:debug:main Reading variant descriptions from /opt/local/var/macports/sources/rsync.macports.org/release/tarballs/ports/_resources/port1.0/variant_descriptions.conf
216:debug:main universal variant already exists, so not adding the default one
217:debug:main No need to upgrade! python27 2.7.2_3 >= python27 2.7.2_3
218:debug:main epoch: in tree: 1 installed: 1
219:debug:main openssl 1.0.0e_1 exists in the ports tree
220:debug:main openssl 1.0.0e_1  is the latest installed
221:debug:main openssl 1.0.0e_1  is active
222:debug:main Merging existing variants '' into variants
223:debug:main new fully merged portvariants:
224:debug:main Changing to port directory: /opt/local/var/macports/sources/rsync.macports.org/release/tarballs/ports/devel/openssl
225:debug:main OS darwin/11.1.0 (Mac OS X 10.7) arch i386
226:debug:main org.macports.load registered provides 'load', a pre-existing procedure. Target override will not be provided
227:debug:main org.macports.unload registered provides 'unload', a pre-existing procedure. Target override will not be provided
228:debug:main org.macports.distfiles registered provides 'distfiles', a pre-existing procedure. Target override will not be provided
229:debug:main Using group file /opt/local/var/macports/sources/rsync.macports.org/release/tarballs/ports/_resources/port1.0/group/muniversal-1.0.tcl
230:debug:main Reading variant descriptions from /opt/local/var/macports/sources/rsync.macports.org/release/tarballs/ports/_resources/port1.0/variant_descriptions.conf
231:debug:main universal variant already exists, so not adding the default one
232:debug:main No need to upgrade! openssl 1.0.0e_1 >= openssl 1.0.0e_1
233:debug:main epoch: in tree: 0 installed: 0
234:debug:main sqlite3 3.7.9_0 exists in the ports tree
235:debug:main sqlite3 3.7.9_0  is the latest installed
236:debug:main sqlite3 3.7.9_0  is active
237:debug:main Merging existing variants '' into variants
238:debug:main new fully merged portvariants:
239:debug:main Changing to port directory: /opt/local/var/macports/sources/rsync.macports.org/release/tarballs/ports/databases/sqlite3
240:debug:main OS darwin/11.1.0 (Mac OS X 10.7) arch i386
241:debug:main org.macports.load registered provides 'load', a pre-existing procedure. Target override will not be provided
242:debug:main org.macports.unload registered provides 'unload', a pre-existing procedure. Target override will not be provided
243:debug:main org.macports.distfiles registered provides 'distfiles', a pre-existing procedure. Target override will not be provided
244:debug:main adding the default universal variant
245:debug:main Reading variant descriptions from /opt/local/var/macports/sources/rsync.macports.org/release/tarballs/ports/_resources/port1.0/variant_descriptions.conf
246:debug:main No need to upgrade! sqlite3 3.7.9_0 >= sqlite3 3.7.9_0
247:debug:main epoch: in tree: 20090923 installed: 20090923
248:debug:main libedit 20110802-3.0_0 exists in the ports tree
249:debug:main libedit 20110802-3.0_0  is the latest installed
250:debug:main libedit 20110802-3.0_0  is active
251:debug:main Merging existing variants '' into variants
252:debug:main new fully merged portvariants:
253:debug:main Changing to port directory: /opt/local/var/macports/sources/rsync.macports.org/release/tarballs/ports/devel/libedit
254:debug:main OS darwin/11.1.0 (Mac OS X 10.7) arch i386
255:debug:main org.macports.load registered provides 'load', a pre-existing procedure. Target override will not be provided
256:debug:main org.macports.unload registered provides 'unload', a pre-existing procedure. Target override will not be provided
257:debug:main org.macports.distfiles registered provides 'distfiles', a pre-existing procedure. Target override will not be provided
258:debug:main Using group file /opt/local/var/macports/sources/rsync.macports.org/release/tarballs/ports/_resources/port1.0/group/muniversal-1.0.tcl
259:debug:main Reading variant descriptions from /opt/local/var/macports/sources/rsync.macports.org/release/tarballs/ports/_resources/port1.0/variant_descriptions.conf
260:debug:main universal variant already exists, so not adding the default one
261:debug:main No need to upgrade! libedit 20110802-3.0_0 >= libedit 20110802-3.0_0
262:debug:main epoch: in tree: 0 installed: 0
263:debug:main db46 4.6.21_6 exists in the ports tree
264:debug:main db46 4.6.21_6  is the latest installed
265:debug:main db46 4.6.21_6  is active
266:debug:main Merging existing variants '' into variants
267:debug:main new fully merged portvariants:
268:debug:main Changing to port directory: /opt/local/var/macports/sources/rsync.macports.org/release/tarballs/ports/databases/db46
269:debug:main OS darwin/11.1.0 (Mac OS X 10.7) arch i386
270:debug:main org.macports.load registered provides 'load', a pre-existing procedure. Target override will not be provided
271:debug:main org.macports.unload registered provides 'unload', a pre-existing procedure. Target override will not be provided
272:debug:main org.macports.distfiles registered provides 'distfiles', a pre-existing procedure. Target override will not be provided
273:debug:main Using group file /opt/local/var/macports/sources/rsync.macports.org/release/tarballs/ports/_resources/port1.0/group/muniversal-1.0.tcl
274:debug:main Reading variant descriptions from /opt/local/var/macports/sources/rsync.macports.org/release/tarballs/ports/_resources/port1.0/variant_descriptions.conf
275:debug:main universal variant already exists, so not adding the default one
276:debug:main No need to upgrade! db46 4.6.21_6 >= db46 4.6.21_6
277:debug:main epoch: in tree: 0 installed: 0
278:debug:main gdbm 1.10_0 exists in the ports tree
279:debug:main gdbm 1.10_0  is the latest installed
280:debug:main gdbm 1.10_0  is active
281:debug:main Merging existing variants '' into variants
282:debug:main new fully merged portvariants:
283:debug:main Changing to port directory: /opt/local/var/macports/sources/rsync.macports.org/release/tarballs/ports/databases/gdbm
284:debug:main OS darwin/11.1.0 (Mac OS X 10.7) arch i386
285:debug:main org.macports.load registered provides 'load', a pre-existing procedure. Target override will not be provided
286:debug:main org.macports.unload registered provides 'unload', a pre-existing procedure. Target override will not be provided
287:debug:main org.macports.distfiles registered provides 'distfiles', a pre-existing procedure. Target override will not be provided
288:debug:main Using group file /opt/local/var/macports/sources/rsync.macports.org/release/tarballs/ports/_resources/port1.0/group/muniversal-1.0.tcl
289:debug:main Reading variant descriptions from /opt/local/var/macports/sources/rsync.macports.org/release/tarballs/ports/_resources/port1.0/variant_descriptions.conf
290:debug:main universal variant already exists, so not adding the default one
291:debug:main No need to upgrade! gdbm 1.10_0 >= gdbm 1.10_0
292:debug:main epoch: in tree: 0 installed: 0
293:debug:main bzip2 1.0.6_0 exists in the ports tree
294:debug:main bzip2 1.0.6_0  is the latest installed
295:debug:main bzip2 1.0.6_0  is active
296:debug:main Merging existing variants '' into variants
297:debug:main new fully merged portvariants:
298:debug:main Changing to port directory: /opt/local/var/macports/sources/rsync.macports.org/release/tarballs/ports/archivers/bzip2
299:debug:main OS darwin/11.1.0 (Mac OS X 10.7) arch i386
300:debug:main org.macports.load registered provides 'load', a pre-existing procedure. Target override will not be provided
301:debug:main org.macports.unload registered provides 'unload', a pre-existing procedure. Target override will not be provided
302:debug:main org.macports.distfiles registered provides 'distfiles', a pre-existing procedure. Target override will not be provided
303:debug:main Reading variant descriptions from /opt/local/var/macports/sources/rsync.macports.org/release/tarballs/ports/_resources/port1.0/variant_descriptions.conf
304:debug:main universal variant already exists, so not adding the default one
305:debug:main No need to upgrade! bzip2 1.0.6_0 >= bzip2 1.0.6_0
306:debug:main epoch: in tree: 0 installed: 0
307:debug:main python_select 0.3_1 exists in the ports tree
308:debug:main python_select 0.3_1  is the latest installed
309:debug:main python_select 0.3_1  is active
310:debug:main Merging existing variants '' into variants
311:debug:main new fully merged portvariants:
312:debug:main Changing to port directory: /opt/local/var/macports/sources/rsync.macports.org/release/tarballs/ports/sysutils/python_select
313:debug:main OS darwin/11.1.0 (Mac OS X 10.7) arch i386
314:debug:main org.macports.load registered provides 'load', a pre-existing procedure. Target override will not be provided
315:debug:main org.macports.unload registered provides 'unload', a pre-existing procedure. Target override will not be provided
316:debug:main org.macports.distfiles registered provides 'distfiles', a pre-existing procedure. Target override will not be provided
317:debug:main Using group file /opt/local/var/macports/sources/rsync.macports.org/release/tarballs/ports/_resources/port1.0/group/select-1.0.tcl
318:debug:main universal_variant is false, so not adding the default universal variant
319:debug:main No need to upgrade! python_select 0.3_1 >= python_select 0.3_1
320:debug:main epoch: in tree: 0 installed: 0
321:debug:main xorg-libpthread-stubs 0.3_0 exists in the ports tree
322:debug:main xorg-libpthread-stubs 0.3_0  is the latest installed
323:debug:main xorg-libpthread-stubs 0.3_0  is active
324:debug:main Merging existing variants '' into variants
325:debug:main new fully merged portvariants:
326:debug:main Changing to port directory: /opt/local/var/macports/sources/rsync.macports.org/release/tarballs/ports/x11/xorg-libpthread-stubs
327:debug:main OS darwin/11.1.0 (Mac OS X 10.7) arch i386
328:debug:main org.macports.load registered provides 'load', a pre-existing procedure. Target override will not be provided
329:debug:main org.macports.unload registered provides 'unload', a pre-existing procedure. Target override will not be provided
330:debug:main org.macports.distfiles registered provides 'distfiles', a pre-existing procedure. Target override will not be provided
331:debug:main only one arch supported, so not adding the default universal variant
332:debug:main No need to upgrade! xorg-libpthread-stubs 0.3_0 >= xorg-libpthread-stubs 0.3_0
333:debug:main epoch: in tree: 0 installed: 0
334:debug:main xorg-kbproto 1.0.5_0 exists in the ports tree
335:debug:main xorg-kbproto 1.0.5_0  is the latest installed
336:debug:main xorg-kbproto 1.0.5_0  is active
337:debug:main Merging existing variants '' into variants
338:debug:main new fully merged portvariants:
339:debug:main Changing to port directory: /opt/local/var/macports/sources/rsync.macports.org/release/tarballs/ports/x11/xorg-kbproto
340:debug:main OS darwin/11.1.0 (Mac OS X 10.7) arch i386
341:debug:main org.macports.load registered provides 'load', a pre-existing procedure. Target override will not be provided
342:debug:main org.macports.unload registered provides 'unload', a pre-existing procedure. Target override will not be provided
343:debug:main org.macports.distfiles registered provides 'distfiles', a pre-existing procedure. Target override will not be provided
344:debug:main only one arch supported, so not adding the default universal variant
345:debug:main No need to upgrade! xorg-kbproto 1.0.5_0 >= xorg-kbproto 1.0.5_0
346:debug:main epoch: in tree: 0 installed: 0
347:debug:main xorg-xextproto 7.2.0_0 exists in the ports tree
348:debug:main xorg-xextproto 7.2.0_0  is the latest installed
349:debug:main xorg-xextproto 7.2.0_0  is active
350:debug:main Merging existing variants '' into variants
351:debug:main new fully merged portvariants:
352:debug:main Changing to port directory: /opt/local/var/macports/sources/rsync.macports.org/release/tarballs/ports/x11/xorg-xextproto
353:debug:main OS darwin/11.1.0 (Mac OS X 10.7) arch i386
354:debug:main org.macports.load registered provides 'load', a pre-existing procedure. Target override will not be provided
355:debug:main org.macports.unload registered provides 'unload', a pre-existing procedure. Target override will not be provided
356:debug:main org.macports.distfiles registered provides 'distfiles', a pre-existing procedure. Target override will not be provided
357:debug:main only one arch supported, so not adding the default universal variant
358:debug:main No need to upgrade! xorg-xextproto 7.2.0_0 >= xorg-xextproto 7.2.0_0
359:debug:main epoch: in tree: 0 installed: 0
360:debug:main xorg-libXt 1.1.1_0 exists in the ports tree
361:debug:main xorg-libXt 1.1.1_0  is the latest installed
362:debug:main xorg-libXt 1.1.1_0  is active
363:debug:main Merging existing variants '' into variants
364:debug:main new fully merged portvariants:
365:debug:main Changing to port directory: /opt/local/var/macports/sources/rsync.macports.org/release/tarballs/ports/x11/xorg-libXt
366:debug:main OS darwin/11.1.0 (Mac OS X 10.7) arch i386
367:debug:main org.macports.load registered provides 'load', a pre-existing procedure. Target override will not be provided
368:debug:main org.macports.unload registered provides 'unload', a pre-existing procedure. Target override will not be provided
369:debug:main org.macports.distfiles registered provides 'distfiles', a pre-existing procedure. Target override will not be provided
370:debug:main adding the default universal variant
371:debug:main Reading variant descriptions from /opt/local/var/macports/sources/rsync.macports.org/release/tarballs/ports/_resources/port1.0/variant_descriptions.conf
372:debug:main No need to upgrade! xorg-libXt 1.1.1_0 >= xorg-libXt 1.1.1_0
373:debug:main epoch: in tree: 0 installed: 0
374:debug:main xorg-libsm 1.2.0_0 exists in the ports tree
375:debug:main xorg-libsm 1.2.0_0  is the latest installed
376:debug:main xorg-libsm 1.2.0_0  is active
377:debug:main Merging existing variants '' into variants
378:debug:main new fully merged portvariants:
379:debug:main Changing to port directory: /opt/local/var/macports/sources/rsync.macports.org/release/tarballs/ports/x11/xorg-libsm
380:debug:main OS darwin/11.1.0 (Mac OS X 10.7) arch i386
381:debug:main org.macports.load registered provides 'load', a pre-existing procedure. Target override will not be provided
382:debug:main org.macports.unload registered provides 'unload', a pre-existing procedure. Target override will not be provided
383:debug:main org.macports.distfiles registered provides 'distfiles', a pre-existing procedure. Target override will not be provided
384:debug:main adding the default universal variant
385:debug:main Reading variant descriptions from /opt/local/var/macports/sources/rsync.macports.org/release/tarballs/ports/_resources/port1.0/variant_descriptions.conf
386:debug:main No need to upgrade! xorg-libsm 1.2.0_0 >= xorg-libsm 1.2.0_0
387:debug:main epoch: in tree: 0 installed: 0
388:debug:main xorg-libice 1.0.7_0 exists in the ports tree
389:debug:main xorg-libice 1.0.7_0  is the latest installed
390:debug:main xorg-libice 1.0.7_0  is active
391:debug:main Merging existing variants '' into variants
392:debug:main new fully merged portvariants:
393:debug:main Changing to port directory: /opt/local/var/macports/sources/rsync.macports.org/release/tarballs/ports/x11/xorg-libice
394:debug:main OS darwin/11.1.0 (Mac OS X 10.7) arch i386
395:debug:main org.macports.load registered provides 'load', a pre-existing procedure. Target override will not be provided
396:debug:main org.macports.unload registered provides 'unload', a pre-existing procedure. Target override will not be provided
397:debug:main org.macports.distfiles registered provides 'distfiles', a pre-existing procedure. Target override will not be provided
398:debug:main adding the default universal variant
399:debug:main Reading variant descriptions from /opt/local/var/macports/sources/rsync.macports.org/release/tarballs/ports/_resources/port1.0/variant_descriptions.conf
400:debug:main No need to upgrade! xorg-libice 1.0.7_0 >= xorg-libice 1.0.7_0
401:msg:main --->  Computing dependencies for gtk1:info:main .:debug:main Searching for dependency: glib1
402:debug:main Found Dependency: receipt exists for glib1
403:debug:main Searching for dependency: xorg-libXext
404:debug:main Found Dependency: receipt exists for xorg-libXext
405:debug:main Searching for dependency: xorg-libXt
406:debug:main Found Dependency: receipt exists for xorg-libXt
407:msg:main
408:debug:main Executing org.macports.main (gtk1)
409:debug:main changing euid/egid - current euid: 0 - current egid: 0
410:debug:main egid changed to: 501
411:debug:main euid changed to: 502
412:debug:archivefetch archivefetch phase started at Mon Dec 19 15:48:06 CST 2011
413:msg:archivefetch --->  Fetching archive for gtk1
414:debug:archivefetch Executing org.macports.archivefetch (gtk1)
415:debug:archivefetch euid/egid changed to: 0/0
416:debug:archivefetch chowned /opt/local/var/macports/software/gtk1 to macports
417:debug:archivefetch euid/egid changed to: 502/501
418:debug:archivefetch euid/egid changed to: 0/0
419:debug:archivefetch chowned /opt/local/var/macports/incoming to macports
420:debug:archivefetch euid/egid changed to: 502/501
421:info:archivefetch --->  gtk1-1.2.10_9.darwin_11.x86_64.tbz2 doesn't seem to exist in /opt/local/var/macports/software/gtk1
422:msg:archivefetch --->  Attempting to fetch gtk1-1.2.10_9.darwin_11.x86_64.tbz2 from http://packages.macports.org/gtk1
423:debug:archivefetch Fetching archive failed:: The requested URL returned error: 404
424:debug:archivefetch Privilege de-escalation not attempted as not running as root.
425:debug:fetch fetch phase started at Mon Dec 19 15:48:06 CST 2011
426:notice:fetch --->  Fetching gtk1
427:debug:fetch euid/egid changed to: 0/0
428:debug:fetch chowned /opt/local/var/macports/distfiles/gtk1 to macports
429:debug:fetch euid/egid changed to: 502/501
430:debug:fetch Executing org.macports.fetch (gtk1)
431:debug:fetch Privilege de-escalation not attempted as not running as root.
432:debug:checksum checksum phase started at Mon Dec 19 15:48:06 CST 2011
433:notice:checksum --->  Verifying checksum(s) for gtk1
434:debug:checksum Executing org.macports.checksum (gtk1)
435:info:checksum --->  Checksumming gtk+-1.2.10.tar.gz
436:debug:checksum Correct (md5) checksum for gtk+-1.2.10.tar.gz
437:info:checksum --->  Checksumming ltconfig13
438:debug:checksum Correct (md5) checksum for ltconfig13
439:info:checksum --->  Checksumming ltmain13
440:debug:checksum Correct (md5) checksum for ltmain13
441:debug:checksum Privilege de-escalation not attempted as not running as root.
442:debug:extract extract phase started at Mon Dec 19 15:48:06 CST 2011
443:notice:extract --->  Extracting gtk1
444:debug:extract Executing org.macports.extract (gtk1)
445:info:extract --->  Extracting gtk+-1.2.10.tar.gz
446:debug:extract setting option extract.args to '/opt/local/var/macports/distfiles/gtk1/gtk+-1.2.10.tar.gz'
447:debug:extract Environment: CPATH='/opt/local/include' CC_PRINT_OPTIONS_FILE='/opt/local/var/macports/build/_opt_local_var_macports_sources_rsync.macports.org_release_tarballs_ports_x11_gtk1/gtk1/work/.CC_PRINT_OPTIONS' LIBRARY_PATH='/opt/local/lib' CC_PRINT_OPTIONS='YES' MACOSX_DEPLOYMENT_TARGET='10.7'
448:debug:extract Assembled command: 'cd "/opt/local/var/macports/build/_opt_local_var_macports_sources_rsync.macports.org_release_tarballs_ports_x11_gtk1/gtk1/work" && /usr/bin/gzip -dc '/opt/local/var/macports/distfiles/gtk1/gtk+-1.2.10.tar.gz' | /usr/bin/gnutar --no-same-owner -xf -'
449:debug:extract Executing command line:  cd "/opt/local/var/macports/build/_opt_local_var_macports_sources_rsync.macports.org_release_tarballs_ports_x11_gtk1/gtk1/work" && /usr/bin/gzip -dc '/opt/local/var/macports/distfiles/gtk1/gtk+-1.2.10.tar.gz' | /usr/bin/gnutar --no-same-owner -xf -
450:debug:extract euid/egid changed to: 0/0
451:debug:extract chowned /opt/local/var/macports/build/_opt_local_var_macports_sources_rsync.macports.org_release_tarballs_ports_x11_gtk1/gtk1/work to macports
452:debug:extract euid/egid changed to: 502/501
453:debug:extract Privilege de-escalation not attempted as not running as root.
454:debug:patch patch phase started at Mon Dec 19 15:48:06 CST 2011
455:debug:patch Executing org.macports.patch (gtk1)
456:notice:patch --->  Applying patches to gtk1
457:info:patch --->  Applying /opt/local/var/macports/sources/rsync.macports.org/release/tarballs/ports/x11/gtk1/files/patch-config.guess
458:debug:patch Environment: CPATH='/opt/local/include' CC_PRINT_OPTIONS_FILE='/opt/local/var/macports/build/_opt_local_var_macports_sources_rsync.macports.org_release_tarballs_ports_x11_gtk1/gtk1/work/.CC_PRINT_OPTIONS' LIBRARY_PATH='/opt/local/lib' CC_PRINT_OPTIONS='YES' MACOSX_DEPLOYMENT_TARGET='10.7'
459:debug:patch Assembled command: 'cd "/opt/local/var/macports/build/_opt_local_var_macports_sources_rsync.macports.org_release_tarballs_ports_x11_gtk1/gtk1/work/gtk+-1.2.10" && /usr/bin/patch -p0'
460:debug:patch Executing command line:  cd "/opt/local/var/macports/build/_opt_local_var_macports_sources_rsync.macports.org_release_tarballs_ports_x11_gtk1/gtk1/work/gtk+-1.2.10" && /usr/bin/patch -p0 < '/opt/local/var/macports/sources/rsync.macports.org/release/tarballs/ports/x11/gtk1/files/patch-config.guess'
461:info:patch patching file config.guess
462:info:patch --->  Applying /opt/local/var/macports/sources/rsync.macports.org/release/tarballs/ports/x11/gtk1/files/patch-config.sub
463:debug:patch Environment: CPATH='/opt/local/include' CC_PRINT_OPTIONS_FILE='/opt/local/var/macports/build/_opt_local_var_macports_sources_rsync.macports.org_release_tarballs_ports_x11_gtk1/gtk1/work/.CC_PRINT_OPTIONS' LIBRARY_PATH='/opt/local/lib' CC_PRINT_OPTIONS='YES' MACOSX_DEPLOYMENT_TARGET='10.7'
464:debug:patch Assembled command: 'cd "/opt/local/var/macports/build/_opt_local_var_macports_sources_rsync.macports.org_release_tarballs_ports_x11_gtk1/gtk1/work/gtk+-1.2.10" && /usr/bin/patch -p0'
465:debug:patch Executing command line:  cd "/opt/local/var/macports/build/_opt_local_var_macports_sources_rsync.macports.org_release_tarballs_ports_x11_gtk1/gtk1/work/gtk+-1.2.10" && /usr/bin/patch -p0 < '/opt/local/var/macports/sources/rsync.macports.org/release/tarballs/ports/x11/gtk1/files/patch-config.sub'
466:info:patch patching file config.sub
467:info:patch --->  Applying /opt/local/var/macports/sources/rsync.macports.org/release/tarballs/ports/x11/gtk1/files/patch-gtk.m4.diff
468:debug:patch Environment: CPATH='/opt/local/include' CC_PRINT_OPTIONS_FILE='/opt/local/var/macports/build/_opt_local_var_macports_sources_rsync.macports.org_release_tarballs_ports_x11_gtk1/gtk1/work/.CC_PRINT_OPTIONS' LIBRARY_PATH='/opt/local/lib' CC_PRINT_OPTIONS='YES' MACOSX_DEPLOYMENT_TARGET='10.7'
469:debug:patch Assembled command: 'cd "/opt/local/var/macports/build/_opt_local_var_macports_sources_rsync.macports.org_release_tarballs_ports_x11_gtk1/gtk1/work/gtk+-1.2.10" && /usr/bin/patch -p0'
470:debug:patch Executing command line:  cd "/opt/local/var/macports/build/_opt_local_var_macports_sources_rsync.macports.org_release_tarballs_ports_x11_gtk1/gtk1/work/gtk+-1.2.10" && /usr/bin/patch -p0 < '/opt/local/var/macports/sources/rsync.macports.org/release/tarballs/ports/x11/gtk1/files/patch-gtk.m4.diff'
471:info:patch patching file gtk.m4
472:debug:patch Executing proc-post-org.macports.patch-patch-0
473:info:patch patching file ltmain.sh
474:info:patch Hunk #1 succeeded at 979 (offset -260 lines).
475:info:patch Hunk #2 succeeded at 1009 (offset -260 lines).
476:debug:patch Privilege de-escalation not attempted as not running as root.
477:debug:configure configure phase started at Mon Dec 19 15:48:06 CST 2011
478:notice:configure --->  Configuring gtk1
479:debug:configure Using compiler 'Mac OS X clang'
480:debug:configure Executing org.macports.configure (gtk1)
481:debug:configure Environment: CPATH='/opt/local/include' CFLAGS='-pipe -O2 -arch x86_64' CXXFLAGS='-pipe -O2 -arch x86_64' LIBRARY_PATH='/opt/local/lib' MACOSX_DEPLOYMENT_TARGET='10.7' CXX='/Developer/usr/bin/clang++' CC_PRINT_OPTIONS_FILE='/opt/local/var/macports/build/_opt_local_var_macports_sources_rsync.macports.org_release_tarballs_ports_x11_gtk1/gtk1/work/.CC_PRINT_OPTIONS' F90FLAGS='-pipe -O2 -m64' LDFLAGS='-arch x86_64' OBJC='/Developer/usr/bin/clang' FCFLAGS='-pipe -O2 -m64' INSTALL='/usr/bin/install -c' OBJCFLAGS='-pipe -O2 -arch x86_64' FFLAGS='-pipe -O2 -m64' CC_PRINT_OPTIONS='YES' CC='/Developer/usr/bin/clang'
482:debug:configure Assembled command: 'cd "/opt/local/var/macports/build/_opt_local_var_macports_sources_rsync.macports.org_release_tarballs_ports_x11_gtk1/gtk1/work/gtk+-1.2.10" && ./configure --prefix=/opt/local --disable-nls --disable-shm --with-locale --mandir=/opt/local/share/man --infodir=/opt/local/share/info --x-includes=/opt/local/include --x-libraries=/opt/local/lib'
483:debug:configure Executing command line:  cd "/opt/local/var/macports/build/_opt_local_var_macports_sources_rsync.macports.org_release_tarballs_ports_x11_gtk1/gtk1/work/gtk+-1.2.10" && ./configure --prefix=/opt/local --disable-nls --disable-shm --with-locale --mandir=/opt/local/share/man --infodir=/opt/local/share/info --x-includes=/opt/local/include --x-libraries=/opt/local/lib
484:info:configure creating cache ./config.cache
485:info:configure checking for a BSD compatible install... /usr/bin/install -c
486:info:configure checking whether build environment is sane... yes
487:info:configure checking whether make sets ${MAKE}... yes
488:info:configure checking for working aclocal... found
489:info:configure checking for working autoconf... found
490:info:configure checking for working automake... found
491:info:configure checking for working autoheader... found
492:info:configure checking for working makeinfo... found
493:info:configure checking host system type... i386-apple-darwin11.1.0
494:info:configure checking build system type... i386-apple-darwin11.1.0
495:info:configure checking for ranlib... ranlib
496:info:configure checking for gcc... /Developer/usr/bin/clang
497:info:configure checking whether the C compiler (/Developer/usr/bin/clang -pipe -O2 -arch x86_64 -arch x86_64) works... yes
498:info:configure checking whether the C compiler (/Developer/usr/bin/clang -pipe -O2 -arch x86_64 -arch x86_64) is a cross-compiler... no
499:info:configure checking whether we are using GNU C... yes
500:info:configure checking whether /Developer/usr/bin/clang accepts -g... yes
501:info:configure checking for ld used by GCC... /Developer/usr/bin/ld
502:info:configure checking if the linker (/Developer/usr/bin/ld) is GNU ld... no
503:info:configure checking for BSD-compatible nm... /usr/bin/nm
504:info:configure checking whether ln -s works... yes
505:info:configure updating cache ./config.cache
506:info:configure loading cache ./config.cache within ltconfig
507:info:configure checking for object suffix... o
508:info:configure checking for executable suffix... no
509:info:configure checking for /Developer/usr/bin/clang option to produce PIC... -fno-common
510:info:configure checking if /Developer/usr/bin/clang PIC flag -fno-common works... yes
511:info:configure checking if /Developer/usr/bin/clang supports -c -o file.o... yes
512:info:configure checking if /Developer/usr/bin/clang supports -c -o file.lo... yes
513:info:configure checking if /Developer/usr/bin/clang supports -fno-rtti -fno-exceptions ... yes
514:info:configure checking if /Developer/usr/bin/clang static flag -static works... none
515:info:configure checking if the linker (/Developer/usr/bin/ld) is GNU ld... no
516:info:configure checking whether the linker (/Developer/usr/bin/ld) supports shared libraries... yes
517:info:configure checking command to parse /usr/bin/nm output... ok
518:info:configure checking how to hardcode library paths into programs... unsupported
519:info:configure checking for /Developer/usr/bin/ld option to reload object files... -r
520:info:configure checking dynamic linker characteristics... darwin11.1.0 dyld
521:info:configure checking if libtool supports shared libraries... yes
522:info:configure checking whether to build shared libraries... yes
523:info:configure checking whether to build static libraries... yes
524:info:configure checking for objdir... .libs
525:info:configure creating libtool
526:info:configure updating cache ./config.cache
527:info:configure loading cache ./config.cache
528:info:configure checking whether to enable maintainer-specific portions of Makefiles... no
529:info:configure checking host system type... i386-apple-darwin11.1.0
530:info:configure no
531:info:configure checking whether build environment is sane... yes
532:info:configure checking for gcc... (cached) /Developer/usr/bin/clang
533:info:configure checking whether the C compiler (/Developer/usr/bin/clang -pipe -O2 -arch x86_64 -arch x86_64) works... yes
534:info:configure checking whether the C compiler (/Developer/usr/bin/clang -pipe -O2 -arch x86_64 -arch x86_64) is a cross-compiler... no
535:info:configure checking whether we are using GNU C... (cached) yes
536:info:configure checking whether /Developer/usr/bin/clang accepts -g... (cached) yes
537:info:configure checking for POSIXized ISC... no
538:info:configure checking for /Developer/usr/bin/clang option to accept ANSI C... none needed
539:info:configure checking for a BSD compatible install... /usr/bin/install -c
540:info:configure checking whether make sets ${MAKE}... (cached) yes
541:info:configure checking for gawk... no
542:info:configure checking for mawk... no
543:info:configure checking for nawk... no
544:info:configure checking for awk... awk
545:info:configure checking for perl5... perl5
546:info:configure checking for indent... indent
547:info:configure checking whether make is GNU Make... yes
548:info:configure checking how to run the C preprocessor... /Developer/usr/bin/clang -E
549:info:configure checking for ANSI C header files... yes
550:info:configure checking for working const... yes
551:info:configure checking for inline... inline
552:info:configure checking for off_t... yes
553:info:configure checking for size_t... yes
554:info:configure checking for working alloca.h... yes
555:info:configure checking for alloca... yes
556:info:configure checking for unistd.h... yes
557:info:configure checking for getpagesize... yes
558:info:configure checking for working mmap... yes
559:info:configure checking for argz.h... no
560:info:configure checking for limits.h... yes
561:info:configure checking for locale.h... yes
562:info:configure checking for nl_types.h... yes
563:info:configure checking for malloc.h... no
564:info:configure checking for string.h... yes
565:info:configure checking for unistd.h... (cached) yes
566:info:configure checking for sys/param.h... yes
567:info:configure checking for getcwd... yes
568:info:configure checking for munmap... yes
569:info:configure checking for putenv... yes
570:info:configure checking for setenv... yes
571:info:configure checking for setlocale... yes
572:info:configure checking for strchr... yes
573:info:configure checking for strcasecmp... yes
574:info:configure checking for strdup... yes
575:info:configure checking for __argz_count... no
576:info:configure checking for __argz_stringify... no
577:info:configure checking for __argz_next... no
578:info:configure checking for stpcpy... yes
579:info:configure checking for LC_MESSAGES... yes
580:info:configure checking whether NLS is requested... no
581:info:configure checking for extra flags to get ANSI library prototypes... none needed
582:info:configure checking for extra flags for POSIX compliance... none needed
583:info:configure checking for glib-config... /opt/local/bin/glib-config
584:info:configure checking for GLIB - version >= 1.2.8... yes
585:info:configure checking for X... libraries /opt/local/lib, headers /opt/local/include
586:info:configure checking for dnet_ntoa in -ldnet... no
587:info:configure checking for dnet_ntoa in -ldnet_stub... no
588:info:configure checking for gethostbyname... yes
589:info:configure checking for connect... yes
590:info:configure checking for remove... yes
591:info:configure checking for shmat... yes
592:info:configure checking for IceConnectionNumber in -lICE... yes
593:info:configure checking for XOpenDisplay in -lX11... yes
594:info:configure checking for XShapeCombineMask in -lXext... yes
595:info:configure checking for XConvertCase in -lX11... yes
596:info:configure checking for XUnregisterIMInstantiateCallback in -lX11... yes
597:info:configure checking need -DX_LOCALE... yes
598:info:configure checking for ANSI C header files... (cached) yes
599:info:configure checking for working const... (cached) yes
600:info:configure checking return type of signal handlers... void
601:info:configure checking for unistd.h... (cached) yes
602:info:configure checking for getpagesize... (cached) yes
603:info:configure checking for working mmap... (cached) yes
604:info:configure checking for getresuid... no
605:info:configure checking for uid_t in sys/types.h... yes
606:info:configure checking for fd_set... yes, found in sys/types.h
607:info:configure checking for wchar.h... yes
608:info:configure checking for wctype.h... yes
609:info:configure checking for iswalnum... yes
610:info:configure checking if iswalnum() and friends are properly defined... no
611:info:configure updating cache ./config.cache
612:info:configure creating ./config.status
613:info:configure creating gtk+.spec
614:info:configure creating docs/gtk-config.1
615:info:configure creating Makefile
616:info:configure creating gtk-config
617:info:configure creating po/Makefile.in
618:info:configure creating docs/Makefile
619:info:configure creating gdk/Makefile
620:info:configure creating gtk/Makefile
621:info:configure creating gtk/gtkfeatures.h
622:info:configure creating gdk.pc
623:info:configure creating gtk+.pc
624:info:configure creating config.h
625:info:configure linking ./intl/libgettext.h to intl/libintl.h
626:debug:configure Privilege de-escalation not attempted as not running as root.
627:debug:build build phase started at Mon Dec 19 15:48:11 CST 2011
628:notice:build --->  Building gtk1
629:debug:build Executing org.macports.build (gtk1)
630:debug:build Environment: CPATH='/opt/local/include' CC_PRINT_OPTIONS_FILE='/opt/local/var/macports/build/_opt_local_var_macports_sources_rsync.macports.org_release_tarballs_ports_x11_gtk1/gtk1/work/.CC_PRINT_OPTIONS' LIBRARY_PATH='/opt/local/lib' CC_PRINT_OPTIONS='YES' MACOSX_DEPLOYMENT_TARGET='10.7'
631:debug:build Assembled command: 'cd "/opt/local/var/macports/build/_opt_local_var_macports_sources_rsync.macports.org_release_tarballs_ports_x11_gtk1/gtk1/work/gtk+-1.2.10" && /usr/bin/make -j8 -w all'
632:debug:build Executing command line:  cd "/opt/local/var/macports/build/_opt_local_var_macports_sources_rsync.macports.org_release_tarballs_ports_x11_gtk1/gtk1/work/gtk+-1.2.10" && /usr/bin/make -j8 -w all
633:info:build make: Entering directory `/opt/local/var/macports/build/_opt_local_var_macports_sources_rsync.macports.org_release_tarballs_ports_x11_gtk1/gtk1/work/gtk+-1.2.10'
634:info:build /usr/bin/make  all-recursive
635:info:build make[1]: Entering directory `/opt/local/var/macports/build/_opt_local_var_macports_sources_rsync.macports.org_release_tarballs_ports_x11_gtk1/gtk1/work/gtk+-1.2.10'
636:info:build Making all in po
637:info:build make[2]: Entering directory `/opt/local/var/macports/build/_opt_local_var_macports_sources_rsync.macports.org_release_tarballs_ports_x11_gtk1/gtk1/work/gtk+-1.2.10/po'
638:info:build make[2]: Nothing to be done for `all'.
639:info:build make[2]: Leaving directory `/opt/local/var/macports/build/_opt_local_var_macports_sources_rsync.macports.org_release_tarballs_ports_x11_gtk1/gtk1/work/gtk+-1.2.10/po'
640:info:build Making all in gdk
641:info:build make[2]: Entering directory `/opt/local/var/macports/build/_opt_local_var_macports_sources_rsync.macports.org_release_tarballs_ports_x11_gtk1/gtk1/work/gtk+-1.2.10/gdk'
642:info:build /bin/sh ../libtool --mode=compile /Developer/usr/bin/clang -DHAVE_CONFIG_H -I. -I. -I.. -DG_LOG_DOMAIN=\"Gdk\" -I.. -DGTK_NO_CHECK_CASTS -DUSE_XIM -DX_LOCALE -I/opt/local/include/glib-1.2 -I/opt/local/lib/glib/include -D_REENTRANT -I/opt/local/include    -pipe -O2 -arch x86_64 -Wall -c gdk.c
643:info:build /bin/sh ../libtool --mode=compile /Developer/usr/bin/clang -DHAVE_CONFIG_H -I. -I. -I.. -DG_LOG_DOMAIN=\"Gdk\" -I.. -DGTK_NO_CHECK_CASTS -DUSE_XIM -DX_LOCALE -I/opt/local/include/glib-1.2 -I/opt/local/lib/glib/include -D_REENTRANT -I/opt/local/include    -pipe -O2 -arch x86_64 -Wall -c gdkcc.c
644:info:build /bin/sh ../libtool --mode=compile /Developer/usr/bin/clang -DHAVE_CONFIG_H -I. -I. -I.. -DG_LOG_DOMAIN=\"Gdk\" -I.. -DGTK_NO_CHECK_CASTS -DUSE_XIM -DX_LOCALE -I/opt/local/include/glib-1.2 -I/opt/local/lib/glib/include -D_REENTRANT -I/opt/local/include    -pipe -O2 -arch x86_64 -Wall -c gdkcolor.c
645:info:build /bin/sh ../libtool --mode=compile /Developer/usr/bin/clang -DHAVE_CONFIG_H -I. -I. -I.. -DG_LOG_DOMAIN=\"Gdk\" -I.. -DGTK_NO_CHECK_CASTS -DUSE_XIM -DX_LOCALE -I/opt/local/include/glib-1.2 -I/opt/local/lib/glib/include -D_REENTRANT -I/opt/local/include    -pipe -O2 -arch x86_64 -Wall -c gdkcursor.c
646:info:build /bin/sh ../libtool --mode=compile /Developer/usr/bin/clang -DHAVE_CONFIG_H -I. -I. -I.. -DG_LOG_DOMAIN=\"Gdk\" -I.. -DGTK_NO_CHECK_CASTS -DUSE_XIM -DX_LOCALE -I/opt/local/include/glib-1.2 -I/opt/local/lib/glib/include -D_REENTRANT -I/opt/local/include    -pipe -O2 -arch x86_64 -Wall -c gdkdnd.c
647:info:build /bin/sh ../libtool --mode=compile /Developer/usr/bin/clang -DHAVE_CONFIG_H -I. -I. -I.. -DG_LOG_DOMAIN=\"Gdk\" -I.. -DGTK_NO_CHECK_CASTS -DUSE_XIM -DX_LOCALE -I/opt/local/include/glib-1.2 -I/opt/local/lib/glib/include -D_REENTRANT -I/opt/local/include    -pipe -O2 -arch x86_64 -Wall -c gdkdraw.c
648:info:build /bin/sh ../libtool --mode=compile /Developer/usr/bin/clang -DHAVE_CONFIG_H -I. -I. -I.. -DG_LOG_DOMAIN=\"Gdk\" -I.. -DGTK_NO_CHECK_CASTS -DUSE_XIM -DX_LOCALE -I/opt/local/include/glib-1.2 -I/opt/local/lib/glib/include -D_REENTRANT -I/opt/local/include    -pipe -O2 -arch x86_64 -Wall -c gdkevents.c
649:info:build /bin/sh ../libtool --mode=compile /Developer/usr/bin/clang -DHAVE_CONFIG_H -I. -I. -I.. -DG_LOG_DOMAIN=\"Gdk\" -I.. -DGTK_NO_CHECK_CASTS -DUSE_XIM -DX_LOCALE -I/opt/local/include/glib-1.2 -I/opt/local/lib/glib/include -D_REENTRANT -I/opt/local/include    -pipe -O2 -arch x86_64 -Wall -c gdkfont.c
650:info:build mkdir .libs
651:info:build mkdir .libs
652:info:build mkdir: .libs: File exists
653:info:build rm -f .libs/gdkcc.lo
654:info:build /Developer/usr/bin/clang -DHAVE_CONFIG_H -I. -I. -I.. -DG_LOG_DOMAIN=\"Gdk\" -I.. -DGTK_NO_CHECK_CASTS -DUSE_XIM -DX_LOCALE -I/opt/local/include/glib-1.2 -I/opt/local/lib/glib/include -D_REENTRANT -I/opt/local/include -pipe -O2 -arch x86_64 -Wall -c gdkfont.c  -fno-common -DPIC -o .libs/gdkfont.lo
655:info:build /Developer/usr/bin/clang -DHAVE_CONFIG_H -I. -I. -I.. -DG_LOG_DOMAIN=\"Gdk\" -I.. -DGTK_NO_CHECK_CASTS -DUSE_XIM -DX_LOCALE -I/opt/local/include/glib-1.2 -I/opt/local/lib/glib/include -D_REENTRANT -I/opt/local/include -pipe -O2 -arch x86_64 -Wall -c gdkcolor.c  -fno-common -DPIC -o .libs/gdkcolor.lo
656:info:build rm -f .libs/gdkcursor.lo
657:info:build /Developer/usr/bin/clang -DHAVE_CONFIG_H -I. -I. -I.. -DG_LOG_DOMAIN=\"Gdk\" -I.. -DGTK_NO_CHECK_CASTS -DUSE_XIM -DX_LOCALE -I/opt/local/include/glib-1.2 -I/opt/local/lib/glib/include -D_REENTRANT -I/opt/local/include -pipe -O2 -arch x86_64 -Wall -c gdkcc.c  -fno-common -DPIC -o .libs/gdkcc.lo
658:info:build rm -f .libs/gdkdraw.lo
659:info:build /Developer/usr/bin/clang -DHAVE_CONFIG_H -I. -I. -I.. -DG_LOG_DOMAIN=\"Gdk\" -I.. -DGTK_NO_CHECK_CASTS -DUSE_XIM -DX_LOCALE -I/opt/local/include/glib-1.2 -I/opt/local/lib/glib/include -D_REENTRANT -I/opt/local/include -pipe -O2 -arch x86_64 -Wall -c gdkcursor.c  -fno-common -DPIC -o .libs/gdkcursor.lo
660:info:build rm -f .libs/gdkevents.lo
661:info:build rm -f .libs/gdkdnd.lo
662:info:build /Developer/usr/bin/clang -DHAVE_CONFIG_H -I. -I. -I.. -DG_LOG_DOMAIN=\"Gdk\" -I.. -DGTK_NO_CHECK_CASTS -DUSE_XIM -DX_LOCALE -I/opt/local/include/glib-1.2 -I/opt/local/lib/glib/include -D_REENTRANT -I/opt/local/include -pipe -O2 -arch x86_64 -Wall -c gdkevents.c  -fno-common -DPIC -o .libs/gdkevents.lo
663:info:build /Developer/usr/bin/clang -DHAVE_CONFIG_H -I. -I. -I.. -DG_LOG_DOMAIN=\"Gdk\" -I.. -DGTK_NO_CHECK_CASTS -DUSE_XIM -DX_LOCALE -I/opt/local/include/glib-1.2 -I/opt/local/lib/glib/include -D_REENTRANT -I/opt/local/include -pipe -O2 -arch x86_64 -Wall -c gdkdraw.c  -fno-common -DPIC -o .libs/gdkdraw.lo
664:info:build /Developer/usr/bin/clang -DHAVE_CONFIG_H -I. -I. -I.. -DG_LOG_DOMAIN=\"Gdk\" -I.. -DGTK_NO_CHECK_CASTS -DUSE_XIM -DX_LOCALE -I/opt/local/include/glib-1.2 -I/opt/local/lib/glib/include -D_REENTRANT -I/opt/local/include -pipe -O2 -arch x86_64 -Wall -c gdkdnd.c  -fno-common -DPIC -o .libs/gdkdnd.lo
665:info:build rm -f .libs/gdk.lo
666:info:build /Developer/usr/bin/clang -DHAVE_CONFIG_H -I. -I. -I.. -DG_LOG_DOMAIN=\"Gdk\" -I.. -DGTK_NO_CHECK_CASTS -DUSE_XIM -DX_LOCALE -I/opt/local/include/glib-1.2 -I/opt/local/lib/glib/include -D_REENTRANT -I/opt/local/include -pipe -O2 -arch x86_64 -Wall -c gdk.c  -fno-common -DPIC -o .libs/gdk.lo
667:info:build /Developer/usr/bin/clang -DHAVE_CONFIG_H -I. -I. -I.. -DG_LOG_DOMAIN=\"Gdk\" -I.. -DGTK_NO_CHECK_CASTS -DUSE_XIM -DX_LOCALE -I/opt/local/include/glib-1.2 -I/opt/local/lib/glib/include -D_REENTRANT -I/opt/local/include -pipe -O2 -arch x86_64 -Wall -c gdkcursor.c -o gdkcursor.o >/dev/null 2>&1
668:info:build gdk.c:966:10: warning: passing 'const gchar *' (aka 'const char *') to parameter of type 'const unsigned char *' converts between pointers to integer types with different sign [-Wpointer-sign]
669:info:build                        sm_client_id, strlen(sm_client_id));
670:info:build                        ^~~~~~~~~~~~
671:info:build /opt/local/include/X11/Xlib.h:2082:38: note: passing argument to parameter here
672:info:build     _Xconst unsigned char*      /* data */,
673:info:build                                           ^
674:info:build mv -f .libs/gdkcursor.lo gdkcursor.lo
675:info:build /bin/sh ../libtool --mode=compile /Developer/usr/bin/clang -DHAVE_CONFIG_H -I. -I. -I.. -DG_LOG_DOMAIN=\"Gdk\" -I.. -DGTK_NO_CHECK_CASTS -DUSE_XIM -DX_LOCALE -I/opt/local/include/glib-1.2 -I/opt/local/lib/glib/include -D_REENTRANT -I/opt/local/include    -pipe -O2 -arch x86_64 -Wall -c gdkgc.c
676:info:build /Developer/usr/bin/clang -DHAVE_CONFIG_H -I. -I. -I.. -DG_LOG_DOMAIN=\"Gdk\" -I.. -DGTK_NO_CHECK_CASTS -DUSE_XIM -DX_LOCALE -I/opt/local/include/glib-1.2 -I/opt/local/lib/glib/include -D_REENTRANT -I/opt/local/include -pipe -O2 -arch x86_64 -Wall -c gdkdraw.c -o gdkdraw.o >/dev/null 2>&1
677:info:build /Developer/usr/bin/clang -DHAVE_CONFIG_H -I. -I. -I.. -DG_LOG_DOMAIN=\"Gdk\" -I.. -DGTK_NO_CHECK_CASTS -DUSE_XIM -DX_LOCALE -I/opt/local/include/glib-1.2 -I/opt/local/lib/glib/include -D_REENTRANT -I/opt/local/include -pipe -O2 -arch x86_64 -Wall -c gdkfont.c -o gdkfont.o >/dev/null 2>&1
678:info:build 1 warning generated.
679:info:build /Developer/usr/bin/clang -DHAVE_CONFIG_H -I. -I. -I.. -DG_LOG_DOMAIN=\"Gdk\" -I.. -DGTK_NO_CHECK_CASTS -DUSE_XIM -DX_LOCALE -I/opt/local/include/glib-1.2 -I/opt/local/lib/glib/include -D_REENTRANT -I/opt/local/include -pipe -O2 -arch x86_64 -Wall -c gdk.c -o gdk.o >/dev/null 2>&1
680:info:build /Developer/usr/bin/clang -DHAVE_CONFIG_H -I. -I. -I.. -DG_LOG_DOMAIN=\"Gdk\" -I.. -DGTK_NO_CHECK_CASTS -DUSE_XIM -DX_LOCALE -I/opt/local/include/glib-1.2 -I/opt/local/lib/glib/include -D_REENTRANT -I/opt/local/include -pipe -O2 -arch x86_64 -Wall -c gdkevents.c -o gdkevents.o >/dev/null 2>&1
681:info:build /Developer/usr/bin/clang -DHAVE_CONFIG_H -I. -I. -I.. -DG_LOG_DOMAIN=\"Gdk\" -I.. -DGTK_NO_CHECK_CASTS -DUSE_XIM -DX_LOCALE -I/opt/local/include/glib-1.2 -I/opt/local/lib/glib/include -D_REENTRANT -I/opt/local/include -pipe -O2 -arch x86_64 -Wall -c gdkcolor.c -o gdkcolor.o >/dev/null 2>&1
682:info:build mv -f .libs/gdkdraw.lo gdkdraw.lo
683:info:build /bin/sh ../libtool --mode=compile /Developer/usr/bin/clang -DHAVE_CONFIG_H -I. -I. -I.. -DG_LOG_DOMAIN=\"Gdk\" -I.. -DGTK_NO_CHECK_CASTS -DUSE_XIM -DX_LOCALE -I/opt/local/include/glib-1.2 -I/opt/local/lib/glib/include -D_REENTRANT -I/opt/local/include    -pipe -O2 -arch x86_64 -Wall -c gdkglobals.c
684:info:build /Developer/usr/bin/clang -DHAVE_CONFIG_H -I. -I. -I.. -DG_LOG_DOMAIN=\"Gdk\" -I.. -DGTK_NO_CHECK_CASTS -DUSE_XIM -DX_LOCALE -I/opt/local/include/glib-1.2 -I/opt/local/lib/glib/include -D_REENTRANT -I/opt/local/include -pipe -O2 -arch x86_64 -Wall -c gdkcc.c -o gdkcc.o >/dev/null 2>&1
685:info:build rm -f .libs/gdkgc.lo
686:info:build /Developer/usr/bin/clang -DHAVE_CONFIG_H -I. -I. -I.. -DG_LOG_DOMAIN=\"Gdk\" -I.. -DGTK_NO_CHECK_CASTS -DUSE_XIM -DX_LOCALE -I/opt/local/include/glib-1.2 -I/opt/local/lib/glib/include -D_REENTRANT -I/opt/local/include -pipe -O2 -arch x86_64 -Wall -c gdkgc.c  -fno-common -DPIC -o .libs/gdkgc.lo
687:info:build mv -f .libs/gdkfont.lo gdkfont.lo
688:info:build /bin/sh ../libtool --mode=compile /Developer/usr/bin/clang -DHAVE_CONFIG_H -I. -I. -I.. -DG_LOG_DOMAIN=\"Gdk\" -I.. -DGTK_NO_CHECK_CASTS -DUSE_XIM -DX_LOCALE -I/opt/local/include/glib-1.2 -I/opt/local/lib/glib/include -D_REENTRANT -I/opt/local/include    -pipe -O2 -arch x86_64 -Wall -c gdkim.c
689:info:build gdkgc.c:835:61: warning: passing 'gint8 *' (aka 'signed char *') to parameter of type 'const char *' converts between pointers to integer types with different sign [-Wpointer-sign]
690:info:build   XSetDashes (private->xdisplay, private->xgc, dash_offset, dash_list, n);
691:info:build                                                             ^~~~~~~~~
692:info:build /opt/local/include/X11/Xlib.h:3206:34: note: passing argument to parameter here
693:info:build     _Xconst char*       /* dash_list */,
694:info:build                                        ^
695:info:build mv -f .libs/gdk.lo gdk.lo
696:info:build /bin/sh ../libtool --mode=compile /Developer/usr/bin/clang -DHAVE_CONFIG_H -I. -I. -I.. -DG_LOG_DOMAIN=\"Gdk\" -I.. -DGTK_NO_CHECK_CASTS -DUSE_XIM -DX_LOCALE -I/opt/local/include/glib-1.2 -I/opt/local/lib/glib/include -D_REENTRANT -I/opt/local/include    -pipe -O2 -arch x86_64 -Wall -c gdkimage.c
697:info:build rm -f .libs/gdkglobals.lo
698:info:build 1 warning generated.
699:info:build /Developer/usr/bin/clang -DHAVE_CONFIG_H -I. -I. -I.. -DG_LOG_DOMAIN=\"Gdk\" -I.. -DGTK_NO_CHECK_CASTS -DUSE_XIM -DX_LOCALE -I/opt/local/include/glib-1.2 -I/opt/local/lib/glib/include -D_REENTRANT -I/opt/local/include -pipe -O2 -arch x86_64 -Wall -c gdkglobals.c  -fno-common -DPIC -o .libs/gdkglobals.lo
700:info:build /Developer/usr/bin/clang -DHAVE_CONFIG_H -I. -I. -I.. -DG_LOG_DOMAIN=\"Gdk\" -I.. -DGTK_NO_CHECK_CASTS -DUSE_XIM -DX_LOCALE -I/opt/local/include/glib-1.2 -I/opt/local/lib/glib/include -D_REENTRANT -I/opt/local/include -pipe -O2 -arch x86_64 -Wall -c gdkgc.c -o gdkgc.o >/dev/null 2>&1
701:info:build /Developer/usr/bin/clang -DHAVE_CONFIG_H -I. -I. -I.. -DG_LOG_DOMAIN=\"Gdk\" -I.. -DGTK_NO_CHECK_CASTS -DUSE_XIM -DX_LOCALE -I/opt/local/include/glib-1.2 -I/opt/local/lib/glib/include -D_REENTRANT -I/opt/local/include -pipe -O2 -arch x86_64 -Wall -c gdkdnd.c -o gdkdnd.o >/dev/null 2>&1
702:info:build rm -f .libs/gdkim.lo
703:info:build /Developer/usr/bin/clang -DHAVE_CONFIG_H -I. -I. -I.. -DG_LOG_DOMAIN=\"Gdk\" -I.. -DGTK_NO_CHECK_CASTS -DUSE_XIM -DX_LOCALE -I/opt/local/include/glib-1.2 -I/opt/local/lib/glib/include -D_REENTRANT -I/opt/local/include -pipe -O2 -arch x86_64 -Wall -c gdkim.c  -fno-common -DPIC -o .libs/gdkim.lo
704:info:build mv -f .libs/gdkevents.lo gdkevents.lo
705:info:build /bin/sh ../libtool --mode=compile /Developer/usr/bin/clang -DHAVE_CONFIG_H -I. -I. -I.. -DG_LOG_DOMAIN=\"Gdk\" -I.. -DGTK_NO_CHECK_CASTS -DUSE_XIM -DX_LOCALE -I/opt/local/include/glib-1.2 -I/opt/local/lib/glib/include -D_REENTRANT -I/opt/local/include    -pipe -O2 -arch x86_64 -Wall -c gdkinput.c
706:info:build /Developer/usr/bin/clang -DHAVE_CONFIG_H -I. -I. -I.. -DG_LOG_DOMAIN=\"Gdk\" -I.. -DGTK_NO_CHECK_CASTS -DUSE_XIM -DX_LOCALE -I/opt/local/include/glib-1.2 -I/opt/local/lib/glib/include -D_REENTRANT -I/opt/local/include -pipe -O2 -arch x86_64 -Wall -c gdkglobals.c -o gdkglobals.o >/dev/null 2>&1
707:info:build gdkim.c:105:11: warning: unused variable 'result' [-Wunused-variable]
708:info:build   wchar_t result;
709:info:build           ^
710:info:build mv -f .libs/gdkcolor.lo gdkcolor.lo
711:info:build /bin/sh ../libtool --mode=compile /Developer/usr/bin/clang -DHAVE_CONFIG_H -I. -I. -I.. -DG_LOG_DOMAIN=\"Gdk\" -I.. -DGTK_NO_CHECK_CASTS -DUSE_XIM -DX_LOCALE -I/opt/local/include/glib-1.2 -I/opt/local/lib/glib/include -D_REENTRANT -I/opt/local/include    -pipe -O2 -arch x86_64 -Wall -c gdkpixmap.c
712:info:build gdkim.c:1584:21: warning: passing 'unsigned char *' to parameter of type 'const gchar *' (aka 'const char *') converts between pointers to integer types with different sign [-Wpointer-sign]
713:info:build           mbstr = g_strdup(tpr.value);
714:info:build                            ^~~~~~~~~
715:info:build /opt/local/include/glib-1.2/glib.h:1486:33: note: passing argument to parameter 'str' here
716:info:build gchar*   g_strdup               (const gchar *str);
717:info:build                                               ^
718:info:build mv -f .libs/gdkglobals.lo gdkglobals.lo
719:info:build /bin/sh ../libtool --mode=compile /Developer/usr/bin/clang -DHAVE_CONFIG_H -I. -I. -I.. -DG_LOG_DOMAIN=\"Gdk\" -I.. -DGTK_NO_CHECK_CASTS -DUSE_XIM -DX_LOCALE -I/opt/local/include/glib-1.2 -I/opt/local/lib/glib/include -D_REENTRANT -I/opt/local/include    -pipe -O2 -arch x86_64 -Wall -c gdkproperty.c
720:info:build rm -f .libs/gdkimage.lo
721:info:build /Developer/usr/bin/clang -DHAVE_CONFIG_H -I. -I. -I.. -DG_LOG_DOMAIN=\"Gdk\" -I.. -DGTK_NO_CHECK_CASTS -DUSE_XIM -DX_LOCALE -I/opt/local/include/glib-1.2 -I/opt/local/lib/glib/include -D_REENTRANT -I/opt/local/include -pipe -O2 -arch x86_64 -Wall -c gdkimage.c  -fno-common -DPIC -o .libs/gdkimage.lo
722:info:build mv -f .libs/gdkgc.lo gdkgc.lo
723:info:build /bin/sh ../libtool --mode=compile /Developer/usr/bin/clang -DHAVE_CONFIG_H -I. -I. -I.. -DG_LOG_DOMAIN=\"Gdk\" -I.. -DGTK_NO_CHECK_CASTS -DUSE_XIM -DX_LOCALE -I/opt/local/include/glib-1.2 -I/opt/local/lib/glib/include -D_REENTRANT -I/opt/local/include    -pipe -O2 -arch x86_64 -Wall -c gdkrgb.c
724:info:build mv -f .libs/gdkcc.lo gdkcc.lo
725:info:build /bin/sh ../libtool --mode=compile /Developer/usr/bin/clang -DHAVE_CONFIG_H -I. -I. -I.. -DG_LOG_DOMAIN=\"Gdk\" -I.. -DGTK_NO_CHECK_CASTS -DUSE_XIM -DX_LOCALE -I/opt/local/include/glib-1.2 -I/opt/local/lib/glib/include -D_REENTRANT -I/opt/local/include    -pipe -O2 -arch x86_64 -Wall -c gdkrectangle.c
726:info:build gdkimage.c:484:1: warning: unused function 'gdk_image_put_shared' [-Wunused-function]
727:info:build gdk_image_put_shared (GdkDrawable *drawable,
728:info:build ^
729:info:build rm -f .libs/gdkinput.lo
730:info:build /Developer/usr/bin/clang -DHAVE_CONFIG_H -I. -I. -I.. -DG_LOG_DOMAIN=\"Gdk\" -I.. -DGTK_NO_CHECK_CASTS -DUSE_XIM -DX_LOCALE -I/opt/local/include/glib-1.2 -I/opt/local/lib/glib/include -D_REENTRANT -I/opt/local/include -pipe -O2 -arch x86_64 -Wall -c gdkinput.c  -fno-common -DPIC -o .libs/gdkinput.lo
731:info:build 1 warning generated.
732:info:build /Developer/usr/bin/clang -DHAVE_CONFIG_H -I. -I. -I.. -DG_LOG_DOMAIN=\"Gdk\" -I.. -DGTK_NO_CHECK_CASTS -DUSE_XIM -DX_LOCALE -I/opt/local/include/glib-1.2 -I/opt/local/lib/glib/include -D_REENTRANT -I/opt/local/include -pipe -O2 -arch x86_64 -Wall -c gdkimage.c -o gdkimage.o >/dev/null 2>&1
733:info:build rm -f .libs/gdkpixmap.lo
734:info:build gdkinput.c:59:3: warning: initializing 'GdkAxisUse *' with an expression of type 'const GdkAxisUse [2]' discards qualifiers
735:info:build   gdk_input_core_axes
736:info:build   ^~~~~~~~~~~~~~~~~~~
737:info:build /Developer/usr/bin/clang -DHAVE_CONFIG_H -I. -I. -I.. -DG_LOG_DOMAIN=\"Gdk\" -I.. -DGTK_NO_CHECK_CASTS -DUSE_XIM -DX_LOCALE -I/opt/local/include/glib-1.2 -I/opt/local/lib/glib/include -D_REENTRANT -I/opt/local/include -pipe -O2 -arch x86_64 -Wall -c gdkpixmap.c  -fno-common -DPIC -o .libs/gdkpixmap.lo
738:info:build 2 warnings generated.
739:info:build /Developer/usr/bin/clang -DHAVE_CONFIG_H -I. -I. -I.. -DG_LOG_DOMAIN=\"Gdk\" -I.. -DGTK_NO_CHECK_CASTS -DUSE_XIM -DX_LOCALE -I/opt/local/include/glib-1.2 -I/opt/local/lib/glib/include -D_REENTRANT -I/opt/local/include -pipe -O2 -arch x86_64 -Wall -c gdkim.c -o gdkim.o >/dev/null 2>&1
740:info:build rm -f .libs/gdkproperty.lo
741:info:build /Developer/usr/bin/clang -DHAVE_CONFIG_H -I. -I. -I.. -DG_LOG_DOMAIN=\"Gdk\" -I.. -DGTK_NO_CHECK_CASTS -DUSE_XIM -DX_LOCALE -I/opt/local/include/glib-1.2 -I/opt/local/lib/glib/include -D_REENTRANT -I/opt/local/include -pipe -O2 -arch x86_64 -Wall -c gdkproperty.c  -fno-common -DPIC -o .libs/gdkproperty.lo
742:info:build 1 warning generated.
743:info:build rm -f .libs/gdkrgb.lo
744:info:build mv -f .libs/gdkimage.lo gdkimage.lo
745:info:build /Developer/usr/bin/clang -DHAVE_CONFIG_H -I. -I. -I.. -DG_LOG_DOMAIN=\"Gdk\" -I.. -DGTK_NO_CHECK_CASTS -DUSE_XIM -DX_LOCALE -I/opt/local/include/glib-1.2 -I/opt/local/lib/glib/include -D_REENTRANT -I/opt/local/include -pipe -O2 -arch x86_64 -Wall -c gdkinput.c -o gdkinput.o >/dev/null 2>&1
746:info:build /bin/sh ../libtool --mode=compile /Developer/usr/bin/clang -DHAVE_CONFIG_H -I. -I. -I.. -DG_LOG_DOMAIN=\"Gdk\" -I.. -DGTK_NO_CHECK_CASTS -DUSE_XIM -DX_LOCALE -I/opt/local/include/glib-1.2 -I/opt/local/lib/glib/include -D_REENTRANT -I/opt/local/include    -pipe -O2 -arch x86_64 -Wall -c gdkregion.c
747:info:build /Developer/usr/bin/clang -DHAVE_CONFIG_H -I. -I. -I.. -DG_LOG_DOMAIN=\"Gdk\" -I.. -DGTK_NO_CHECK_CASTS -DUSE_XIM -DX_LOCALE -I/opt/local/include/glib-1.2 -I/opt/local/lib/glib/include -D_REENTRANT -I/opt/local/include -pipe -O2 -arch x86_64 -Wall -c gdkrgb.c  -fno-common -DPIC -o .libs/gdkrgb.lo
748:info:build gdkpixmap.c:783:7: warning: passing 'unsigned int *' to parameter of type 'int *' converts between pointers to integer types with different sign [-Wpointer-sign]
749:info:build                     &x_ret, &y_ret, &w_ret, &h_ret, &bw_ret, &depth_ret))
750:info:build                     ^~~~~~
751:info:build /opt/local/include/X11/Xlib.h:2631:25: note: passing argument to parameter here
752:info:build     int*                /* x_return */,
753:info:build                                       ^
754:info:build gdkpixmap.c:783:15: warning: passing 'unsigned int *' to parameter of type 'int *' converts between pointers to integer types with different sign [-Wpointer-sign]
755:info:build                     &x_ret, &y_ret, &w_ret, &h_ret, &bw_ret, &depth_ret))
756:info:build                             ^~~~~~
757:info:build /opt/local/include/X11/Xlib.h:2632:25: note: passing argument to parameter here
758:info:build     int*                /* y_return */,
759:info:build                                       ^
760:info:build rm -f .libs/gdkrectangle.lo
761:info:build /Developer/usr/bin/clang -DHAVE_CONFIG_H -I. -I. -I.. -DG_LOG_DOMAIN=\"Gdk\" -I.. -DGTK_NO_CHECK_CASTS -DUSE_XIM -DX_LOCALE -I/opt/local/include/glib-1.2 -I/opt/local/lib/glib/include -D_REENTRANT -I/opt/local/include -pipe -O2 -arch x86_64 -Wall -c gdkrectangle.c  -fno-common -DPIC -o .libs/gdkrectangle.lo
762:info:build /Developer/usr/bin/clang -DHAVE_CONFIG_H -I. -I. -I.. -DG_LOG_DOMAIN=\"Gdk\" -I.. -DGTK_NO_CHECK_CASTS -DUSE_XIM -DX_LOCALE -I/opt/local/include/glib-1.2 -I/opt/local/lib/glib/include -D_REENTRANT -I/opt/local/include -pipe -O2 -arch x86_64 -Wall -c gdkproperty.c -o gdkproperty.o >/dev/null 2>&1
763:info:build /Developer/usr/bin/clang -DHAVE_CONFIG_H -I. -I. -I.. -DG_LOG_DOMAIN=\"Gdk\" -I.. -DGTK_NO_CHECK_CASTS -DUSE_XIM -DX_LOCALE -I/opt/local/include/glib-1.2 -I/opt/local/lib/glib/include -D_REENTRANT -I/opt/local/include -pipe -O2 -arch x86_64 -Wall -c gdkrectangle.c -o gdkrectangle.o >/dev/null 2>&1
764:info:build mv -f .libs/gdkinput.lo gdkinput.lo
765:info:build /bin/sh ../libtool --mode=compile /Developer/usr/bin/clang -DHAVE_CONFIG_H -I. -I. -I.. -DG_LOG_DOMAIN=\"Gdk\" -I.. -DGTK_NO_CHECK_CASTS -DUSE_XIM -DX_LOCALE -I/opt/local/include/glib-1.2 -I/opt/local/lib/glib/include -D_REENTRANT -I/opt/local/include    -pipe -O2 -arch x86_64 -Wall -c gdkselection.c
766:info:build mv -f .libs/gdkproperty.lo gdkproperty.lo
767:info:build mv -f .libs/gdkdnd.lo gdkdnd.lo
768:info:build /bin/sh ../libtool --mode=compile /Developer/usr/bin/clang -DHAVE_CONFIG_H -I. -I. -I.. -DG_LOG_DOMAIN=\"Gdk\" -I.. -DGTK_NO_CHECK_CASTS -DUSE_XIM -DX_LOCALE -I/opt/local/include/glib-1.2 -I/opt/local/lib/glib/include -D_REENTRANT -I/opt/local/include    -pipe -O2 -arch x86_64 -Wall -c gdkvisual.c
769:info:build 2 warnings generated.
770:info:build /bin/sh ../libtool --mode=compile /Developer/usr/bin/clang -DHAVE_CONFIG_H -I. -I. -I.. -DG_LOG_DOMAIN=\"Gdk\" -I.. -DGTK_NO_CHECK_CASTS -DUSE_XIM -DX_LOCALE -I/opt/local/include/glib-1.2 -I/opt/local/lib/glib/include -D_REENTRANT -I/opt/local/include    -pipe -O2 -arch x86_64 -Wall -c gdkwindow.c
771:info:build mv -f .libs/gdkrectangle.lo gdkrectangle.lo
772:info:build /Developer/usr/bin/clang -DHAVE_CONFIG_H -I. -I. -I.. -DG_LOG_DOMAIN=\"Gdk\" -I.. -DGTK_NO_CHECK_CASTS -DUSE_XIM -DX_LOCALE -I/opt/local/include/glib-1.2 -I/opt/local/lib/glib/include -D_REENTRANT -I/opt/local/include -pipe -O2 -arch x86_64 -Wall -c gdkpixmap.c -o gdkpixmap.o >/dev/null 2>&1
773:info:build /bin/sh ../libtool --mode=compile /Developer/usr/bin/clang -DHAVE_CONFIG_H -I. -I. -I.. -DG_LOG_DOMAIN=\"Gdk\" -I.. -DGTK_NO_CHECK_CASTS -DUSE_XIM -DX_LOCALE -I/opt/local/include/glib-1.2 -I/opt/local/lib/glib/include -D_REENTRANT -I/opt/local/include    -pipe -O2 -arch x86_64 -Wall -c gdkxid.c
774:info:build rm -f .libs/gdkregion.lo
775:info:build /Developer/usr/bin/clang -DHAVE_CONFIG_H -I. -I. -I.. -DG_LOG_DOMAIN=\"Gdk\" -I.. -DGTK_NO_CHECK_CASTS -DUSE_XIM -DX_LOCALE -I/opt/local/include/glib-1.2 -I/opt/local/lib/glib/include -D_REENTRANT -I/opt/local/include -pipe -O2 -arch x86_64 -Wall -c gdkregion.c  -fno-common -DPIC -o .libs/gdkregion.lo
776:info:build mv -f .libs/gdkim.lo gdkim.lo
777:info:build /bin/sh ../libtool --mode=compile /Developer/usr/bin/clang -DHAVE_CONFIG_H -I. -I. -I.. -DG_LOG_DOMAIN=\"Gdk\" -I.. -DGTK_NO_CHECK_CASTS -DUSE_XIM -DX_LOCALE -I/opt/local/include/glib-1.2 -I/opt/local/lib/glib/include -D_REENTRANT -I/opt/local/include    -pipe -O2 -arch x86_64 -Wall -c gxid_lib.c
778:info:build rm -f .libs/gdkselection.lo
779:info:build /Developer/usr/bin/clang -DHAVE_CONFIG_H -I. -I. -I.. -DG_LOG_DOMAIN=\"Gdk\" -I.. -DGTK_NO_CHECK_CASTS -DUSE_XIM -DX_LOCALE -I/opt/local/include/glib-1.2 -I/opt/local/lib/glib/include -D_REENTRANT -I/opt/local/include -pipe -O2 -arch x86_64 -Wall -c gdkselection.c  -fno-common -DPIC -o .libs/gdkselection.lo
780:info:build /Developer/usr/bin/clang -DHAVE_CONFIG_H -I. -I. -I.. -DG_LOG_DOMAIN=\"Gdk\" -I.. -DGTK_NO_CHECK_CASTS -DUSE_XIM -DX_LOCALE -I/opt/local/include/glib-1.2 -I/opt/local/lib/glib/include -D_REENTRANT -I/opt/local/include -pipe -O2 -arch x86_64 -Wall -c gdkregion.c -o gdkregion.o >/dev/null 2>&1
781:info:build rm -f .libs/gdkwindow.lo
782:info:build rm -f .libs/gdkvisual.lo
783:info:build /Developer/usr/bin/clang -DHAVE_CONFIG_H -I. -I. -I.. -DG_LOG_DOMAIN=\"Gdk\" -I.. -DGTK_NO_CHECK_CASTS -DUSE_XIM -DX_LOCALE -I/opt/local/include/glib-1.2 -I/opt/local/lib/glib/include -D_REENTRANT -I/opt/local/include -pipe -O2 -arch x86_64 -Wall -c gdkwindow.c  -fno-common -DPIC -o .libs/gdkwindow.lo
784:info:build rm -f .libs/gdkxid.lo
785:info:build /Developer/usr/bin/clang -DHAVE_CONFIG_H -I. -I. -I.. -DG_LOG_DOMAIN=\"Gdk\" -I.. -DGTK_NO_CHECK_CASTS -DUSE_XIM -DX_LOCALE -I/opt/local/include/glib-1.2 -I/opt/local/lib/glib/include -D_REENTRANT -I/opt/local/include -pipe -O2 -arch x86_64 -Wall -c gdkvisual.c  -fno-common -DPIC -o .libs/gdkvisual.lo
786:info:build /Developer/usr/bin/clang -DHAVE_CONFIG_H -I. -I. -I.. -DG_LOG_DOMAIN=\"Gdk\" -I.. -DGTK_NO_CHECK_CASTS -DUSE_XIM -DX_LOCALE -I/opt/local/include/glib-1.2 -I/opt/local/lib/glib/include -D_REENTRANT -I/opt/local/include -pipe -O2 -arch x86_64 -Wall -c gdkxid.c  -fno-common -DPIC -o .libs/gdkxid.lo
787:info:build mv -f .libs/gdkpixmap.lo gdkpixmap.lo
788:info:build gdkselection.c:281:57: warning: passing 'guchar *' (aka 'unsigned char *') to parameter of type 'const char *' converts between pointers to integer types with different sign [-Wpointer-sign]
789:info:build       property.value = sanitized_text = sanitize_ctext (text, &sanitized_text_length);
790:info:build                                                         ^~~~
791:info:build gdkselection.c:205:29: note: passing argument to parameter 'str' here
792:info:build sanitize_ctext (const char *str,
793:info:build                             ^
794:info:build gdkselection.c:281:22: warning: assigning to 'unsigned char *' from 'gchar *' (aka 'char *') converts between pointers to integer types with different sign [-Wpointer-sign]
795:info:build       property.value = sanitized_text = sanitize_ctext (text, &sanitized_text_length);
796:info:build                      ^ ~~~~~~~~~~~~~~~~~~~~~~~~~~~~~~~~~~~~~~~~~~~~~~~~~~~~~~~~~~~~~~
797:info:build gdkselection.c:339:36: warning: passing 'unsigned char *' to parameter of type 'const char *' converts between pointers to integer types with different sign [-Wpointer-sign]
798:info:build   sanitized_text = sanitize_ctext (property.value, &sanitized_text_length);
799:info:build                                    ^~~~~~~~~~~~~~
800:info:build gdkselection.c:205:29: note: passing argument to parameter 'str' here
801:info:build sanitize_ctext (const char *str,
802:info:build                             ^
803:info:build gdkselection.c:342:12: warning: assigning to 'guchar *' (aka 'unsigned char *') from 'gchar *' (aka 'char *') converts between pointers to integer types with different sign [-Wpointer-sign]
804:info:build     *ctext = sanitized_text;
805:info:build            ^ ~~~~~~~~~~~~~~
806:info:build rm -f .libs/gxid_lib.lo
807:info:build /Developer/usr/bin/clang -DHAVE_CONFIG_H -I. -I. -I.. -DG_LOG_DOMAIN=\"Gdk\" -I.. -DGTK_NO_CHECK_CASTS -DUSE_XIM -DX_LOCALE -I/opt/local/include/glib-1.2 -I/opt/local/lib/glib/include -D_REENTRANT -I/opt/local/include -pipe -O2 -arch x86_64 -Wall -c gxid_lib.c  -fno-common -DPIC -o .libs/gxid_lib.lo
808:info:build /Developer/usr/bin/clang -DHAVE_CONFIG_H -I. -I. -I.. -DG_LOG_DOMAIN=\"Gdk\" -I.. -DGTK_NO_CHECK_CASTS -DUSE_XIM -DX_LOCALE -I/opt/local/include/glib-1.2 -I/opt/local/lib/glib/include -D_REENTRANT -I/opt/local/include -pipe -O2 -arch x86_64 -Wall -c gdkxid.c -o gdkxid.o >/dev/null 2>&1
809:info:build 4 warnings generated.
810:info:build /Developer/usr/bin/clang -DHAVE_CONFIG_H -I. -I. -I.. -DG_LOG_DOMAIN=\"Gdk\" -I.. -DGTK_NO_CHECK_CASTS -DUSE_XIM -DX_LOCALE -I/opt/local/include/glib-1.2 -I/opt/local/lib/glib/include -D_REENTRANT -I/opt/local/include -pipe -O2 -arch x86_64 -Wall -c gxid_lib.c -o gxid_lib.o >/dev/null 2>&1
811:info:build /Developer/usr/bin/clang -DHAVE_CONFIG_H -I. -I. -I.. -DG_LOG_DOMAIN=\"Gdk\" -I.. -DGTK_NO_CHECK_CASTS -DUSE_XIM -DX_LOCALE -I/opt/local/include/glib-1.2 -I/opt/local/lib/glib/include -D_REENTRANT -I/opt/local/include -pipe -O2 -arch x86_64 -Wall -c gdkselection.c -o gdkselection.o >/dev/null 2>&1
812:info:build mv -f .libs/gdkregion.lo gdkregion.lo
813:info:build mv -f .libs/gxid_lib.lo gxid_lib.lo
814:info:build mv -f .libs/gdkxid.lo gdkxid.lo
815:info:build gdkwindow.c:1204:28: warning: passing 'const gchar *' (aka 'const char *') to parameter of type 'const unsigned char *' converts between pointers to integer types with different sign [-Wpointer-sign]
816:info:build                      8, PropModeReplace, role, strlen (role));
817:info:build                                          ^~~~
818:info:build /opt/local/include/X11/Xlib.h:2082:38: note: passing argument to parameter here
819:info:build     _Xconst unsigned char*      /* data */,
820:info:build                                           ^
821:info:build gdkwindow.c:2081:8: warning: passing 'const gchar **' (aka 'const char **') to parameter of type 'char **' discards qualifiers in nested pointer types
822:info:build                                    &name, 1, XStdICCTextStyle,
823:info:build                                    ^~~~~
824:info:build /opt/local/include/X11/Xutil.h:739:13: note: passing argument to parameter 'list' here
825:info:build     char**              list,
826:info:build                         ^
827:info:build mv -f .libs/gdkselection.lo gdkselection.lo
828:info:build /Developer/usr/bin/clang -DHAVE_CONFIG_H -I. -I. -I.. -DG_LOG_DOMAIN=\"Gdk\" -I.. -DGTK_NO_CHECK_CASTS -DUSE_XIM -DX_LOCALE -I/opt/local/include/glib-1.2 -I/opt/local/lib/glib/include -D_REENTRANT -I/opt/local/include -pipe -O2 -arch x86_64 -Wall -c gdkvisual.c -o gdkvisual.o >/dev/null 2>&1
829:info:build /Developer/usr/bin/clang -DHAVE_CONFIG_H -I. -I. -I.. -DG_LOG_DOMAIN=\"Gdk\" -I.. -DGTK_NO_CHECK_CASTS -DUSE_XIM -DX_LOCALE -I/opt/local/include/glib-1.2 -I/opt/local/lib/glib/include -D_REENTRANT -I/opt/local/include -pipe -O2 -arch x86_64 -Wall -c gdkrgb.c -o gdkrgb.o >/dev/null 2>&1
830:info:build mv -f .libs/gdkvisual.lo gdkvisual.lo
831:info:build 2 warnings generated.
832:info:build /Developer/usr/bin/clang -DHAVE_CONFIG_H -I. -I. -I.. -DG_LOG_DOMAIN=\"Gdk\" -I.. -DGTK_NO_CHECK_CASTS -DUSE_XIM -DX_LOCALE -I/opt/local/include/glib-1.2 -I/opt/local/lib/glib/include -D_REENTRANT -I/opt/local/include -pipe -O2 -arch x86_64 -Wall -c gdkwindow.c -o gdkwindow.o >/dev/null 2>&1
833:info:build mv -f .libs/gdkrgb.lo gdkrgb.lo
834:info:build mv -f .libs/gdkwindow.lo gdkwindow.lo
835:info:build /bin/sh ../libtool --mode=link /Developer/usr/bin/clang  -pipe -O2 -arch x86_64 -Wall -arch x86_64 -o libgdk.la -rpath /opt/local/lib -version-info 9:1:9 -release 1.2 -export-dynamic -L/opt/local/lib -lgmodule -lglib -L/opt/local/lib -lXext -lX11 -lm gdk.lo gdkcc.lo gdkcolor.lo gdkcursor.lo gdkdnd.lo gdkdraw.lo gdkevents.lo gdkfont.lo gdkgc.lo gdkglobals.lo gdkim.lo gdkimage.lo gdkinput.lo gdkpixmap.lo gdkproperty.lo gdkrgb.lo gdkrectangle.lo gdkregion.lo gdkselection.lo gdkvisual.lo gdkwindow.lo gdkxid.lo gxid_lib.lo 
836:info:build rm -fr .libs/libgdk.la .libs/libgdk.* .libs/libgdk-1.2.*
837:info:build
838:info:build *** Warning: This library needs some functionality provided by -lgmodule.
839:info:build *** I have the capability to make that library automatically link in when
840:info:build *** you link to this library.  But I can only do this if you have a
841:info:build *** shared version of the library, which you do not appear to have.
842:info:build
843:info:build *** Warning: This library needs some functionality provided by -lglib.
844:info:build *** I have the capability to make that library automatically link in when
845:info:build *** you link to this library.  But I can only do this if you have a
846:info:build *** shared version of the library, which you do not appear to have.
847:info:build
848:info:build *** Warning: This library needs some functionality provided by -lXext.
849:info:build *** I have the capability to make that library automatically link in when
850:info:build *** you link to this library.  But I can only do this if you have a
851:info:build *** shared version of the library, which you do not appear to have.
852:info:build
853:info:build *** Warning: This library needs some functionality provided by -lX11.
854:info:build *** I have the capability to make that library automatically link in when
855:info:build *** you link to this library.  But I can only do this if you have a
856:info:build *** shared version of the library, which you do not appear to have.
857:info:build *** The inter-library dependencies that have been dropped here will be
858:info:build *** automatically added whenever a program is linked with this library
859:info:build *** or is declared to -dlopen it.
860:info:build /Developer/usr/bin/clang -dynamiclib -flat_namespace -undefined suppress -o .libs/libgdk-1.2.0.9.1.dylib  gdk.lo gdkcc.lo gdkcolor.lo gdkcursor.lo gdkdnd.lo gdkdraw.lo gdkevents.lo gdkfont.lo gdkgc.lo gdkglobals.lo gdkim.lo gdkimage.lo gdkinput.lo gdkpixmap.lo gdkproperty.lo gdkrgb.lo gdkrectangle.lo gdkregion.lo gdkselection.lo gdkvisual.lo gdkwindow.lo gdkxid.lo gxid_lib.lo  -L/opt/local/lib -lm -lc  -arch x86_64 -arch x86_64 -install_name /opt/local/lib/libgdk-1.2.0.dylib -compatibility_version 10 -current_version 10.1
861:info:build ld: duplicate symbol _g_bit_nth_lsf in gdkcc.lo and gdk.lo for architecture x86_64
862:info:build clang: error: linker command failed with exit code 1 (use -v to see invocation)
863:info:build make[2]: *** [libgdk.la] Error 1
864:info:build make[2]: Leaving directory `/opt/local/var/macports/build/_opt_local_var_macports_sources_rsync.macports.org_release_tarballs_ports_x11_gtk1/gtk1/work/gtk+-1.2.10/gdk'
865:info:build make[1]: *** [all-recursive] Error 1
866:info:build make[1]: Leaving directory `/opt/local/var/macports/build/_opt_local_var_macports_sources_rsync.macports.org_release_tarballs_ports_x11_gtk1/gtk1/work/gtk+-1.2.10'
867:info:build make: *** [all-recursive-am] Error 2
868:info:build make: Leaving directory `/opt/local/var/macports/build/_opt_local_var_macports_sources_rsync.macports.org_release_tarballs_ports_x11_gtk1/gtk1/work/gtk+-1.2.10'
869:info:build shell command " cd "/opt/local/var/macports/build/_opt_local_var_macports_sources_rsync.macports.org_release_tarballs_ports_x11_gtk1/gtk1/work/gtk+-1.2.10" && /usr/bin/make -j8 -w all " returned error 2
870:error:build Target org.macports.build returned: shell command failed (see log for details)
871:debug:build Backtrace: shell command failed (see log for details)
872    while executing
873"command_exec build"
874    (procedure "portbuild::build_main" line 8)
875    invoked from within
876"$procedure $targetname"
877:info:build Warning: the following items did not execute (for gtk1): org.macports.activate org.macports.build org.macports.destroot org.macports.install
878:notice:build Log for gtk1 is at: /opt/local/var/macports/logs/_opt_local_var_macports_sources_rsync.macports.org_release_tarballs_ports_x11_gtk1/gtk1/main.log