Ticket #32955: main.log

File main.log, 6.4 KB (added by fheday@…, 9 years ago)

Compiling log

Line 
1version:1
2:debug:main changing euid/egid - current euid: 0 - current egid: 0
3:debug:main egid changed to: 501
4:debug:main euid changed to: 502
5:debug:main Executing org.macports.main (xmms)
6:debug:main Privilege de-escalation not attempted as not running as root.
7:debug:main Skipping completed org.macports.archivefetch (xmms)
8:debug:main Privilege de-escalation not attempted as not running as root.
9:debug:main Skipping completed org.macports.fetch (xmms)
10:debug:main Privilege de-escalation not attempted as not running as root.
11:debug:main Skipping completed org.macports.checksum (xmms)
12:debug:main Privilege de-escalation not attempted as not running as root.
13:debug:main Skipping completed org.macports.extract (xmms)
14:debug:main Privilege de-escalation not attempted as not running as root.
15:debug:main Skipping completed org.macports.patch (xmms)
16:debug:main Privilege de-escalation not attempted as not running as root.
17:debug:main Skipping completed org.macports.configure (xmms)
18:debug:main Privilege de-escalation not attempted as not running as root.
19:debug:build build phase started at Fri Jan 20 13:28:45 GMT 2012
20:notice:build --->  Building xmms
21:debug:build Executing org.macports.build (xmms)
22:debug:build Environment: CPATH='/opt/local/include' CC_PRINT_OPTIONS_FILE='/opt/local/var/macports/build/_opt_local_var_macports_sources_rsync.macports.org_release_tarballs_ports_audio_xmms/xmms/work/.CC_PRINT_OPTIONS' LIBRARY_PATH='/opt/local/lib' CC_PRINT_OPTIONS='YES' MACOSX_DEPLOYMENT_TARGET='10.7'
23:debug:build Assembled command: 'cd "/opt/local/var/macports/build/_opt_local_var_macports_sources_rsync.macports.org_release_tarballs_ports_audio_xmms/xmms/work/xmms-1.2.11" && /usr/bin/make -j4 -w all'
24:debug:build Executing command line:  cd "/opt/local/var/macports/build/_opt_local_var_macports_sources_rsync.macports.org_release_tarballs_ports_audio_xmms/xmms/work/xmms-1.2.11" && /usr/bin/make -j4 -w all
25:info:build make: Entering directory `/opt/local/var/macports/build/_opt_local_var_macports_sources_rsync.macports.org_release_tarballs_ports_audio_xmms/xmms/work/xmms-1.2.11'
26:info:build /usr/bin/make  all-recursive
27:info:build make[1]: Entering directory `/opt/local/var/macports/build/_opt_local_var_macports_sources_rsync.macports.org_release_tarballs_ports_audio_xmms/xmms/work/xmms-1.2.11'
28:info:build Making all in intl
29:info:build make[2]: Entering directory `/opt/local/var/macports/build/_opt_local_var_macports_sources_rsync.macports.org_release_tarballs_ports_audio_xmms/xmms/work/xmms-1.2.11/intl'
30:info:build make[2]: Nothing to be done for `all'.
31:info:build make[2]: Leaving directory `/opt/local/var/macports/build/_opt_local_var_macports_sources_rsync.macports.org_release_tarballs_ports_audio_xmms/xmms/work/xmms-1.2.11/intl'
32:info:build Making all in libxmms
33:info:build make[2]: Entering directory `/opt/local/var/macports/build/_opt_local_var_macports_sources_rsync.macports.org_release_tarballs_ports_audio_xmms/xmms/work/xmms-1.2.11/libxmms'
34:info:build /usr/bin/make  all-am
35:info:build make[3]: Entering directory `/opt/local/var/macports/build/_opt_local_var_macports_sources_rsync.macports.org_release_tarballs_ports_audio_xmms/xmms/work/xmms-1.2.11/libxmms'
36:info:build /bin/sh ./libtool --tag=CC --mode=link /Developer/usr/bin/clang  -pipe -O2 -arch x86_64 -Wall -Wpointer-arith  -L/opt/local/lib -arch x86_64 -o libxmms.la -rpath /opt/local/lib -export-dynamic -version-info 4:1:3 configfile.lo xmmsctrl.lo dirbrowser.lo util.lo formatter.lo titlestring.lo xentry.lo xconvert.lo charset.lo -L/opt/local/lib -L/opt/local/lib -lgtk -lgdk -lgmodule -lgthread -lglib -lpthread -lXext -lX11 -lm 
37:info:build /Developer/usr/bin/clang -dynamiclib ${wl}-undefined ${wl}dynamic_lookup -o .libs/libxmms.1.3.1.dylib  .libs/configfile.o .libs/xmmsctrl.o .libs/dirbrowser.o .libs/util.o .libs/formatter.o .libs/titlestring.o .libs/xentry.o .libs/xconvert.o .libs/charset.o  -L/opt/local/lib /opt/local/lib/libgtk.dylib /opt/local/lib/libgdk.dylib /opt/local/lib/libgmodule.dylib /opt/local/lib/libgthread.dylib /opt/local/lib/libglib.dylib -lpthread /opt/local/lib/libXext.dylib /opt/local/lib/libxcb.dylib /opt/local/lib/libXau.dylib /opt/local/lib/libXdmcp.dylib /opt/local/lib/libX11.dylib -lm  -arch x86_64 -arch x86_64 -install_name  /opt/local/lib/libxmms.1.dylib -Wl,-compatibility_version -Wl,5 -Wl,-current_version -Wl,5.1
38:info:build ld: duplicate symbol _g_bit_nth_lsf in .libs/xmmsctrl.o and .libs/configfile.o for architecture x86_64
39:info:build clang: error: linker command failed with exit code 1 (use -v to see invocation)
40:info:build make[3]: *** [libxmms.la] Error 1
41:info:build make[3]: Leaving directory `/opt/local/var/macports/build/_opt_local_var_macports_sources_rsync.macports.org_release_tarballs_ports_audio_xmms/xmms/work/xmms-1.2.11/libxmms'
42:info:build make[2]: *** [all] Error 2
43:info:build make[2]: Leaving directory `/opt/local/var/macports/build/_opt_local_var_macports_sources_rsync.macports.org_release_tarballs_ports_audio_xmms/xmms/work/xmms-1.2.11/libxmms'
44:info:build make[1]: *** [all-recursive] Error 1
45:info:build make[1]: Leaving directory `/opt/local/var/macports/build/_opt_local_var_macports_sources_rsync.macports.org_release_tarballs_ports_audio_xmms/xmms/work/xmms-1.2.11'
46:info:build make: *** [all] Error 2
47:info:build make: Leaving directory `/opt/local/var/macports/build/_opt_local_var_macports_sources_rsync.macports.org_release_tarballs_ports_audio_xmms/xmms/work/xmms-1.2.11'
48:info:build shell command " cd "/opt/local/var/macports/build/_opt_local_var_macports_sources_rsync.macports.org_release_tarballs_ports_audio_xmms/xmms/work/xmms-1.2.11" && /usr/bin/make -j4 -w all " returned error 2
49:error:build Target org.macports.build returned: shell command failed (see log for details)
50:debug:build Backtrace: shell command failed (see log for details)
51    while executing
52"command_exec build"
53    (procedure "portbuild::build_main" line 8)
54    invoked from within
55"$procedure $targetname"
56:info:build Warning: the following items did not execute (for xmms): org.macports.activate org.macports.build org.macports.destroot org.macports.install
57:error:build Failed to install xmms
58:debug:build couldn't open "/System/Library/Frameworks/Tcl.framework/Versions/8.5/Resources/tclIndex": no such file or directory
59    while executing
60"open [file join $dir tclIndex]"
61:notice:build Log for xmms is at: /opt/local/var/macports/logs/_opt_local_var_macports_sources_rsync.macports.org_release_tarballs_ports_audio_xmms/xmms/main.log