Ticket #33525: selfupdatelog.txt

File selfupdatelog.txt, 26.9 KB (added by richard@…, 10 years ago)

self update log

Line 
1macbookpro-3d85:~ richard$ sudo port -d selfupdate
2Password:
3DEBUG: MacPorts sources location: /opt/local/var/macports/sources/rsync.macports.org/release/tarballs
4--->  Updating MacPorts base sources using rsync
5receiving file list ... done
6
7sent 36 bytes  received 69 bytes  23.33 bytes/sec
8total size is 3236352  speedup is 30822.40
9receiving file list ... done
10
11sent 36 bytes  received 76 bytes  32.00 bytes/sec
12total size is 512  speedup is 4.57
13DEBUG: successful verification with key /opt/local/share/macports/macports-pubkey.pem
14DEBUG: /usr/bin/tar -C /opt/local/var/macports/sources/rsync.macports.org/release/tarballs/tmp -xf /opt/local/var/macports/sources/rsync.macports.org/release/tarballs/base.tar
15MacPorts base version 2.0.3 installed,
16DEBUG: Rebuilding and reinstalling MacPorts if needed
17MacPorts base version 2.0.4 downloaded.
18--->  Updating the ports tree
19DEBUG: Synchronizing ports tree(s)
20Synchronizing local ports tree from rsync://rsync.macports.org/release/tarballs/ports.tar
21DEBUG: /usr/bin/rsync -rtzv --delete-after  rsync://rsync.macports.org/release/tarballs/ports.tar /opt/local/var/macports/sources/rsync.macports.org/release/tarballs
22receiving file list ... done
23
24sent 36 bytes  received 70 bytes  30.29 bytes/sec
25total size is 49752576  speedup is 469363.92
26DEBUG: /usr/bin/rsync -rtzv --delete-after  rsync://rsync.macports.org/release/tarballs/ports.tar.rmd160 /opt/local/var/macports/sources/rsync.macports.org/release/tarballs
27receiving file list ... done
28
29sent 36 bytes  received 77 bytes  32.29 bytes/sec
30total size is 512  speedup is 4.53
31DEBUG: successful verification with key /opt/local/share/macports/macports-pubkey.pem
32DEBUG: /usr/bin/tar -C /opt/local/var/macports/sources/rsync.macports.org/release/tarballs/tmp -xf /opt/local/var/macports/sources/rsync.macports.org/release/tarballs/ports.tar
33DEBUG: /usr/bin/rsync -rtzv --delete-after rsync://rsync.macports.org/release/tarballs/PortIndex_darwin_11_i386/PortIndex /opt/local/var/macports/sources/rsync.macports.org/release/tarballs
34receiving file list ... done
35
36sent 36 bytes  received 70 bytes  30.29 bytes/sec
37total size is 7663175  speedup is 72294.10
38DEBUG: /usr/bin/rsync -rtzv --delete-after rsync://rsync.macports.org/release/tarballs/PortIndex_darwin_11_i386/PortIndex.rmd160 /opt/local/var/macports/sources/rsync.macports.org/release/tarballs
39receiving file list ... done
40
41sent 36 bytes  received 77 bytes  32.29 bytes/sec
42total size is 512  speedup is 4.53
43DEBUG: successful verification with key /opt/local/share/macports/macports-pubkey.pem
44--->  MacPorts base is outdated, installing new version 2.0.4
45DEBUG: Permissions OK
46Installing new MacPorts release in /opt/local as root:admin; permissions 0755; Tcl-Package in /Library/Tcl
47
48checking build system type... x86_64-apple-darwin11.3.0
49checking host system type... x86_64-apple-darwin11.3.0
50checking target system type... x86_64-apple-darwin11.3.0
51checking MacPorts version... 2.0.4
52checking for sw_vers... /usr/bin/sw_vers
53checking for defaults... /usr/bin/defaults
54checking for xcode-select... /usr/bin/xcode-select
55checking Mac OS X version... 10.7.3
56checking Xcode location... /Developer
57checking Xcode version... 4.2.1
58checking for gcc... /usr/bin/cc
59checking whether the C compiler works... yes
60checking for C compiler default output file name... a.out
61checking for suffix of executables...
62checking whether we are cross compiling... no
63checking for suffix of object files... o
64checking whether we are using the GNU C compiler... yes
65checking whether /usr/bin/cc accepts -g... yes
66checking for /usr/bin/cc option to accept ISO C89... none needed
67checking for gcc... gcc
68checking whether we are using the GNU Objective C compiler... yes
69checking whether gcc accepts -g... yes
70checking for a BSD-compatible install... /usr/bin/install -c
71checking whether make sets $(MAKE)... yes
72checking whether ln -s works... yes
73checking for mtree... /usr/sbin/mtree
74checking for chown... /usr/sbin/chown
75checking for cp... /bin/cp
76checking for cpio... /usr/bin/cpio
77checking for diff... /usr/bin/diff
78checking for dscl... /usr/bin/dscl
79checking for dseditgroup... /usr/sbin/dseditgroup
80checking for file... /usr/bin/file
81checking for bzr... no
82checking for cvs... /usr/bin/cvs
83checking for svn... /usr/bin/svn
84checking for git... /usr/bin/git
85checking for hg... no
86checking for gzip... /usr/bin/gzip
87checking for lipo... /usr/bin/lipo
88checking for patch... /usr/bin/patch
89checking for rmdir... /bin/rmdir
90checking for rsync... /usr/bin/rsync
91checking for openssl... /usr/bin/openssl
92checking for sed... /usr/bin/sed
93checking for tar... /usr/bin/tar
94checking for unzip... /usr/bin/unzip
95checking for zip... /usr/bin/zip
96checking for bsdmake... /usr/bin/bsdmake
97checking for make... /usr/bin/make
98checking for hdiutil... /usr/bin/hdiutil
99checking for launchd... yes
100checking for launchctl... /bin/launchctl
101checking for xcodebuild... /usr/bin/xcodebuild
102checking for gnutar... /usr/bin/gnutar
103checking for gnumake... /usr/bin/gnumake
104checking for gnupatch... no
105checking for gpatch... no
106checking for bzip2... /usr/bin/bzip2
107checking for lzma... no
108checking for xz... no
109checking for lsbom... /usr/bin/lsbom
110checking for mkbom... /usr/bin/mkbom
111checking for pax... /bin/pax
112checking for xar... /usr/bin/xar
113checking for open... /usr/bin/open
114checking for sed... (cached) /usr/bin/sed
115checking which sed flag to use for extended regexp... -E (BSD)
116checking for tar... (cached) /usr/bin/tar
117checking whether tar supports -q... yes (bsdtar)
118checking for tar... (cached) /usr/bin/tar
119checking for gnutar... (cached) /usr/bin/gnutar
120checking for which tar variant to use... /usr/bin/gnutar
121checking for /usr/bin/gnutar --no-same-owner support... yes
122checking for patch... (cached) /usr/bin/patch
123checking for gpatch... no
124checking for GNU (FSF) patch... /usr/bin/patch
125checking how to mark unused variables...
126checking for gcc symbol visibility attribute... __attribute__((visibility("hidden")))
127checking for the pthreads library -lpthreads... no
128checking whether pthreads work without any flags... yes
129checking for joinable pthread attribute... PTHREAD_CREATE_JOINABLE
130checking if more special flags are required for pthreads... -D_THREAD_SAFE
131checking how to run the Objective C preprocessor... gcc -E
132checking for grep that handles long lines and -e... /usr/bin/grep
133checking for egrep... /usr/bin/grep -E
134checking for ANSI C header files... yes
135checking for sys/types.h... yes
136checking for sys/stat.h... yes
137checking for stdlib.h... yes
138checking for string.h... yes
139checking for memory.h... yes
140checking for strings.h... yes
141checking for inttypes.h... yes
142checking for stdint.h... yes
143checking for unistd.h... yes
144checking objc/objc.h usability... yes
145checking objc/objc.h presence... yes
146checking for objc/objc.h... yes
147checking if linking libobjc requires pthreads... no
148checking for Apple Objective-C runtime... yes
149checking for GNU Objective C runtime... no
150configure: Using Apple Objective-C runtime
151checking for Apple Foundation library... yes
152configure: WARNING: GNUSTEP_SYSTEM_ROOT is not defined in your environment, preventing the use of GNUstep's Foundation library
153configure: Using Apple Foundation library
154checking for CoreFoundation framework... yes
155checking for SystemConfiguration framework... yes
156checking for IOKit framework... yes
157checking for CFNotificationCenterGetDarwinNotifyCenter... yes
158checking for whether we will build daemondo... yes
159checking for ports tree... /opt/local/var/macports/sources/rsync.macports.org/release/tarballs/ports
160checking for MacPorts config directory... ${sysconfdir}/macports
161checking for install user... root
162checking for install group... admin
163checking for macports user... macports
164checking what permissions to use for installation directories... 755
165checking for Applications installation directory... /Applications/MacPorts
166checking for Frameworks installation directory... /opt/local/Library/Frameworks
167checking for Universal CPU architectures... x86_64 i386
168checking how to run the C preprocessor... /usr/bin/cc -E
169checking for ANSI C header files... (cached) yes
170checking for dirent.h that defines DIR... yes
171checking for library containing opendir... none required
172checking for sys/wait.h that is POSIX.1 compatible... yes
173checking limits.h usability... yes
174checking limits.h presence... yes
175checking for limits.h... yes
176checking paths.h usability... yes
177checking paths.h presence... yes
178checking for paths.h... yes
179checking sys/file.h usability... yes
180checking sys/file.h presence... yes
181checking for sys/file.h... yes
182checking crt_externs.h usability... yes
183checking crt_externs.h presence... yes
184checking for crt_externs.h... yes
185checking fcntl.h usability... yes
186checking fcntl.h presence... yes
187checking for fcntl.h... yes
188checking sys/fcntl.h usability... yes
189checking sys/fcntl.h presence... yes
190checking for sys/fcntl.h... yes
191checking sys/cdefs.h usability... yes
192checking sys/cdefs.h presence... yes
193checking for sys/cdefs.h... yes
194checking err.h usability... yes
195checking err.h presence... yes
196checking for err.h... yes
197checking sys/socket.h usability... yes
198checking sys/socket.h presence... yes
199checking for sys/socket.h... yes
200checking sys/sysctl.h usability... yes
201checking sys/sysctl.h presence... yes
202checking for sys/sysctl.h... yes
203checking readline/readline.h usability... yes
204checking readline/readline.h presence... yes
205checking for readline/readline.h... yes
206checking readline/history.h usability... yes
207checking readline/history.h presence... yes
208checking for readline/history.h... yes
209checking pwd.h usability... yes
210checking pwd.h presence... yes
211checking for pwd.h... yes
212checking sys/paths.h usability... yes
213checking sys/paths.h presence... yes
214checking for sys/paths.h... yes
215checking utime.h usability... yes
216checking utime.h presence... yes
217checking for utime.h... yes
218checking for bzero... yes
219checking for memset... yes
220checking for fgetln... yes
221checking for lockf... yes
222checking for flock... yes
223checking for setmode... yes
224checking for strcasecmp... yes
225checking for strncasecmp... yes
226checking for strlcpy... yes
227checking for copyfile... yes
228checking for clearenv... no
229checking for sysctlbyname... yes
230checking if readlink conforms to POSIX 1003.1a... yes
231checking CommonCrypto/CommonDigest.h usability... yes
232checking CommonCrypto/CommonDigest.h presence... yes
233checking for CommonCrypto/CommonDigest.h... yes
234checking for readline in -lreadline... yes
235checking whether rl_username_completion_function is declared... no
236checking whether rl_filename_completion_function is declared... yes
237checking whether rl_completion_matches is declared... yes
238checking whether username_completion_function is declared... yes
239checking whether filename_completion_function is declared... yes
240checking whether completion_matches is declared... yes
241checking for Tcl configuration... found /usr/lib/tclConfig.sh
242checking for existence of /usr/lib/tclConfig.sh... loading
243checking for Tcl public headers... /usr/include
244checking for tclsh... /usr/bin/tclsh
245checking for Tcl package directory... /Library/Tcl
246checking whether tclsh was compiled with threads... yes
247checking for curl-config... /usr/bin/curl-config
248checking for pkg-config... /usr/bin/pkg-config
249checking sqlite3ext.h usability... yes
250checking sqlite3ext.h presence... yes
251checking for sqlite3ext.h... yes
252checking for Tcl sqlite3 location...
253checking for Tcl Thread package... yes
254checking how to build libraries... shared
255checking that any existing MacPorts install can be upgraded... yes
256configure: creating ./config.status
257config.status: creating src/programs/daemondo/Makefile
258config.status: creating Doxyfile
259config.status: creating Makefile
260config.status: creating Mk/macports.autoconf.mk
261config.status: creating doc/base.mtree
262config.status: creating doc/prefix.mtree
263config.status: creating doc/macosx.mtree
264config.status: creating doc/macports.conf
265config.status: creating doc/pubkeys.conf
266config.status: creating portmgr/freebsd/Makefile
267config.status: creating src/Makefile
268config.status: creating src/macports1.0/macports_autoconf.tcl
269config.status: creating src/port1.0/port_autoconf.tcl
270config.status: creating src/registry2.0/registry_autoconf.tcl
271config.status: creating src/programs/Makefile
272config.status: creating src/macports1.0/macports_fastload.tcl
273config.status: creating setupenv.bash
274config.status: creating src/pkg_mkindex.sh
275config.status: creating src/config.h
276===> making all in doc
277gzip -c port.1 > port.1.gz
278gzip -c macports.conf.5 > macports.conf.5.gz
279gzip -c portfile.7 > portfile.7.gz
280gzip -c portstyle.7 > portstyle.7.gz
281gzip -c porthier.7 > porthier.7.gz
282gzip -c portgroup.7 > portgroup.7.gz
283===> making all in src
284===> making all in src/cregistry
285/usr/bin/cc -c -DUSE_TCL_STUBS -g -O2 -W -Wall -pedantic  -DHAVE_CONFIG_H -I.. -I.  -I"/usr/include" -fno-common registry.c -o registry.o
286/usr/bin/cc -c -DUSE_TCL_STUBS -g -O2 -W -Wall -pedantic  -DHAVE_CONFIG_H -I.. -I.  -I"/usr/include" -fno-common entry.c -o entry.o
287/usr/bin/cc -c -DUSE_TCL_STUBS -g -O2 -W -Wall -pedantic  -DHAVE_CONFIG_H -I.. -I.  -I"/usr/include" -fno-common sql.c -o sql.o
288/usr/bin/cc -c -DUSE_TCL_STUBS -g -O2 -W -Wall -pedantic  -DHAVE_CONFIG_H -I.. -I.  -I"/usr/include" -fno-common vercomp.c -o vercomp.o
289ar cr cregistry.a registry.o entry.o sql.o vercomp.o
290ranlib cregistry.a
291/usr/bin/cc -c -DUSE_TCL_STUBS -g -O2 -W -Wall -pedantic  -DHAVE_CONFIG_H -I.. -I.  -I"/usr/include" -fno-common sqlext.c -o sqlext.o
292/usr/bin/cc -dynamiclib -g -O2 -W -Wall -pedantic   -Wl,-single_module sqlext.o vercomp.o -o macports.sqlext
293===> making all in src/macports1.0
294/usr/bin/cc -c -DUSE_TCL_STUBS -DTCL_NO_DEPRECATED -g -O2 -W -Wall -pedantic  -DHAVE_CONFIG_H -I.. -I.  -I"/usr/include" -fno-common macports.c -o macports.o
295/usr/bin/cc -c -DUSE_TCL_STUBS -DTCL_NO_DEPRECATED -g -O2 -W -Wall -pedantic  -DHAVE_CONFIG_H -I.. -I.  -I"/usr/include" -fno-common get_systemconfiguration_proxies.c -o get_systemconfiguration_proxies.o
296/usr/bin/cc -c -DUSE_TCL_STUBS -DTCL_NO_DEPRECATED -g -O2 -W -Wall -pedantic  -DHAVE_CONFIG_H -I.. -I.  -I"/usr/include" -fno-common sysctl.c -o sysctl.o
297/usr/bin/cc -dynamiclib -g -O2 -W -Wall -pedantic   -Wl,-single_module macports.o get_systemconfiguration_proxies.o sysctl.o -o MacPorts.dylib -L/System/Library/Frameworks/Tcl.framework/Versions/8.5 -ltclstub8.5   -framework CoreFoundation -framework SystemConfiguration
298===> making all in src/port1.0
299===> making all in src/package1.0
300===> making all in src/pextlib1.0
301/usr/bin/cc -c -DUSE_TCL_STUBS -DTCL_NO_DEPRECATED -g -O2 -W -Wall -pedantic     -DHAVE_CONFIG_H -I.. -I.  -I"/usr/include" -fno-common Pextlib.c -o Pextlib.o
302/usr/bin/cc -c -DUSE_TCL_STUBS -DTCL_NO_DEPRECATED -g -O2 -W -Wall -pedantic     -DHAVE_CONFIG_H -I.. -I.  -I"/usr/include" -fno-common strsed.c -o strsed.o
303/usr/bin/cc -c -DUSE_TCL_STUBS -DTCL_NO_DEPRECATED -g -O2 -W -Wall -pedantic     -DHAVE_CONFIG_H -I.. -I.  -I"/usr/include" -fno-common fgetln.c -o fgetln.o
304/usr/bin/cc -c -DUSE_TCL_STUBS -DTCL_NO_DEPRECATED -g -O2 -W -Wall -pedantic     -DHAVE_CONFIG_H -I.. -I.  -I"/usr/include" -fno-common md5cmd.c -o md5cmd.o
305/usr/bin/cc -c -DUSE_TCL_STUBS -DTCL_NO_DEPRECATED -g -O2 -W -Wall -pedantic     -DHAVE_CONFIG_H -I.. -I.  -I"/usr/include" -fno-common setmode.c -o setmode.o
306/usr/bin/cc -c -DUSE_TCL_STUBS -DTCL_NO_DEPRECATED -g -O2 -W -Wall -pedantic     -DHAVE_CONFIG_H -I.. -I.  -I"/usr/include" -fno-common xinstall.c -o xinstall.o
307/usr/bin/cc -c -DUSE_TCL_STUBS -DTCL_NO_DEPRECATED -g -O2 -W -Wall -pedantic     -DHAVE_CONFIG_H -I.. -I.  -I"/usr/include" -fno-common fs-traverse.c -o fs-traverse.o
308/usr/bin/cc -c -DUSE_TCL_STUBS -DTCL_NO_DEPRECATED -g -O2 -W -Wall -pedantic     -DHAVE_CONFIG_H -I.. -I.  -I"/usr/include" -fno-common strcasecmp.c -o strcasecmp.o
309/usr/bin/cc -c -DUSE_TCL_STUBS -DTCL_NO_DEPRECATED -g -O2 -W -Wall -pedantic     -DHAVE_CONFIG_H -I.. -I.  -I"/usr/include" -fno-common vercomp.c -o vercomp.o
310/usr/bin/cc -c -DUSE_TCL_STUBS -DTCL_NO_DEPRECATED -g -O2 -W -Wall -pedantic     -DHAVE_CONFIG_H -I.. -I.  -I"/usr/include" -fno-common filemap.c -o filemap.o
311/usr/bin/cc -c -DUSE_TCL_STUBS -DTCL_NO_DEPRECATED -g -O2 -W -Wall -pedantic     -DHAVE_CONFIG_H -I.. -I.  -I"/usr/include" -fno-common base32cmd.c -o base32cmd.o
312/usr/bin/cc -c -DUSE_TCL_STUBS -DTCL_NO_DEPRECATED -g -O2 -W -Wall -pedantic     -DHAVE_CONFIG_H -I.. -I.  -I"/usr/include" -fno-common sha1cmd.c -o sha1cmd.o
313/usr/bin/cc -c -DUSE_TCL_STUBS -DTCL_NO_DEPRECATED -g -O2 -W -Wall -pedantic     -DHAVE_CONFIG_H -I.. -I.  -I"/usr/include" -fno-common curl.c -o curl.o
314/usr/bin/cc -c -DUSE_TCL_STUBS -DTCL_NO_DEPRECATED -g -O2 -W -Wall -pedantic     -DHAVE_CONFIG_H -I.. -I.  -I"/usr/include" -fno-common rmd160cmd.c -o rmd160cmd.o
315/usr/bin/cc -c -DUSE_TCL_STUBS -DTCL_NO_DEPRECATED -g -O2 -W -Wall -pedantic     -DHAVE_CONFIG_H -I.. -I.  -I"/usr/include" -fno-common sha256cmd.c -o sha256cmd.o
316/usr/bin/cc -c -DUSE_TCL_STUBS -DTCL_NO_DEPRECATED -g -O2 -W -Wall -pedantic     -DHAVE_CONFIG_H -I.. -I.  -I"/usr/include" -fno-common readline.c -o readline.o
317/usr/bin/cc -c -DUSE_TCL_STUBS -DTCL_NO_DEPRECATED -g -O2 -W -Wall -pedantic     -DHAVE_CONFIG_H -I.. -I.  -I"/usr/include" -fno-common uid.c -o uid.o
318/usr/bin/cc -c -DUSE_TCL_STUBS -DTCL_NO_DEPRECATED -g -O2 -W -Wall -pedantic     -DHAVE_CONFIG_H -I.. -I.  -I"/usr/include" -fno-common tracelib.c -o tracelib.o
319/usr/bin/cc -c -DUSE_TCL_STUBS -DTCL_NO_DEPRECATED -g -O2 -W -Wall -pedantic     -DHAVE_CONFIG_H -I.. -I.  -I"/usr/include" -fno-common tty.c -o tty.o
320/usr/bin/cc -c -DUSE_TCL_STUBS -DTCL_NO_DEPRECATED -g -O2 -W -Wall -pedantic     -DHAVE_CONFIG_H -I.. -I.  -I"/usr/include" -fno-common readdir.c -o readdir.o
321/usr/bin/cc -c -DUSE_TCL_STUBS -DTCL_NO_DEPRECATED -g -O2 -W -Wall -pedantic     -DHAVE_CONFIG_H -I.. -I.  -I"/usr/include" -fno-common pipe.c -o pipe.o
322/usr/bin/cc -c -DUSE_TCL_STUBS -DTCL_NO_DEPRECATED -g -O2 -W -Wall -pedantic     -DHAVE_CONFIG_H -I.. -I.  -I"/usr/include" -fno-common flock.c -o flock.o
323/usr/bin/cc -c -DUSE_TCL_STUBS -DTCL_NO_DEPRECATED -g -O2 -W -Wall -pedantic     -DHAVE_CONFIG_H -I.. -I.  -I"/usr/include" -fno-common system.c -o system.o
324/usr/bin/cc -c -DUSE_TCL_STUBS -DTCL_NO_DEPRECATED -g -O2 -W -Wall -pedantic     -DHAVE_CONFIG_H -I.. -I.  -I"/usr/include" -fno-common mktemp.c -o mktemp.o
325/usr/bin/cc -c -DUSE_TCL_STUBS -DTCL_NO_DEPRECATED -g -O2 -W -Wall -pedantic     -DHAVE_CONFIG_H -I.. -I.  -I"/usr/include" -fno-common realpath.c -o realpath.o
326/usr/bin/cc -dynamiclib -g -O2 -W -Wall -pedantic      -Wl,-single_module Pextlib.o strsed.o fgetln.o md5cmd.o setmode.o xinstall.o fs-traverse.o strcasecmp.o vercomp.o filemap.o base32cmd.o sha1cmd.o curl.o rmd160cmd.o sha256cmd.o readline.o uid.o tracelib.o tty.o readdir.o pipe.o flock.o system.o mktemp.o realpath.o -o Pextlib.dylib -L/System/Library/Frameworks/Tcl.framework/Versions/8.5 -ltclstub8.5   -lcurl  -lreadline
327===> making all in src/registry2.0
328/usr/bin/cc -c -DUSE_TCL_STUBS -DTCL_NO_DEPRECATED -g -O2 -W -Wall -pedantic  -I/Library/Frameworks/Mono.framework/Versions/2.10.8/include   -DHAVE_CONFIG_H -I.. -I.  -I"/usr/include" -fno-common registry.c -o registry.o
329In file included from ../cregistry/registry.h:35,
330                 from registry.c:39:
331/Library/Frameworks/Mono.framework/Versions/2.10.8/include/sqlite3.h:252: warning: ISO C90 does not support ‘long long’
332/Library/Frameworks/Mono.framework/Versions/2.10.8/include/sqlite3.h:253: warning: ISO C90 does not support ‘long long’
333/usr/bin/cc -c -DUSE_TCL_STUBS -DTCL_NO_DEPRECATED -g -O2 -W -Wall -pedantic  -I/Library/Frameworks/Mono.framework/Versions/2.10.8/include   -DHAVE_CONFIG_H -I.. -I.  -I"/usr/include" -fno-common util.c -o util.o
334In file included from util.h:36,
335                 from util.c:37:
336/Library/Frameworks/Mono.framework/Versions/2.10.8/include/sqlite3.h:252: warning: ISO C90 does not support ‘long long’
337/Library/Frameworks/Mono.framework/Versions/2.10.8/include/sqlite3.h:253: warning: ISO C90 does not support ‘long long’
338/usr/bin/cc -c -DUSE_TCL_STUBS -DTCL_NO_DEPRECATED -g -O2 -W -Wall -pedantic  -I/Library/Frameworks/Mono.framework/Versions/2.10.8/include   -DHAVE_CONFIG_H -I.. -I.  -I"/usr/include" -fno-common entry.c -o entry.o
339In file included from entry.c:36:
340/Library/Frameworks/Mono.framework/Versions/2.10.8/include/sqlite3.h:252: warning: ISO C90 does not support ‘long long’
341/Library/Frameworks/Mono.framework/Versions/2.10.8/include/sqlite3.h:253: warning: ISO C90 does not support ‘long long’
342/usr/bin/cc -c -DUSE_TCL_STUBS -DTCL_NO_DEPRECATED -g -O2 -W -Wall -pedantic  -I/Library/Frameworks/Mono.framework/Versions/2.10.8/include   -DHAVE_CONFIG_H -I.. -I.  -I"/usr/include" -fno-common entryobj.c -o entryobj.o
343In file included from entryobj.c:36:
344/Library/Frameworks/Mono.framework/Versions/2.10.8/include/sqlite3.h:252: warning: ISO C90 does not support ‘long long’
345/Library/Frameworks/Mono.framework/Versions/2.10.8/include/sqlite3.h:253: warning: ISO C90 does not support ‘long long’
346/usr/bin/cc -dynamiclib -g -O2 -W -Wall -pedantic  -I/Library/Frameworks/Mono.framework/Versions/2.10.8/include    -Wl,-single_module registry.o util.o entry.o entryobj.o ../cregistry/cregistry.a -o registry.dylib -L/System/Library/Frameworks/Tcl.framework/Versions/8.5 -ltclstub8.5   -L/Library/Frameworks/Mono.framework/Versions/2.10.8/lib -lsqlite3 
347ld: warning: ignoring file /Library/Frameworks/Mono.framework/Versions/2.10.8/lib/libsqlite3.dylib, file was built for unsupported file format which is not the architecture being linked (x86_64)
348Undefined symbols for architecture x86_64:
349  "_sqlite3_errmsg", referenced from:
350      _set_sqlite_result in util.o
351      _reg_sqlite_error in cregistry.a(registry.o)
352      _reg_detach in cregistry.a(registry.o)
353      _reg_close in cregistry.a(registry.o)
354      _reg_attach in cregistry.a(registry.o)
355      _reg_open in cregistry.a(registry.o)
356  "_sqlite3_mprintf", referenced from:
357      _set_object in util.o
358      _set_entry in util.o
359      _get_object in util.o
360      _reg_sqlite_error in cregistry.a(registry.o)
361      _reg_detach in cregistry.a(registry.o)
362      _reg_attach in cregistry.a(registry.o)
363      _reg_open in cregistry.a(registry.o)
364      ...
365  "_sqlite3_free", referenced from:
366      _set_object in util.o
367      _set_entry in util.o
368      _get_object in util.o
369      _reg_throw in cregistry.a(registry.o)
370      _reg_sqlite_error in cregistry.a(registry.o)
371      _reg_detach in cregistry.a(registry.o)
372      _reg_attach in cregistry.a(registry.o)
373      ...
374  "_sqlite3_prepare", referenced from:
375      _all_objects in util.o
376      _reg_vacuum in cregistry.a(registry.o)
377      _reg_detach in cregistry.a(registry.o)
378      _reg_attach in cregistry.a(registry.o)
379      _reg_entry_create in cregistry.a(entry.o)
380      _reg_entry_depends in cregistry.a(entry.o)
381      _reg_all_entries in cregistry.a(entry.o)
382      ...
383  "_sqlite3_column_int64", referenced from:
384      _all_objects in util.o
385      _reg_all_entries in cregistry.a(entry.o)
386      _reg_entry_owner in cregistry.a(entry.o)
387      _reg_entry_open in cregistry.a(entry.o)
388      _reg_entry_owner_id in cregistry.a(entry.o)
389  "_sqlite3_step", referenced from:
390      _all_objects in util.o
391      _reg_vacuum in cregistry.a(registry.o)
392      _reg_detach in cregistry.a(registry.o)
393      _reg_attach in cregistry.a(registry.o)
394      _reg_entry_create in cregistry.a(entry.o)
395      _reg_entry_depends in cregistry.a(entry.o)
396      _reg_all_entries in cregistry.a(entry.o)
397      ...
398  "_sqlite3_finalize", referenced from:
399      _all_objects in util.o
400      _reg_vacuum in cregistry.a(registry.o)
401      _reg_detach in cregistry.a(registry.o)
402      _reg_attach in cregistry.a(registry.o)
403      _reg_entry_create in cregistry.a(entry.o)
404      _reg_entry_depends in cregistry.a(entry.o)
405      _reg_all_entries in cregistry.a(entry.o)
406      ...
407  "_sqlite3_open", referenced from:
408      _reg_vacuum in cregistry.a(registry.o)
409      _reg_open in cregistry.a(registry.o)
410  "_sqlite3_close", referenced from:
411      _reg_vacuum in cregistry.a(registry.o)
412      _reg_close in cregistry.a(registry.o)
413      _reg_open in cregistry.a(registry.o)
414  "_sqlite3_reset", referenced from:
415      _reg_vacuum in cregistry.a(registry.o)
416      _reg_detach in cregistry.a(registry.o)
417      _reg_attach in cregistry.a(registry.o)
418      _reg_entry_deactivate in cregistry.a(entry.o)
419      _reg_entry_activate in cregistry.a(entry.o)
420      _reg_entry_unmap in cregistry.a(entry.o)
421      _reg_entry_map in cregistry.a(entry.o)
422      ...
423  "_sqlite3_vmprintf", referenced from:
424      _reg_throw in cregistry.a(registry.o)
425  "_sqlite3_errcode", referenced from:
426      _reg_sqlite_error in cregistry.a(registry.o)
427      _reg_detach in cregistry.a(registry.o)
428      _reg_attach in cregistry.a(registry.o)
429      _reg_open in cregistry.a(registry.o)
430  "_sqlite3_exec", referenced from:
431      _reg_rollback in cregistry.a(registry.o)
432      _reg_commit in cregistry.a(registry.o)
433      _reg_start_write in cregistry.a(registry.o)
434      _reg_start_read in cregistry.a(registry.o)
435  "_sqlite3_bind_text", referenced from:
436      _reg_entry_create in cregistry.a(entry.o)
437      _reg_entry_depends in cregistry.a(entry.o)
438      _reg_entry_owner in cregistry.a(entry.o)
439      _reg_entry_open in cregistry.a(entry.o)
440      _reg_entry_owner_id in cregistry.a(entry.o)
441      _reg_entry_deactivate in cregistry.a(entry.o)
442      _reg_entry_activate in cregistry.a(entry.o)
443      ...
444  "_sqlite3_last_insert_rowid", referenced from:
445      _reg_entry_create in cregistry.a(entry.o)
446  "_sqlite3_bind_int64", referenced from:
447      _reg_entry_depends in cregistry.a(entry.o)
448      _reg_entry_delete in cregistry.a(entry.o)
449      _reg_entry_deactivate in cregistry.a(entry.o)
450      _reg_entry_activate in cregistry.a(entry.o)
451      _reg_entry_unmap in cregistry.a(entry.o)
452      _reg_entry_map in cregistry.a(entry.o)
453      _reg_entry_files in cregistry.a(entry.o)
454      ...
455  "_sqlite3_changes", referenced from:
456      _reg_entry_delete in cregistry.a(entry.o)
457      _reg_entry_deactivate in cregistry.a(entry.o)
458      _reg_entry_activate in cregistry.a(entry.o)
459      _reg_entry_unmap in cregistry.a(entry.o)
460  "_sqlite3_column_text", referenced from:
461      _reg_entry_files in cregistry.a(entry.o)
462      _reg_entry_imagefiles in cregistry.a(entry.o)
463      _reg_entry_propget in cregistry.a(entry.o)
464  "_sqlite3_value_text", referenced from:
465      _sql_regexp in cregistry.a(sql.o)
466  "_sqlite3_result_int", referenced from:
467      _sql_regexp in cregistry.a(sql.o)
468  "_sqlite3_result_error", referenced from:
469      _sql_regexp in cregistry.a(sql.o)
470  "_sqlite3_create_function", referenced from:
471      _init_db in cregistry.a(sql.o)
472  "_sqlite3_create_collation", referenced from:
473      _init_db in cregistry.a(sql.o)
474ld: symbol(s) not found for architecture x86_64
475collect2: ld returned 1 exit status
476make[2]: *** [registry.dylib] Error 1
477make[1]: *** [all] Error 1
478make: *** [all] Error 1
479shell command "cd /opt/local/var/macports/sources/rsync.macports.org/release/tarballs/base && CC=/usr/bin/cc ./configure --prefix=/opt/local --with-tclpackage=/Library/Tcl --with-install-user=root --with-install-group=admin --with-directory-mode=0755 --enable-readline && make && make install SELFUPDATING=1" returned error 2
480DEBUG: Error installing new MacPorts base: shell command failed (see log for details)
481    while executing
482"macports::selfupdate [array get global_options] base_updated"
483Error: /opt/local/bin/port: port selfupdate failed: Error installing new MacPorts base: shell command failed (see log for details)
484macbookpro-3d85:~ richard$