Ticket #34323: glib2.main.log

File glib2.main.log, 15.7 KB (added by remix@…, 9 years ago)

glib2 main.log

Line 
1version:1
2:msg:main --->  Computing dependencies for glib2:info:main .:debug:main Checking for conflicts against glib2
3:debug:main Searching for dependency: glib2-devel
4:debug:main Didn't find receipt, going to depspec regex for: glib2-devel
5:debug:main Searching for dependency: xz
6:debug:main Found Dependency: receipt exists for xz
7:debug:main Searching for dependency: gettext
8:debug:main Found Dependency: receipt exists for gettext
9:debug:main Searching for dependency: libiconv
10:debug:main Found Dependency: receipt exists for libiconv
11:debug:main Searching for dependency: zlib
12:debug:main Found Dependency: receipt exists for zlib
13:debug:main Searching for dependency: libffi
14:debug:main Found Dependency: receipt exists for libffi
15:debug:main Searching for dependency: perl5
16:debug:main Found Dependency: receipt exists for perl5
17:msg:main
18:debug:main Executing org.macports.main (glib2)
19:debug:main Skipping completed org.macports.archivefetch (glib2)
20:debug:main Skipping completed org.macports.fetch (glib2)
21:debug:main Skipping completed org.macports.checksum (glib2)
22:debug:main Skipping completed org.macports.extract (glib2)
23:debug:main Skipping completed org.macports.patch (glib2)
24:debug:main Skipping completed org.macports.configure (glib2)
25:debug:build build phase started at Thu May  3 10:09:40 HST 2012
26:notice:build --->  Building glib2
27:debug:build Executing org.macports.build (glib2)
28:debug:build Environment: CPATH='/opt/local/include' CC_PRINT_OPTIONS_FILE='/opt/local/var/macports/build/_opt_local_var_macports_sources_rsync.macports.org_release_ports_devel_glib2/glib2/work/.CC_PRINT_OPTIONS' LIBRARY_PATH='/opt/local/lib' CC_PRINT_OPTIONS='YES' MACOSX_DEPLOYMENT_TARGET='10.6' GI_SCANNER_DISABLE_CACHE='1'
29:debug:build Assembled command: 'cd "/opt/local/var/macports/build/_opt_local_var_macports_sources_rsync.macports.org_release_ports_devel_glib2/glib2/work/glib-2.32.2" && /usr/bin/make -j4 -w all V=1'
30:debug:build Executing command line:  cd "/opt/local/var/macports/build/_opt_local_var_macports_sources_rsync.macports.org_release_ports_devel_glib2/glib2/work/glib-2.32.2" && /usr/bin/make -j4 -w all V=1
31:info:build make: Entering directory `/opt/local/var/macports/build/_opt_local_var_macports_sources_rsync.macports.org_release_ports_devel_glib2/glib2/work/glib-2.32.2'
32:info:build /usr/bin/make  all-recursive
33:info:build make[1]: Entering directory `/opt/local/var/macports/build/_opt_local_var_macports_sources_rsync.macports.org_release_ports_devel_glib2/glib2/work/glib-2.32.2'
34:info:build Making all in .
35:info:build make[2]: Entering directory `/opt/local/var/macports/build/_opt_local_var_macports_sources_rsync.macports.org_release_ports_devel_glib2/glib2/work/glib-2.32.2'
36:info:build make[2]: Nothing to be done for `all-am'.
37:info:build make[2]: Leaving directory `/opt/local/var/macports/build/_opt_local_var_macports_sources_rsync.macports.org_release_ports_devel_glib2/glib2/work/glib-2.32.2'
38:info:build Making all in m4macros
39:info:build make[2]: Entering directory `/opt/local/var/macports/build/_opt_local_var_macports_sources_rsync.macports.org_release_ports_devel_glib2/glib2/work/glib-2.32.2/m4macros'
40:info:build make[2]: Nothing to be done for `all'.
41:info:build make[2]: Leaving directory `/opt/local/var/macports/build/_opt_local_var_macports_sources_rsync.macports.org_release_ports_devel_glib2/glib2/work/glib-2.32.2/m4macros'
42:info:build Making all in glib
43:info:build make[2]: Entering directory `/opt/local/var/macports/build/_opt_local_var_macports_sources_rsync.macports.org_release_ports_devel_glib2/glib2/work/glib-2.32.2/glib'
44:info:build /usr/bin/make  all-recursive
45:info:build make[3]: Entering directory `/opt/local/var/macports/build/_opt_local_var_macports_sources_rsync.macports.org_release_ports_devel_glib2/glib2/work/glib-2.32.2/glib'
46:info:build Making all in libcharset
47:info:build make[4]: Entering directory `/opt/local/var/macports/build/_opt_local_var_macports_sources_rsync.macports.org_release_ports_devel_glib2/glib2/work/glib-2.32.2/glib/libcharset'
48:info:build make[4]: Nothing to be done for `all'.
49:info:build make[4]: Leaving directory `/opt/local/var/macports/build/_opt_local_var_macports_sources_rsync.macports.org_release_ports_devel_glib2/glib2/work/glib-2.32.2/glib/libcharset'
50:info:build Making all in pcre
51:info:build make[4]: Entering directory `/opt/local/var/macports/build/_opt_local_var_macports_sources_rsync.macports.org_release_ports_devel_glib2/glib2/work/glib-2.32.2/glib/pcre'
52:info:build make[4]: Nothing to be done for `all'.
53:info:build make[4]: Leaving directory `/opt/local/var/macports/build/_opt_local_var_macports_sources_rsync.macports.org_release_ports_devel_glib2/glib2/work/glib-2.32.2/glib/pcre'
54:info:build Making all in update-pcre
55:info:build make[4]: Entering directory `/opt/local/var/macports/build/_opt_local_var_macports_sources_rsync.macports.org_release_ports_devel_glib2/glib2/work/glib-2.32.2/glib/update-pcre'
56:info:build make[4]: Nothing to be done for `all'.
57:info:build make[4]: Leaving directory `/opt/local/var/macports/build/_opt_local_var_macports_sources_rsync.macports.org_release_ports_devel_glib2/glib2/work/glib-2.32.2/glib/update-pcre'
58:info:build Making all in .
59:info:build make[4]: Entering directory `/opt/local/var/macports/build/_opt_local_var_macports_sources_rsync.macports.org_release_ports_devel_glib2/glib2/work/glib-2.32.2/glib'
60:info:build make[4]: Nothing to be done for `all-am'.
61:info:build make[4]: Leaving directory `/opt/local/var/macports/build/_opt_local_var_macports_sources_rsync.macports.org_release_ports_devel_glib2/glib2/work/glib-2.32.2/glib'
62:info:build Making all in tests
63:info:build make[4]: Entering directory `/opt/local/var/macports/build/_opt_local_var_macports_sources_rsync.macports.org_release_ports_devel_glib2/glib2/work/glib-2.32.2/glib/tests'
64:info:build make[4]: Nothing to be done for `all'.
65:info:build make[4]: Leaving directory `/opt/local/var/macports/build/_opt_local_var_macports_sources_rsync.macports.org_release_ports_devel_glib2/glib2/work/glib-2.32.2/glib/tests'
66:info:build make[3]: Leaving directory `/opt/local/var/macports/build/_opt_local_var_macports_sources_rsync.macports.org_release_ports_devel_glib2/glib2/work/glib-2.32.2/glib'
67:info:build make[2]: Leaving directory `/opt/local/var/macports/build/_opt_local_var_macports_sources_rsync.macports.org_release_ports_devel_glib2/glib2/work/glib-2.32.2/glib'
68:info:build Making all in gmodule
69:info:build make[2]: Entering directory `/opt/local/var/macports/build/_opt_local_var_macports_sources_rsync.macports.org_release_ports_devel_glib2/glib2/work/glib-2.32.2/gmodule'
70:info:build /usr/bin/make  all-am
71:info:build make[3]: Entering directory `/opt/local/var/macports/build/_opt_local_var_macports_sources_rsync.macports.org_release_ports_devel_glib2/glib2/work/glib-2.32.2/gmodule'
72:info:build make[3]: Nothing to be done for `all-am'.
73:info:build make[3]: Leaving directory `/opt/local/var/macports/build/_opt_local_var_macports_sources_rsync.macports.org_release_ports_devel_glib2/glib2/work/glib-2.32.2/gmodule'
74:info:build make[2]: Leaving directory `/opt/local/var/macports/build/_opt_local_var_macports_sources_rsync.macports.org_release_ports_devel_glib2/glib2/work/glib-2.32.2/gmodule'
75:info:build Making all in gthread
76:info:build make[2]: Entering directory `/opt/local/var/macports/build/_opt_local_var_macports_sources_rsync.macports.org_release_ports_devel_glib2/glib2/work/glib-2.32.2/gthread'
77:info:build make[2]: Nothing to be done for `all'.
78:info:build make[2]: Leaving directory `/opt/local/var/macports/build/_opt_local_var_macports_sources_rsync.macports.org_release_ports_devel_glib2/glib2/work/glib-2.32.2/gthread'
79:info:build Making all in gobject
80:info:build make[2]: Entering directory `/opt/local/var/macports/build/_opt_local_var_macports_sources_rsync.macports.org_release_ports_devel_glib2/glib2/work/glib-2.32.2/gobject'
81:info:build /usr/bin/make  all-recursive
82:info:build make[3]: Entering directory `/opt/local/var/macports/build/_opt_local_var_macports_sources_rsync.macports.org_release_ports_devel_glib2/glib2/work/glib-2.32.2/gobject'
83:info:build Making all in .
84:info:build make[4]: Entering directory `/opt/local/var/macports/build/_opt_local_var_macports_sources_rsync.macports.org_release_ports_devel_glib2/glib2/work/glib-2.32.2/gobject'
85:info:build make[4]: Nothing to be done for `all-am'.
86:info:build make[4]: Leaving directory `/opt/local/var/macports/build/_opt_local_var_macports_sources_rsync.macports.org_release_ports_devel_glib2/glib2/work/glib-2.32.2/gobject'
87:info:build Making all in tests
88:info:build make[4]: Entering directory `/opt/local/var/macports/build/_opt_local_var_macports_sources_rsync.macports.org_release_ports_devel_glib2/glib2/work/glib-2.32.2/gobject/tests'
89:info:build /usr/bin/make  all-am
90:info:build make[5]: Entering directory `/opt/local/var/macports/build/_opt_local_var_macports_sources_rsync.macports.org_release_ports_devel_glib2/glib2/work/glib-2.32.2/gobject/tests'
91:info:build make[5]: Nothing to be done for `all-am'.
92:info:build make[5]: Leaving directory `/opt/local/var/macports/build/_opt_local_var_macports_sources_rsync.macports.org_release_ports_devel_glib2/glib2/work/glib-2.32.2/gobject/tests'
93:info:build make[4]: Leaving directory `/opt/local/var/macports/build/_opt_local_var_macports_sources_rsync.macports.org_release_ports_devel_glib2/glib2/work/glib-2.32.2/gobject/tests'
94:info:build make[3]: Leaving directory `/opt/local/var/macports/build/_opt_local_var_macports_sources_rsync.macports.org_release_ports_devel_glib2/glib2/work/glib-2.32.2/gobject'
95:info:build make[2]: Leaving directory `/opt/local/var/macports/build/_opt_local_var_macports_sources_rsync.macports.org_release_ports_devel_glib2/glib2/work/glib-2.32.2/gobject'
96:info:build Making all in gio
97:info:build make[2]: Entering directory `/opt/local/var/macports/build/_opt_local_var_macports_sources_rsync.macports.org_release_ports_devel_glib2/glib2/work/glib-2.32.2/gio'
98:info:build /usr/bin/make  all-recursive
99:info:build make[3]: Entering directory `/opt/local/var/macports/build/_opt_local_var_macports_sources_rsync.macports.org_release_ports_devel_glib2/glib2/work/glib-2.32.2/gio'
100:info:build Making all in gdbus-2.0/codegen
101:info:build make[4]: Entering directory `/opt/local/var/macports/build/_opt_local_var_macports_sources_rsync.macports.org_release_ports_devel_glib2/glib2/work/glib-2.32.2/gio/gdbus-2.0/codegen'
102:info:build make[4]: Nothing to be done for `all'.
103:info:build make[4]: Leaving directory `/opt/local/var/macports/build/_opt_local_var_macports_sources_rsync.macports.org_release_ports_devel_glib2/glib2/work/glib-2.32.2/gio/gdbus-2.0/codegen'
104:info:build Making all in xdgmime
105:info:build make[4]: Entering directory `/opt/local/var/macports/build/_opt_local_var_macports_sources_rsync.macports.org_release_ports_devel_glib2/glib2/work/glib-2.32.2/gio/xdgmime'
106:info:build make[4]: Nothing to be done for `all'.
107:info:build make[4]: Leaving directory `/opt/local/var/macports/build/_opt_local_var_macports_sources_rsync.macports.org_release_ports_devel_glib2/glib2/work/glib-2.32.2/gio/xdgmime'
108:info:build Making all in .
109:info:build make[4]: Entering directory `/opt/local/var/macports/build/_opt_local_var_macports_sources_rsync.macports.org_release_ports_devel_glib2/glib2/work/glib-2.32.2/gio'
110:info:build make[4]: Nothing to be done for `all-am'.
111:info:build make[4]: Leaving directory `/opt/local/var/macports/build/_opt_local_var_macports_sources_rsync.macports.org_release_ports_devel_glib2/glib2/work/glib-2.32.2/gio'
112:info:build Making all in tests
113:info:build make[4]: Entering directory `/opt/local/var/macports/build/_opt_local_var_macports_sources_rsync.macports.org_release_ports_devel_glib2/glib2/work/glib-2.32.2/gio/tests'
114:info:build /usr/bin/make  all-recursive
115:info:build make[5]: Entering directory `/opt/local/var/macports/build/_opt_local_var_macports_sources_rsync.macports.org_release_ports_devel_glib2/glib2/work/glib-2.32.2/gio/tests'
116:info:build Making all in gdbus-object-manager-example
117:info:build make[6]: Entering directory `/opt/local/var/macports/build/_opt_local_var_macports_sources_rsync.macports.org_release_ports_devel_glib2/glib2/work/glib-2.32.2/gio/tests/gdbus-object-manager-example'
118:info:build /usr/bin/make  all-am
119:info:build make[7]: Entering directory `/opt/local/var/macports/build/_opt_local_var_macports_sources_rsync.macports.org_release_ports_devel_glib2/glib2/work/glib-2.32.2/gio/tests/gdbus-object-manager-example'
120:info:build make[7]: Nothing to be done for `all-am'.
121:info:build make[7]: Leaving directory `/opt/local/var/macports/build/_opt_local_var_macports_sources_rsync.macports.org_release_ports_devel_glib2/glib2/work/glib-2.32.2/gio/tests/gdbus-object-manager-example'
122:info:build make[6]: Leaving directory `/opt/local/var/macports/build/_opt_local_var_macports_sources_rsync.macports.org_release_ports_devel_glib2/glib2/work/glib-2.32.2/gio/tests/gdbus-object-manager-example'
123:info:build make[6]: Entering directory `/opt/local/var/macports/build/_opt_local_var_macports_sources_rsync.macports.org_release_ports_devel_glib2/glib2/work/glib-2.32.2/gio/tests'
124:info:build /opt/local/bin/msgfmt -o test.mo ./de.po; \
125:info:build     /opt/local/bin/gmkdir -p de/LC_MESSAGES; \
126:info:build     cp -f test.mo de/LC_MESSAGES
127:info:build dyld: Library not loaded: /opt/local/lib/libncurses.5.dylib
128:info:build   Referenced from: /opt/local/bin/msgfmt
129:info:build   Reason: no suitable image found.  Did find:
130:info:build     /usr/lib/libncurses.5.dylib: no matching architecture in universal wrapper
131:info:build /bin/sh: line 1: 63408 Trace/BPT trap          /opt/local/bin/msgfmt -o test.mo ./de.po
132:info:build cp: test.mo: No such file or directory
133:info:build make[6]: *** [test.mo] Error 1
134:info:build make[6]: Leaving directory `/opt/local/var/macports/build/_opt_local_var_macports_sources_rsync.macports.org_release_ports_devel_glib2/glib2/work/glib-2.32.2/gio/tests'
135:info:build make[5]: *** [all-recursive] Error 1
136:info:build make[5]: Leaving directory `/opt/local/var/macports/build/_opt_local_var_macports_sources_rsync.macports.org_release_ports_devel_glib2/glib2/work/glib-2.32.2/gio/tests'
137:info:build make[4]: *** [all] Error 2
138:info:build make[4]: Leaving directory `/opt/local/var/macports/build/_opt_local_var_macports_sources_rsync.macports.org_release_ports_devel_glib2/glib2/work/glib-2.32.2/gio/tests'
139:info:build make[3]: *** [all-recursive] Error 1
140:info:build make[3]: Leaving directory `/opt/local/var/macports/build/_opt_local_var_macports_sources_rsync.macports.org_release_ports_devel_glib2/glib2/work/glib-2.32.2/gio'
141:info:build make[2]: *** [all] Error 2
142:info:build make[2]: Leaving directory `/opt/local/var/macports/build/_opt_local_var_macports_sources_rsync.macports.org_release_ports_devel_glib2/glib2/work/glib-2.32.2/gio'
143:info:build make[1]: *** [all-recursive] Error 1
144:info:build make[1]: Leaving directory `/opt/local/var/macports/build/_opt_local_var_macports_sources_rsync.macports.org_release_ports_devel_glib2/glib2/work/glib-2.32.2'
145:info:build make: *** [all] Error 2
146:info:build make: Leaving directory `/opt/local/var/macports/build/_opt_local_var_macports_sources_rsync.macports.org_release_ports_devel_glib2/glib2/work/glib-2.32.2'
147:info:build shell command " cd "/opt/local/var/macports/build/_opt_local_var_macports_sources_rsync.macports.org_release_ports_devel_glib2/glib2/work/glib-2.32.2" && /usr/bin/make -j4 -w all V=1 " returned error 2
148:error:build Target org.macports.build returned: shell command failed (see log for details)
149:debug:build Backtrace: shell command failed (see log for details)
150    while executing
151"command_exec build"
152    (procedure "portbuild::build_main" line 8)
153    invoked from within
154"$procedure $targetname"
155:info:build Warning: the following items did not execute (for glib2): org.macports.install org.macports.build org.macports.destroot
156:notice:build Log for glib2 is at: /opt/local/var/macports/logs/_opt_local_var_macports_sources_rsync.macports.org_release_ports_devel_glib2/glib2/main.log