Ticket #34991: main.log

File main.log, 35.5 KB (added by lucalelli, 9 years ago)

Log file of the last build, before workaround

Line 
1version:1
2:debug:main epoch: in tree: 2 installed: 2
3:debug:main netcdf 4.2.0_3 exists in the ports tree
4:debug:main netcdf 4.2.0_3 +dap+netcdf4 is the latest installed
5:debug:main netcdf 4.2.0_3 +dap+netcdf4+universal is active
6:debug:main Merging existing variants '+dap+netcdf4+universal' into variants
7:debug:main new fully merged portvariants: netcdf4 + universal + dap + system_x11 +
8:debug:main Changing to port directory: /opt/local/var/macports/sources/rsync.macports.org/release/tarballs/ports/science/netcdf
9:debug:main OS darwin/10.8.0 (Mac OS X 10.6) arch i386
10:debug:main org.macports.load registered provides 'load', a pre-existing procedure. Target override will not be provided
11:debug:main org.macports.unload registered provides 'unload', a pre-existing procedure. Target override will not be provided
12:debug:main org.macports.distfiles registered provides 'distfiles', a pre-existing procedure. Target override will not be provided
13:debug:main adding the default universal variant
14:debug:main Reading variant descriptions from /opt/local/var/macports/sources/rsync.macports.org/release/tarballs/ports/_resources/port1.0/variant_descriptions.conf
15:debug:main Requested variant +system_x11 is not provided by port netcdf.
16:debug:main Executing variant netcdf4 provides netcdf4
17:debug:main Executing variant dap provides dap
18:debug:main Executing variant universal provides universal
19:debug:main No need to upgrade! netcdf 4.2.0_3 >= netcdf 4.2.0_3
20:debug:main epoch: in tree: 0 installed: 0
21:debug:main hdf5-18 1.8.9_0 exists in the ports tree
22:debug:main hdf5-18 1.8.9_0  is the latest installed
23:debug:main hdf5-18 1.8.9_0 +universal is active
24:debug:main Merging existing variants '+universal' into variants
25:debug:main new fully merged portvariants: universal + system_x11 +
26:debug:main Changing to port directory: /opt/local/var/macports/sources/rsync.macports.org/release/tarballs/ports/science/hdf5-18
27:debug:main OS darwin/10.8.0 (Mac OS X 10.6) arch i386
28:debug:main org.macports.load registered provides 'load', a pre-existing procedure. Target override will not be provided
29:debug:main org.macports.unload registered provides 'unload', a pre-existing procedure. Target override will not be provided
30:debug:main org.macports.distfiles registered provides 'distfiles', a pre-existing procedure. Target override will not be provided
31:debug:main Using group file /opt/local/var/macports/sources/rsync.macports.org/release/tarballs/ports/_resources/port1.0/group/muniversal-1.0.tcl
32:debug:main Reading variant descriptions from /opt/local/var/macports/sources/rsync.macports.org/release/tarballs/ports/_resources/port1.0/variant_descriptions.conf
33:debug:main universal variant already exists, so not adding the default one
34:debug:main Requested variant +system_x11 is not provided by port hdf5-18.
35:debug:main Executing variant universal provides universal
36:debug:main No need to upgrade! hdf5-18 1.8.9_0 >= hdf5-18 1.8.9_0
37:debug:main epoch: in tree: 0 installed: 0
38:debug:main zlib 1.2.7_0 exists in the ports tree
39:debug:main zlib 1.2.7_0  is the latest installed
40:debug:main zlib 1.2.7_0 +universal is active
41:debug:main Merging existing variants '+universal' into variants
42:debug:main new fully merged portvariants: universal + system_x11 +
43:debug:main Changing to port directory: /opt/local/var/macports/sources/rsync.macports.org/release/tarballs/ports/archivers/zlib
44:debug:main OS darwin/10.8.0 (Mac OS X 10.6) arch i386
45:debug:main org.macports.load registered provides 'load', a pre-existing procedure. Target override will not be provided
46:debug:main org.macports.unload registered provides 'unload', a pre-existing procedure. Target override will not be provided
47:debug:main org.macports.distfiles registered provides 'distfiles', a pre-existing procedure. Target override will not be provided
48:debug:main Using group file /opt/local/var/macports/sources/rsync.macports.org/release/tarballs/ports/_resources/port1.0/group/xcodeversion-1.0.tcl
49:debug:main adding the default universal variant
50:debug:main Reading variant descriptions from /opt/local/var/macports/sources/rsync.macports.org/release/tarballs/ports/_resources/port1.0/variant_descriptions.conf
51:debug:main Requested variant +system_x11 is not provided by port zlib.
52:debug:main Executing variant universal provides universal
53:debug:main No need to upgrade! zlib 1.2.7_0 >= zlib 1.2.7_0
54:debug:main epoch: in tree: 0 installed: 0
55:debug:main curl 7.26.0_0 exists in the ports tree
56:debug:main curl 7.26.0_0 +ssl is the latest installed
57:debug:main curl 7.26.0_0 +ssl+universal is active
58:debug:main Merging existing variants '+ssl+universal' into variants
59:debug:main new fully merged portvariants: universal + system_x11 + ssl +
60:debug:main Changing to port directory: /opt/local/var/macports/sources/rsync.macports.org/release/tarballs/ports/net/curl
61:debug:main OS darwin/10.8.0 (Mac OS X 10.6) arch i386
62:debug:main org.macports.load registered provides 'load', a pre-existing procedure. Target override will not be provided
63:debug:main org.macports.unload registered provides 'unload', a pre-existing procedure. Target override will not be provided
64:debug:main org.macports.distfiles registered provides 'distfiles', a pre-existing procedure. Target override will not be provided
65:debug:main Using group file /opt/local/var/macports/sources/rsync.macports.org/release/tarballs/ports/_resources/port1.0/group/muniversal-1.0.tcl
66:debug:main Reading variant descriptions from /opt/local/var/macports/sources/rsync.macports.org/release/tarballs/ports/_resources/port1.0/variant_descriptions.conf
67:debug:main Using group file /opt/local/var/macports/sources/rsync.macports.org/release/tarballs/ports/_resources/port1.0/group/archcheck-1.0.tcl
68:debug:main universal variant already exists, so not adding the default one
69:debug:main Requested variant +system_x11 is not provided by port curl.
70:debug:main Executing variant universal provides universal
71:debug:main Executing variant ssl provides ssl
72:debug:main No need to upgrade! curl 7.26.0_0 >= curl 7.26.0_0
73:debug:main epoch: in tree: 0 installed: 0
74:debug:main libidn 1.25_0 exists in the ports tree
75:debug:main libidn 1.25_0  is the latest installed
76:debug:main libidn 1.25_0 +universal is active
77:debug:main Merging existing variants '+universal' into variants
78:debug:main new fully merged portvariants: universal + system_x11 +
79:debug:main Changing to port directory: /opt/local/var/macports/sources/rsync.macports.org/release/tarballs/ports/mail/libidn
80:debug:main OS darwin/10.8.0 (Mac OS X 10.6) arch i386
81:debug:main org.macports.load registered provides 'load', a pre-existing procedure. Target override will not be provided
82:debug:main org.macports.unload registered provides 'unload', a pre-existing procedure. Target override will not be provided
83:debug:main org.macports.distfiles registered provides 'distfiles', a pre-existing procedure. Target override will not be provided
84:debug:main adding the default universal variant
85:debug:main Reading variant descriptions from /opt/local/var/macports/sources/rsync.macports.org/release/tarballs/ports/_resources/port1.0/variant_descriptions.conf
86:debug:main Requested variant +system_x11 is not provided by port libidn.
87:debug:main Executing variant universal provides universal
88:debug:main No need to upgrade! libidn 1.25_0 >= libidn 1.25_0
89:debug:main epoch: in tree: 0 installed: 0
90:debug:main libiconv 1.14_0 exists in the ports tree
91:debug:main libiconv 1.14_0  is the latest installed
92:debug:main libiconv 1.14_0 +universal is active
93:debug:main Merging existing variants '+universal' into variants
94:debug:main new fully merged portvariants: universal + system_x11 +
95:debug:main Changing to port directory: /opt/local/var/macports/sources/rsync.macports.org/release/tarballs/ports/textproc/libiconv
96:debug:main OS darwin/10.8.0 (Mac OS X 10.6) arch i386
97:debug:main org.macports.load registered provides 'load', a pre-existing procedure. Target override will not be provided
98:debug:main org.macports.unload registered provides 'unload', a pre-existing procedure. Target override will not be provided
99:debug:main org.macports.distfiles registered provides 'distfiles', a pre-existing procedure. Target override will not be provided
100:debug:main Using group file /opt/local/var/macports/sources/rsync.macports.org/release/tarballs/ports/_resources/port1.0/group/muniversal-1.0.tcl
101:debug:main Reading variant descriptions from /opt/local/var/macports/sources/rsync.macports.org/release/tarballs/ports/_resources/port1.0/variant_descriptions.conf
102:debug:main universal variant already exists, so not adding the default one
103:debug:main Requested variant +system_x11 is not provided by port libiconv.
104:debug:main Executing variant universal provides universal
105:debug:main No need to upgrade! libiconv 1.14_0 >= libiconv 1.14_0
106:debug:main epoch: in tree: 0 installed: 0
107:debug:main gettext 0.18.1.1_2 exists in the ports tree
108:debug:main gettext 0.18.1.1_2  is the latest installed
109:debug:main gettext 0.18.1.1_2 +universal is active
110:debug:main Merging existing variants '+universal' into variants
111:debug:main new fully merged portvariants: universal + system_x11 +
112:debug:main Changing to port directory: /opt/local/var/macports/sources/rsync.macports.org/release/tarballs/ports/devel/gettext
113:debug:main OS darwin/10.8.0 (Mac OS X 10.6) arch i386
114:debug:main org.macports.load registered provides 'load', a pre-existing procedure. Target override will not be provided
115:debug:main org.macports.unload registered provides 'unload', a pre-existing procedure. Target override will not be provided
116:debug:main org.macports.distfiles registered provides 'distfiles', a pre-existing procedure. Target override will not be provided
117:debug:main Using group file /opt/local/var/macports/sources/rsync.macports.org/release/tarballs/ports/_resources/port1.0/group/muniversal-1.0.tcl
118:debug:main Reading variant descriptions from /opt/local/var/macports/sources/rsync.macports.org/release/tarballs/ports/_resources/port1.0/variant_descriptions.conf
119:debug:main Using group file /opt/local/var/macports/sources/rsync.macports.org/release/tarballs/ports/_resources/port1.0/group/archcheck-1.0.tcl
120:debug:main universal variant already exists, so not adding the default one
121:debug:main Requested variant +system_x11 is not provided by port gettext.
122:debug:main Executing variant universal provides universal
123:debug:main No need to upgrade! gettext 0.18.1.1_2 >= gettext 0.18.1.1_2
124:debug:main epoch: in tree: 0 installed: 0
125:debug:main ncurses 5.9_1 exists in the ports tree
126:debug:main ncurses 5.9_1  is the latest installed
127:debug:main ncurses 5.9_1 +universal is active
128:debug:main Merging existing variants '+universal' into variants
129:debug:main new fully merged portvariants: universal + system_x11 +
130:debug:main Changing to port directory: /opt/local/var/macports/sources/rsync.macports.org/release/tarballs/ports/devel/ncurses
131:debug:main OS darwin/10.8.0 (Mac OS X 10.6) arch i386
132:debug:main org.macports.load registered provides 'load', a pre-existing procedure. Target override will not be provided
133:debug:main org.macports.unload registered provides 'unload', a pre-existing procedure. Target override will not be provided
134:debug:main org.macports.distfiles registered provides 'distfiles', a pre-existing procedure. Target override will not be provided
135:debug:main adding the default universal variant
136:debug:main Reading variant descriptions from /opt/local/var/macports/sources/rsync.macports.org/release/tarballs/ports/_resources/port1.0/variant_descriptions.conf
137:debug:main Requested variant +system_x11 is not provided by port ncurses.
138:debug:main Executing variant universal provides universal
139:debug:main No need to upgrade! ncurses 5.9_1 >= ncurses 5.9_1
140:debug:main epoch: in tree: 0 installed: 0
141:debug:main expat 2.1.0_0 exists in the ports tree
142:debug:main expat 2.1.0_0  is the latest installed
143:debug:main expat 2.1.0_0 +universal is active
144:debug:main Merging existing variants '+universal' into variants
145:debug:main new fully merged portvariants: universal + system_x11 +
146:debug:main Changing to port directory: /opt/local/var/macports/sources/rsync.macports.org/release/tarballs/ports/textproc/expat
147:debug:main OS darwin/10.8.0 (Mac OS X 10.6) arch i386
148:debug:main org.macports.load registered provides 'load', a pre-existing procedure. Target override will not be provided
149:debug:main org.macports.unload registered provides 'unload', a pre-existing procedure. Target override will not be provided
150:debug:main org.macports.distfiles registered provides 'distfiles', a pre-existing procedure. Target override will not be provided
151:debug:main adding the default universal variant
152:debug:main Reading variant descriptions from /opt/local/var/macports/sources/rsync.macports.org/release/tarballs/ports/_resources/port1.0/variant_descriptions.conf
153:debug:main Requested variant +system_x11 is not provided by port expat.
154:debug:main Executing variant universal provides universal
155:debug:main No need to upgrade! expat 2.1.0_0 >= expat 2.1.0_0
156:debug:main epoch: in tree: 1 installed: 1
157:debug:main openssl 1.0.1c_0 exists in the ports tree
158:debug:main openssl 1.0.1c_0  is the latest installed
159:debug:main openssl 1.0.1c_0 +universal is active
160:debug:main Merging existing variants '+universal' into variants
161:debug:main new fully merged portvariants: universal + system_x11 +
162:debug:main Changing to port directory: /opt/local/var/macports/sources/rsync.macports.org/release/tarballs/ports/devel/openssl
163:debug:main OS darwin/10.8.0 (Mac OS X 10.6) arch i386
164:debug:main org.macports.load registered provides 'load', a pre-existing procedure. Target override will not be provided
165:debug:main org.macports.unload registered provides 'unload', a pre-existing procedure. Target override will not be provided
166:debug:main org.macports.distfiles registered provides 'distfiles', a pre-existing procedure. Target override will not be provided
167:debug:main Using group file /opt/local/var/macports/sources/rsync.macports.org/release/tarballs/ports/_resources/port1.0/group/muniversal-1.0.tcl
168:debug:main Reading variant descriptions from /opt/local/var/macports/sources/rsync.macports.org/release/tarballs/ports/_resources/port1.0/variant_descriptions.conf
169:debug:main universal variant already exists, so not adding the default one
170:debug:main Requested variant +system_x11 is not provided by port openssl.
171:debug:main Executing variant universal provides universal
172:debug:main No need to upgrade! openssl 1.0.1c_0 >= openssl 1.0.1c_0
173:debug:main epoch: in tree: 0 installed: 0
174:debug:main curl-ca-bundle 7.26.0_0 exists in the ports tree
175:debug:main curl-ca-bundle 7.26.0_0  is the latest installed
176:debug:main curl-ca-bundle 7.26.0_0  is active
177:debug:main Merging existing variants '' into variants
178:debug:main new fully merged portvariants: system_x11 +
179:debug:main Changing to port directory: /opt/local/var/macports/sources/rsync.macports.org/release/tarballs/ports/net/curl-ca-bundle
180:debug:main OS darwin/10.8.0 (Mac OS X 10.6) arch i386
181:debug:main org.macports.load registered provides 'load', a pre-existing procedure. Target override will not be provided
182:debug:main org.macports.unload registered provides 'unload', a pre-existing procedure. Target override will not be provided
183:debug:main org.macports.distfiles registered provides 'distfiles', a pre-existing procedure. Target override will not be provided
184:debug:main universal_variant is false, so not adding the default universal variant
185:debug:main Requested variant +system_x11 is not provided by port curl-ca-bundle.
186:debug:main No need to upgrade! curl-ca-bundle 7.26.0_0 >= curl-ca-bundle 7.26.0_0
187:debug:main epoch: in tree: 0 installed: 0
188:debug:main proj 4.8.0_0 exists in the ports tree
189:debug:main proj 4.8.0_0  is the latest installed
190:debug:main proj 4.8.0_0 +universal is active
191:debug:main Merging existing variants '+universal' into variants
192:debug:main new fully merged portvariants: universal + system_x11 +
193:debug:main Changing to port directory: /opt/local/var/macports/sources/rsync.macports.org/release/tarballs/ports/gis/proj
194:debug:main OS darwin/10.8.0 (Mac OS X 10.6) arch i386
195:debug:main org.macports.load registered provides 'load', a pre-existing procedure. Target override will not be provided
196:debug:main org.macports.unload registered provides 'unload', a pre-existing procedure. Target override will not be provided
197:debug:main org.macports.distfiles registered provides 'distfiles', a pre-existing procedure. Target override will not be provided
198:debug:main adding the default universal variant
199:debug:main Reading variant descriptions from /opt/local/var/macports/sources/rsync.macports.org/release/tarballs/ports/_resources/port1.0/variant_descriptions.conf
200:debug:main Requested variant +system_x11 is not provided by port proj.
201:debug:main Executing variant universal provides universal
202:debug:main No need to upgrade! proj 4.8.0_0 >= proj 4.8.0_0
203:debug:main epoch: in tree: 0 installed: 0
204:debug:main grib_api 1.9.9_2 exists in the ports tree
205:debug:main grib_api 1.9.9_2  is the latest installed
206:debug:main grib_api 1.9.9_2  is active
207:debug:main Merging existing variants '' into variants
208:debug:main new fully merged portvariants: system_x11 +
209:debug:main Changing to port directory: /opt/local/var/macports/sources/rsync.macports.org/release/tarballs/ports/science/grib_api
210:debug:main OS darwin/10.8.0 (Mac OS X 10.6) arch i386
211:debug:main org.macports.load registered provides 'load', a pre-existing procedure. Target override will not be provided
212:debug:main org.macports.unload registered provides 'unload', a pre-existing procedure. Target override will not be provided
213:debug:main org.macports.distfiles registered provides 'distfiles', a pre-existing procedure. Target override will not be provided
214:debug:main adding the default universal variant
215:debug:main Reading variant descriptions from /opt/local/var/macports/sources/rsync.macports.org/release/tarballs/ports/_resources/port1.0/variant_descriptions.conf
216:debug:main Requested variant +system_x11 is not provided by port grib_api.
217:debug:main No need to upgrade! grib_api 1.9.9_2 >= grib_api 1.9.9_2
218:debug:main epoch: in tree: 0 installed: 0
219:debug:main jasper 1.900.1_9 exists in the ports tree
220:debug:main jasper 1.900.1_9  is the latest installed
221:debug:main jasper 1.900.1_9  is active
222:debug:main Merging existing variants '' into variants
223:debug:main new fully merged portvariants: system_x11 +
224:debug:main Changing to port directory: /opt/local/var/macports/sources/rsync.macports.org/release/tarballs/ports/graphics/jasper
225:debug:main OS darwin/10.8.0 (Mac OS X 10.6) arch i386
226:debug:main org.macports.load registered provides 'load', a pre-existing procedure. Target override will not be provided
227:debug:main org.macports.unload registered provides 'unload', a pre-existing procedure. Target override will not be provided
228:debug:main org.macports.distfiles registered provides 'distfiles', a pre-existing procedure. Target override will not be provided
229:debug:main adding the default universal variant
230:debug:main Reading variant descriptions from /opt/local/var/macports/sources/rsync.macports.org/release/tarballs/ports/_resources/port1.0/variant_descriptions.conf
231:debug:main Requested variant +system_x11 is not provided by port jasper.
232:debug:main No need to upgrade! jasper 1.900.1_9 >= jasper 1.900.1_9
233:debug:main epoch: in tree: 0 installed: 0
234:debug:main jpeg 8d_0 exists in the ports tree
235:debug:main jpeg 8d_0  is the latest installed
236:debug:main jpeg 8d_0  is active
237:debug:main Merging existing variants '' into variants
238:debug:main new fully merged portvariants: system_x11 +
239:debug:main Changing to port directory: /opt/local/var/macports/sources/rsync.macports.org/release/tarballs/ports/graphics/jpeg
240:debug:main OS darwin/10.8.0 (Mac OS X 10.6) arch i386
241:debug:main org.macports.load registered provides 'load', a pre-existing procedure. Target override will not be provided
242:debug:main org.macports.unload registered provides 'unload', a pre-existing procedure. Target override will not be provided
243:debug:main org.macports.distfiles registered provides 'distfiles', a pre-existing procedure. Target override will not be provided
244:debug:main adding the default universal variant
245:debug:main Reading variant descriptions from /opt/local/var/macports/sources/rsync.macports.org/release/tarballs/ports/_resources/port1.0/variant_descriptions.conf
246:debug:main Requested variant +system_x11 is not provided by port jpeg.
247:debug:main No need to upgrade! jpeg 8d_0 >= jpeg 8d_0
248:debug:main epoch: in tree: 0 installed: 0
249:debug:main openjpeg 1.5.0_1 exists in the ports tree
250:debug:main openjpeg 1.5.0_1  is the latest installed
251:debug:main openjpeg 1.5.0_1  is active
252:debug:main Merging existing variants '' into variants
253:debug:main new fully merged portvariants: system_x11 +
254:debug:main Changing to port directory: /opt/local/var/macports/sources/rsync.macports.org/release/tarballs/ports/graphics/openjpeg
255:debug:main OS darwin/10.8.0 (Mac OS X 10.6) arch i386
256:debug:main org.macports.load registered provides 'load', a pre-existing procedure. Target override will not be provided
257:debug:main org.macports.unload registered provides 'unload', a pre-existing procedure. Target override will not be provided
258:debug:main org.macports.distfiles registered provides 'distfiles', a pre-existing procedure. Target override will not be provided
259:debug:main adding the default universal variant
260:debug:main Reading variant descriptions from /opt/local/var/macports/sources/rsync.macports.org/release/tarballs/ports/_resources/port1.0/variant_descriptions.conf
261:debug:main Requested variant +system_x11 is not provided by port openjpeg.
262:debug:main No need to upgrade! openjpeg 1.5.0_1 >= openjpeg 1.5.0_1
263:debug:main epoch: in tree: 0 installed: 0
264:debug:main libpng 1.4.11_0 exists in the ports tree
265:debug:main libpng 1.4.11_0  is the latest installed
266:debug:main libpng 1.4.11_0  is active
267:debug:main Merging existing variants '' into variants
268:debug:main new fully merged portvariants: system_x11 +
269:debug:main Changing to port directory: /opt/local/var/macports/sources/rsync.macports.org/release/tarballs/ports/graphics/libpng
270:debug:main OS darwin/10.8.0 (Mac OS X 10.6) arch i386
271:debug:main org.macports.load registered provides 'load', a pre-existing procedure. Target override will not be provided
272:debug:main org.macports.unload registered provides 'unload', a pre-existing procedure. Target override will not be provided
273:debug:main org.macports.distfiles registered provides 'distfiles', a pre-existing procedure. Target override will not be provided
274:debug:main Using group file /opt/local/var/macports/sources/rsync.macports.org/release/tarballs/ports/_resources/port1.0/group/archcheck-1.0.tcl
275:debug:main adding the default universal variant
276:debug:main Reading variant descriptions from /opt/local/var/macports/sources/rsync.macports.org/release/tarballs/ports/_resources/port1.0/variant_descriptions.conf
277:debug:main Requested variant +system_x11 is not provided by port libpng.
278:debug:main No need to upgrade! libpng 1.4.11_0 >= libpng 1.4.11_0
279:debug:main epoch: in tree: 0 installed: 0
280:debug:main tiff 3.9.5_0 exists in the ports tree
281:debug:main tiff 3.9.5_0  is the latest installed
282:debug:main tiff 3.9.5_0  is active
283:debug:main Merging existing variants '' into variants
284:debug:main new fully merged portvariants: system_x11 +
285:debug:main Changing to port directory: /opt/local/var/macports/sources/rsync.macports.org/release/tarballs/ports/graphics/tiff
286:debug:main OS darwin/10.8.0 (Mac OS X 10.6) arch i386
287:debug:main org.macports.load registered provides 'load', a pre-existing procedure. Target override will not be provided
288:debug:main org.macports.unload registered provides 'unload', a pre-existing procedure. Target override will not be provided
289:debug:main org.macports.distfiles registered provides 'distfiles', a pre-existing procedure. Target override will not be provided
290:debug:main Using group file /opt/local/var/macports/sources/rsync.macports.org/release/tarballs/ports/_resources/port1.0/group/xcodeversion-1.0.tcl
291:debug:main adding the default universal variant
292:debug:main Reading variant descriptions from /opt/local/var/macports/sources/rsync.macports.org/release/tarballs/ports/_resources/port1.0/variant_descriptions.conf
293:debug:main Requested variant +system_x11 is not provided by port tiff.
294:debug:main No need to upgrade! tiff 3.9.5_0 >= tiff 3.9.5_0
295:debug:main epoch: in tree: 0 installed: 0
296:debug:main lcms2 2.3_0 exists in the ports tree
297:debug:main lcms2 2.3_0  is the latest installed
298:debug:main lcms2 2.3_0  is active
299:debug:main Merging existing variants '' into variants
300:debug:main new fully merged portvariants: system_x11 +
301:debug:main Changing to port directory: /opt/local/var/macports/sources/rsync.macports.org/release/tarballs/ports/graphics/lcms2
302:debug:main OS darwin/10.8.0 (Mac OS X 10.6) arch i386
303:debug:main org.macports.load registered provides 'load', a pre-existing procedure. Target override will not be provided
304:debug:main org.macports.unload registered provides 'unload', a pre-existing procedure. Target override will not be provided
305:debug:main org.macports.distfiles registered provides 'distfiles', a pre-existing procedure. Target override will not be provided
306:debug:main Using group file /opt/local/var/macports/sources/rsync.macports.org/release/tarballs/ports/_resources/port1.0/group/muniversal-1.0.tcl
307:debug:main Reading variant descriptions from /opt/local/var/macports/sources/rsync.macports.org/release/tarballs/ports/_resources/port1.0/variant_descriptions.conf
308:debug:main universal variant already exists, so not adding the default one
309:debug:main Requested variant +system_x11 is not provided by port lcms2.
310:debug:main No need to upgrade! lcms2 2.3_0 >= lcms2 2.3_0
311:debug:main epoch: in tree: 0 installed: 0
312:debug:main jbigkit 2.0_2 exists in the ports tree
313:debug:main jbigkit 2.0_2  is the latest installed
314:debug:main jbigkit 2.0_2  is active
315:debug:main Merging existing variants '' into variants
316:debug:main new fully merged portvariants: system_x11 +
317:debug:main Changing to port directory: /opt/local/var/macports/sources/rsync.macports.org/release/tarballs/ports/graphics/jbigkit
318:debug:main OS darwin/10.8.0 (Mac OS X 10.6) arch i386
319:debug:main org.macports.load registered provides 'load', a pre-existing procedure. Target override will not be provided
320:debug:main org.macports.unload registered provides 'unload', a pre-existing procedure. Target override will not be provided
321:debug:main org.macports.distfiles registered provides 'distfiles', a pre-existing procedure. Target override will not be provided
322:debug:main adding the default universal variant
323:debug:main Reading variant descriptions from /opt/local/var/macports/sources/rsync.macports.org/release/tarballs/ports/_resources/port1.0/variant_descriptions.conf
324:debug:main Requested variant +system_x11 is not provided by port jbigkit.
325:debug:main No need to upgrade! jbigkit 2.0_2 >= jbigkit 2.0_2
326:msg:main --->  Computing dependencies for cdo:info:main .:debug:main cdo has no conflicts
327:debug:main Searching for dependency: netcdf
328:debug:main Found Dependency: receipt exists for netcdf
329:debug:main Searching for dependency: proj
330:debug:main Found Dependency: receipt exists for proj
331:debug:main Searching for dependency: grib_api
332:debug:main Found Dependency: receipt exists for grib_api
333:msg:main
334:debug:main Executing org.macports.main (cdo)
335:debug:main changing euid/egid - current euid: 0 - current egid: 0
336:debug:main egid changed to: 501
337:debug:main euid changed to: 502
338:debug:main Skipping completed org.macports.archivefetch (cdo)
339:debug:main Privilege de-escalation not attempted as not running as root.
340:debug:main Skipping completed org.macports.fetch (cdo)
341:debug:main Privilege de-escalation not attempted as not running as root.
342:debug:main Skipping completed org.macports.checksum (cdo)
343:debug:main Privilege de-escalation not attempted as not running as root.
344:debug:main Skipping completed org.macports.extract (cdo)
345:debug:main Privilege de-escalation not attempted as not running as root.
346:debug:main Skipping completed org.macports.patch (cdo)
347:debug:main Privilege de-escalation not attempted as not running as root.
348:debug:main Skipping completed org.macports.configure (cdo)
349:debug:main Privilege de-escalation not attempted as not running as root.
350:debug:build build phase started at Wed Jun 27 00:46:19 CEST 2012
351:notice:build --->  Building cdo
352:debug:build Executing org.macports.build (cdo)
353:debug:build Environment: CPATH='/opt/local/include' CC_PRINT_OPTIONS_FILE='/opt/local/var/macports/build/_Users_luca_cdo/cdo/work/.CC_PRINT_OPTIONS' LIBRARY_PATH='/opt/local/lib' CC_PRINT_OPTIONS='YES' MACOSX_DEPLOYMENT_TARGET='10.6'
354:debug:build Assembled command: 'cd "/opt/local/var/macports/build/_Users_luca_cdo/cdo/work/cdo-1.5.3" && /usr/bin/make -j2 -w all'
355:debug:build Executing command line:  cd "/opt/local/var/macports/build/_Users_luca_cdo/cdo/work/cdo-1.5.3" && /usr/bin/make -j2 -w all
356:info:build make: Entering directory `/opt/local/var/macports/build/_Users_luca_cdo/cdo/work/cdo-1.5.3'
357:info:build Making all in libcdi
358:info:build make[1]: Entering directory `/opt/local/var/macports/build/_Users_luca_cdo/cdo/work/cdo-1.5.3/libcdi'
359:info:build Making all in src
360:info:build make[2]: Entering directory `/opt/local/var/macports/build/_Users_luca_cdo/cdo/work/cdo-1.5.3/libcdi/src'
361:info:build /usr/bin/make  all-am
362:info:build make[3]: Entering directory `/opt/local/var/macports/build/_Users_luca_cdo/cdo/work/cdo-1.5.3/libcdi/src'
363:info:build make[3]: Nothing to be done for `all-am'.
364:info:build make[3]: Leaving directory `/opt/local/var/macports/build/_Users_luca_cdo/cdo/work/cdo-1.5.3/libcdi/src'
365:info:build make[2]: Leaving directory `/opt/local/var/macports/build/_Users_luca_cdo/cdo/work/cdo-1.5.3/libcdi/src'
366:info:build Making all in interfaces
367:info:build make[2]: Entering directory `/opt/local/var/macports/build/_Users_luca_cdo/cdo/work/cdo-1.5.3/libcdi/interfaces'
368:info:build make[2]: Nothing to be done for `all'.
369:info:build make[2]: Leaving directory `/opt/local/var/macports/build/_Users_luca_cdo/cdo/work/cdo-1.5.3/libcdi/interfaces'
370:info:build Making all in app
371:info:build make[2]: Entering directory `/opt/local/var/macports/build/_Users_luca_cdo/cdo/work/cdo-1.5.3/libcdi/app'
372:info:build make[2]: Nothing to be done for `all'.
373:info:build make[2]: Leaving directory `/opt/local/var/macports/build/_Users_luca_cdo/cdo/work/cdo-1.5.3/libcdi/app'
374:info:build Making all in examples
375:info:build make[2]: Entering directory `/opt/local/var/macports/build/_Users_luca_cdo/cdo/work/cdo-1.5.3/libcdi/examples'
376:info:build make[2]: Nothing to be done for `all'.
377:info:build make[2]: Leaving directory `/opt/local/var/macports/build/_Users_luca_cdo/cdo/work/cdo-1.5.3/libcdi/examples'
378:info:build Making all in tests
379:info:build make[2]: Entering directory `/opt/local/var/macports/build/_Users_luca_cdo/cdo/work/cdo-1.5.3/libcdi/tests'
380:info:build make[2]: Nothing to be done for `all'.
381:info:build make[2]: Leaving directory `/opt/local/var/macports/build/_Users_luca_cdo/cdo/work/cdo-1.5.3/libcdi/tests'
382:info:build make[2]: Entering directory `/opt/local/var/macports/build/_Users_luca_cdo/cdo/work/cdo-1.5.3/libcdi'
383:info:build make[2]: Nothing to be done for `all-am'.
384:info:build make[2]: Leaving directory `/opt/local/var/macports/build/_Users_luca_cdo/cdo/work/cdo-1.5.3/libcdi'
385:info:build make[1]: Leaving directory `/opt/local/var/macports/build/_Users_luca_cdo/cdo/work/cdo-1.5.3/libcdi'
386:info:build Making all in src
387:info:build make[1]: Entering directory `/opt/local/var/macports/build/_Users_luca_cdo/cdo/work/cdo-1.5.3/src'
388:info:build /usr/bin/make  all-am
389:info:build make[2]: Entering directory `/opt/local/var/macports/build/_Users_luca_cdo/cdo/work/cdo-1.5.3/src'
390:info:build /usr/bin/gcc-4.2 -std=gnu99 -DHAVE_CONFIG_H -I.  -I../libcdi/src -I/opt/local/include -I/opt/local/include -I/opt/local/include -I/opt/local/include -I/opt/local/include -I/opt/local/include -I/opt/local/include -I/opt/local/include  -pipe -O2 -arch x86_64 -D_THREAD_SAFE -pthread -c -o cdo-grid.o `test -f 'grid.c' || echo './'`grid.c
391:info:build /usr/bin/gcc-4.2 -std=gnu99 -DHAVE_CONFIG_H -I.  -I../libcdi/src -I/opt/local/include -I/opt/local/include -I/opt/local/include -I/opt/local/include -I/opt/local/include -I/opt/local/include -I/opt/local/include -I/opt/local/include  -pipe -O2 -arch x86_64 -D_THREAD_SAFE -pthread -c -o cdo-grid_gme.o `test -f 'grid_gme.c' || echo './'`grid_gme.c
392:info:build grid.c:25:24: error: projects.h: No such file or directory
393:info:build grid.c: In function ‘sinusoidal_to_geo’:
394:info:build grid.c:357: error: ‘PJ’ undeclared (first use in this function)
395:info:build grid.c:357: error: (Each undeclared identifier is reported only once
396:info:build grid.c:357: error: for each function it appears in.)
397:info:build grid.c:357: error: ‘libProj’ undeclared (first use in this function)
398:info:build grid.c:360: error: ‘projUV’ undeclared (first use in this function)
399:info:build grid.c:360: error: expected ‘;’ before ‘data’
400:info:build grid.c:371: warning: implicit declaration of function ‘pj_init’
401:info:build grid.c:373: warning: implicit declaration of function ‘pj_strerrno’
402:info:build grid.c:373: error: ‘pj_errno’ undeclared (first use in this function)
403:info:build grid.c:379: error: ‘data’ undeclared (first use in this function)
404:info:build grid.c:381: error: ‘res’ undeclared (first use in this function)
405:info:build grid.c:381: warning: implicit declaration of function ‘pj_inv’
406:info:build grid.c: In function ‘laea_to_geo’:
407:info:build grid.c:394: error: ‘PJ’ undeclared (first use in this function)
408:info:build grid.c:394: error: ‘libProj’ undeclared (first use in this function)
409:info:build grid.c:397: error: ‘projUV’ undeclared (first use in this function)
410:info:build grid.c:397: error: expected ‘;’ before ‘data’
411:info:build grid.c:415: error: ‘pj_errno’ undeclared (first use in this function)
412:info:build grid.c:423: error: ‘data’ undeclared (first use in this function)
413:info:build grid.c:425: error: ‘res’ undeclared (first use in this function)
414:info:build grid.c: In function ‘lcc2_to_geo’:
415:info:build grid.c:438: error: ‘PJ’ undeclared (first use in this function)
416:info:build grid.c:438: error: ‘libProj’ undeclared (first use in this function)
417:info:build grid.c:441: error: ‘projUV’ undeclared (first use in this function)
418:info:build grid.c:441: error: expected ‘;’ before ‘data’
419:info:build grid.c:461: error: ‘pj_errno’ undeclared (first use in this function)
420:info:build grid.c:469: error: ‘data’ undeclared (first use in this function)
421:info:build grid.c:471: error: ‘res’ undeclared (first use in this function)
422:info:build make[2]: *** [cdo-grid.o] Error 1
423:info:build make[2]: *** Waiting for unfinished jobs....
424:info:build make[2]: Leaving directory `/opt/local/var/macports/build/_Users_luca_cdo/cdo/work/cdo-1.5.3/src'
425:info:build make[1]: *** [all] Error 2
426:info:build make[1]: Leaving directory `/opt/local/var/macports/build/_Users_luca_cdo/cdo/work/cdo-1.5.3/src'
427:info:build make: *** [all-recursive] Error 1
428:info:build make: Leaving directory `/opt/local/var/macports/build/_Users_luca_cdo/cdo/work/cdo-1.5.3'
429:info:build Command failed:  cd "/opt/local/var/macports/build/_Users_luca_cdo/cdo/work/cdo-1.5.3" && /usr/bin/make -j2 -w all
430:info:build Exit code: 2
431:error:build org.macports.build for port cdo returned: command execution failed
432:debug:build Error code: CHILDSTATUS 91452 2
433:debug:build Backtrace: command execution failed
434    while executing
435"system -nice 0 $fullcmdstring"
436    ("eval" body line 1)
437    invoked from within
438"eval system $notty $nice \$fullcmdstring"
439    invoked from within
440"command_exec build"
441    (procedure "portbuild::build_main" line 8)
442    invoked from within
443"$procedure $targetname"
444:info:build Warning: targets not executed for cdo: org.macports.activate org.macports.build org.macports.destroot org.macports.install
445:notice:build Please see the log file for port cdo for details:
446    /opt/local/var/macports/logs/_Users_luca_cdo/cdo/main.log