Ticket #35506: main.log

File main.log, 44.7 KB (added by sahaimic@…, 8 years ago)

Log file

Line 
1version:1
2:debug:main epoch: in tree: 0 installed: 0
3:debug:main pkgconfig 0.27_0 exists in the ports tree
4:debug:main pkgconfig 0.27_0  is the latest installed
5:debug:main pkgconfig 0.27_0  is active
6:debug:main Merging existing variants '' into variants
7:debug:main new fully merged portvariants:
8:debug:main Changing to port directory: /opt/local/var/macports/sources/rsync.macports.org/release/tarballs/ports/devel/pkgconfig
9:debug:main OS darwin/10.8.0 (Mac OS X 10.6) arch i386
10:debug:main org.macports.load registered provides 'load', a pre-existing procedure. Target override will not be provided
11:debug:main org.macports.unload registered provides 'unload', a pre-existing procedure. Target override will not be provided
12:debug:main org.macports.distfiles registered provides 'distfiles', a pre-existing procedure. Target override will not be provided
13:debug:main adding the default universal variant
14:debug:main Reading variant descriptions from /opt/local/var/macports/sources/rsync.macports.org/release/tarballs/ports/_resources/port1.0/variant_descriptions.conf
15:debug:main No need to upgrade! pkgconfig 0.27_0 >= pkgconfig 0.27_0
16:debug:main epoch: in tree: 0 installed: 0
17:debug:main glib2 2.32.4_0 exists in the ports tree
18:debug:main glib2 2.32.4_0  is the latest installed
19:debug:main glib2 2.32.4_0  is active
20:debug:main Merging existing variants '' into variants
21:debug:main new fully merged portvariants:
22:debug:main Changing to port directory: /opt/local/var/macports/sources/rsync.macports.org/release/tarballs/ports/devel/glib2
23:debug:main OS darwin/10.8.0 (Mac OS X 10.6) arch i386
24:debug:main org.macports.load registered provides 'load', a pre-existing procedure. Target override will not be provided
25:debug:main org.macports.unload registered provides 'unload', a pre-existing procedure. Target override will not be provided
26:debug:main org.macports.distfiles registered provides 'distfiles', a pre-existing procedure. Target override will not be provided
27:debug:main Using group file /opt/local/var/macports/sources/rsync.macports.org/release/tarballs/ports/_resources/port1.0/group/archcheck-1.0.tcl
28:debug:main adding the default universal variant
29:debug:main Reading variant descriptions from /opt/local/var/macports/sources/rsync.macports.org/release/tarballs/ports/_resources/port1.0/variant_descriptions.conf
30:debug:main No need to upgrade! glib2 2.32.4_0 >= glib2 2.32.4_0
31:debug:main epoch: in tree: 0 installed: 0
32:debug:main gettext 0.18.1.1_2 exists in the ports tree
33:debug:main gettext 0.18.1.1_2  is the latest installed
34:debug:main gettext 0.18.1.1_2  is active
35:debug:main Merging existing variants '' into variants
36:debug:main new fully merged portvariants:
37:debug:main Changing to port directory: /opt/local/var/macports/sources/rsync.macports.org/release/tarballs/ports/devel/gettext
38:debug:main OS darwin/10.8.0 (Mac OS X 10.6) arch i386
39:debug:main org.macports.load registered provides 'load', a pre-existing procedure. Target override will not be provided
40:debug:main org.macports.unload registered provides 'unload', a pre-existing procedure. Target override will not be provided
41:debug:main org.macports.distfiles registered provides 'distfiles', a pre-existing procedure. Target override will not be provided
42:debug:main Using group file /opt/local/var/macports/sources/rsync.macports.org/release/tarballs/ports/_resources/port1.0/group/muniversal-1.0.tcl
43:debug:main Reading variant descriptions from /opt/local/var/macports/sources/rsync.macports.org/release/tarballs/ports/_resources/port1.0/variant_descriptions.conf
44:debug:main Using group file /opt/local/var/macports/sources/rsync.macports.org/release/tarballs/ports/_resources/port1.0/group/archcheck-1.0.tcl
45:debug:main universal variant already exists, so not adding the default one
46:debug:main No need to upgrade! gettext 0.18.1.1_2 >= gettext 0.18.1.1_2
47:debug:main epoch: in tree: 0 installed: 0
48:debug:main libiconv 1.14_0 exists in the ports tree
49:debug:main libiconv 1.14_0  is the latest installed
50:debug:main libiconv 1.14_0  is active
51:debug:main Merging existing variants '' into variants
52:debug:main new fully merged portvariants:
53:debug:main Changing to port directory: /opt/local/var/macports/sources/rsync.macports.org/release/tarballs/ports/textproc/libiconv
54:debug:main OS darwin/10.8.0 (Mac OS X 10.6) arch i386
55:debug:main org.macports.load registered provides 'load', a pre-existing procedure. Target override will not be provided
56:debug:main org.macports.unload registered provides 'unload', a pre-existing procedure. Target override will not be provided
57:debug:main org.macports.distfiles registered provides 'distfiles', a pre-existing procedure. Target override will not be provided
58:debug:main Using group file /opt/local/var/macports/sources/rsync.macports.org/release/tarballs/ports/_resources/port1.0/group/muniversal-1.0.tcl
59:debug:main Reading variant descriptions from /opt/local/var/macports/sources/rsync.macports.org/release/tarballs/ports/_resources/port1.0/variant_descriptions.conf
60:debug:main universal variant already exists, so not adding the default one
61:debug:main No need to upgrade! libiconv 1.14_0 >= libiconv 1.14_0
62:debug:main epoch: in tree: 0 installed: 0
63:debug:main ncurses 5.9_1 exists in the ports tree
64:debug:main ncurses 5.9_1  is the latest installed
65:debug:main ncurses 5.9_1  is active
66:debug:main Merging existing variants '' into variants
67:debug:main new fully merged portvariants:
68:debug:main Changing to port directory: /opt/local/var/macports/sources/rsync.macports.org/release/tarballs/ports/devel/ncurses
69:debug:main OS darwin/10.8.0 (Mac OS X 10.6) arch i386
70:debug:main org.macports.load registered provides 'load', a pre-existing procedure. Target override will not be provided
71:debug:main org.macports.unload registered provides 'unload', a pre-existing procedure. Target override will not be provided
72:debug:main org.macports.distfiles registered provides 'distfiles', a pre-existing procedure. Target override will not be provided
73:debug:main adding the default universal variant
74:debug:main Reading variant descriptions from /opt/local/var/macports/sources/rsync.macports.org/release/tarballs/ports/_resources/port1.0/variant_descriptions.conf
75:debug:main No need to upgrade! ncurses 5.9_1 >= ncurses 5.9_1
76:debug:main epoch: in tree: 0 installed: 0
77:debug:main expat 2.1.0_0 exists in the ports tree
78:debug:main expat 2.1.0_0  is the latest installed
79:debug:main expat 2.1.0_0  is active
80:debug:main Merging existing variants '' into variants
81:debug:main new fully merged portvariants:
82:debug:main Changing to port directory: /opt/local/var/macports/sources/rsync.macports.org/release/tarballs/ports/textproc/expat
83:debug:main OS darwin/10.8.0 (Mac OS X 10.6) arch i386
84:debug:main org.macports.load registered provides 'load', a pre-existing procedure. Target override will not be provided
85:debug:main org.macports.unload registered provides 'unload', a pre-existing procedure. Target override will not be provided
86:debug:main org.macports.distfiles registered provides 'distfiles', a pre-existing procedure. Target override will not be provided
87:debug:main adding the default universal variant
88:debug:main Reading variant descriptions from /opt/local/var/macports/sources/rsync.macports.org/release/tarballs/ports/_resources/port1.0/variant_descriptions.conf
89:debug:main No need to upgrade! expat 2.1.0_0 >= expat 2.1.0_0
90:debug:main epoch: in tree: 0 installed: 0
91:debug:main zlib 1.2.7_0 exists in the ports tree
92:debug:main zlib 1.2.7_0  is the latest installed
93:debug:main zlib 1.2.7_0  is active
94:debug:main Merging existing variants '' into variants
95:debug:main new fully merged portvariants:
96:debug:main Changing to port directory: /opt/local/var/macports/sources/rsync.macports.org/release/tarballs/ports/archivers/zlib
97:debug:main OS darwin/10.8.0 (Mac OS X 10.6) arch i386
98:debug:main org.macports.load registered provides 'load', a pre-existing procedure. Target override will not be provided
99:debug:main org.macports.unload registered provides 'unload', a pre-existing procedure. Target override will not be provided
100:debug:main org.macports.distfiles registered provides 'distfiles', a pre-existing procedure. Target override will not be provided
101:debug:main Using group file /opt/local/var/macports/sources/rsync.macports.org/release/tarballs/ports/_resources/port1.0/group/xcodeversion-1.0.tcl
102:debug:main adding the default universal variant
103:debug:main Reading variant descriptions from /opt/local/var/macports/sources/rsync.macports.org/release/tarballs/ports/_resources/port1.0/variant_descriptions.conf
104:debug:main No need to upgrade! zlib 1.2.7_0 >= zlib 1.2.7_0
105:debug:main epoch: in tree: 0 installed: 0
106:debug:main libffi 3.0.11_0 exists in the ports tree
107:debug:main libffi 3.0.11_0  is the latest installed
108:debug:main libffi 3.0.11_0  is active
109:debug:main Merging existing variants '' into variants
110:debug:main new fully merged portvariants:
111:debug:main Changing to port directory: /opt/local/var/macports/sources/rsync.macports.org/release/tarballs/ports/devel/libffi
112:debug:main OS darwin/10.8.0 (Mac OS X 10.6) arch i386
113:debug:main org.macports.load registered provides 'load', a pre-existing procedure. Target override will not be provided
114:debug:main org.macports.unload registered provides 'unload', a pre-existing procedure. Target override will not be provided
115:debug:main org.macports.distfiles registered provides 'distfiles', a pre-existing procedure. Target override will not be provided
116:debug:main Using group file /opt/local/var/macports/sources/rsync.macports.org/release/tarballs/ports/_resources/port1.0/group/muniversal-1.0.tcl
117:debug:main Reading variant descriptions from /opt/local/var/macports/sources/rsync.macports.org/release/tarballs/ports/_resources/port1.0/variant_descriptions.conf
118:debug:main universal variant already exists, so not adding the default one
119:debug:main No need to upgrade! libffi 3.0.11_0 >= libffi 3.0.11_0
120:debug:main epoch: in tree: 0 installed: 0
121:debug:main perl5 5.12.4_0 exists in the ports tree
122:debug:main perl5 5.12.4_0 +perl5_12 is the latest installed
123:debug:main perl5 5.12.4_0 +perl5_12 is active
124:debug:main Merging existing variants '+perl5_12' into variants
125:debug:main new fully merged portvariants: perl5_12 +
126:debug:main Changing to port directory: /opt/local/var/macports/sources/rsync.macports.org/release/tarballs/ports/lang/perl5
127:debug:main OS darwin/10.8.0 (Mac OS X 10.6) arch i386
128:debug:main org.macports.load registered provides 'load', a pre-existing procedure. Target override will not be provided
129:debug:main org.macports.unload registered provides 'unload', a pre-existing procedure. Target override will not be provided
130:debug:main org.macports.distfiles registered provides 'distfiles', a pre-existing procedure. Target override will not be provided
131:debug:main universal_variant is false, so not adding the default universal variant
132:debug:main Executing variant perl5_12 provides perl5_12
133:debug:main No need to upgrade! perl5 5.12.4_0 >= perl5 5.12.4_0
134:debug:main epoch: in tree: 0 installed: 0
135:debug:main perl5.12 5.12.4_1 exists in the ports tree
136:debug:main perl5.12 5.12.4_1  is the latest installed
137:debug:main perl5.12 5.12.4_1  is active
138:debug:main Merging existing variants '' into variants
139:debug:main new fully merged portvariants:
140:debug:main Changing to port directory: /opt/local/var/macports/sources/rsync.macports.org/release/tarballs/ports/lang/perl5.12
141:debug:main OS darwin/10.8.0 (Mac OS X 10.6) arch i386
142:debug:main org.macports.load registered provides 'load', a pre-existing procedure. Target override will not be provided
143:debug:main org.macports.unload registered provides 'unload', a pre-existing procedure. Target override will not be provided
144:debug:main org.macports.distfiles registered provides 'distfiles', a pre-existing procedure. Target override will not be provided
145:debug:main adding the default universal variant
146:debug:main Reading variant descriptions from /opt/local/var/macports/sources/rsync.macports.org/release/tarballs/ports/_resources/port1.0/variant_descriptions.conf
147:debug:main No need to upgrade! perl5.12 5.12.4_1 >= perl5.12 5.12.4_1
148:debug:main epoch: in tree: 0 installed: 0
149:debug:main gdbm 1.10_2 exists in the ports tree
150:debug:main gdbm 1.10_2  is the latest installed
151:debug:main gdbm 1.10_2  is active
152:debug:main Merging existing variants '' into variants
153:debug:main new fully merged portvariants:
154:debug:main Changing to port directory: /opt/local/var/macports/sources/rsync.macports.org/release/tarballs/ports/databases/gdbm
155:debug:main OS darwin/10.8.0 (Mac OS X 10.6) arch i386
156:debug:main org.macports.load registered provides 'load', a pre-existing procedure. Target override will not be provided
157:debug:main org.macports.unload registered provides 'unload', a pre-existing procedure. Target override will not be provided
158:debug:main org.macports.distfiles registered provides 'distfiles', a pre-existing procedure. Target override will not be provided
159:debug:main adding the default universal variant
160:debug:main Reading variant descriptions from /opt/local/var/macports/sources/rsync.macports.org/release/tarballs/ports/_resources/port1.0/variant_descriptions.conf
161:debug:main No need to upgrade! gdbm 1.10_2 >= gdbm 1.10_2
162:debug:main epoch: in tree: 2 installed: 2
163:debug:main python27 2.7.3_0 exists in the ports tree
164:debug:main python27 2.7.3_0  is the latest installed
165:debug:main python27 2.7.3_0  is active
166:debug:main Merging existing variants '' into variants
167:debug:main new fully merged portvariants:
168:debug:main Changing to port directory: /opt/local/var/macports/sources/rsync.macports.org/release/tarballs/ports/lang/python27
169:debug:main OS darwin/10.8.0 (Mac OS X 10.6) arch i386
170:debug:main org.macports.load registered provides 'load', a pre-existing procedure. Target override will not be provided
171:debug:main org.macports.unload registered provides 'unload', a pre-existing procedure. Target override will not be provided
172:debug:main org.macports.distfiles registered provides 'distfiles', a pre-existing procedure. Target override will not be provided
173:debug:main Using group file /opt/local/var/macports/sources/rsync.macports.org/release/tarballs/ports/_resources/port1.0/group/select-1.0.tcl
174:debug:main Reading variant descriptions from /opt/local/var/macports/sources/rsync.macports.org/release/tarballs/ports/_resources/port1.0/variant_descriptions.conf
175:debug:main universal variant already exists, so not adding the default one
176:debug:main No need to upgrade! python27 2.7.3_0 >= python27 2.7.3_0
177:debug:main epoch: in tree: 1 installed: 1
178:debug:main openssl 1.0.1c_0 exists in the ports tree
179:debug:main openssl 1.0.1c_0  is the latest installed
180:debug:main openssl 1.0.1c_0  is active
181:debug:main Merging existing variants '' into variants
182:debug:main new fully merged portvariants:
183:debug:main Changing to port directory: /opt/local/var/macports/sources/rsync.macports.org/release/tarballs/ports/devel/openssl
184:debug:main OS darwin/10.8.0 (Mac OS X 10.6) arch i386
185:debug:main org.macports.load registered provides 'load', a pre-existing procedure. Target override will not be provided
186:debug:main org.macports.unload registered provides 'unload', a pre-existing procedure. Target override will not be provided
187:debug:main org.macports.distfiles registered provides 'distfiles', a pre-existing procedure. Target override will not be provided
188:debug:main Using group file /opt/local/var/macports/sources/rsync.macports.org/release/tarballs/ports/_resources/port1.0/group/muniversal-1.0.tcl
189:debug:main Reading variant descriptions from /opt/local/var/macports/sources/rsync.macports.org/release/tarballs/ports/_resources/port1.0/variant_descriptions.conf
190:debug:main universal variant already exists, so not adding the default one
191:debug:main No need to upgrade! openssl 1.0.1c_0 >= openssl 1.0.1c_0
192:debug:main epoch: in tree: 0 installed: 0
193:debug:main sqlite3 3.7.13_0 exists in the ports tree
194:debug:main sqlite3 3.7.13_0  is the latest installed
195:debug:main sqlite3 3.7.13_0  is active
196:debug:main Merging existing variants '' into variants
197:debug:main new fully merged portvariants:
198:debug:main Changing to port directory: /opt/local/var/macports/sources/rsync.macports.org/release/tarballs/ports/databases/sqlite3
199:debug:main OS darwin/10.8.0 (Mac OS X 10.6) arch i386
200:debug:main org.macports.load registered provides 'load', a pre-existing procedure. Target override will not be provided
201:debug:main org.macports.unload registered provides 'unload', a pre-existing procedure. Target override will not be provided
202:debug:main org.macports.distfiles registered provides 'distfiles', a pre-existing procedure. Target override will not be provided
203:debug:main adding the default universal variant
204:debug:main Reading variant descriptions from /opt/local/var/macports/sources/rsync.macports.org/release/tarballs/ports/_resources/port1.0/variant_descriptions.conf
205:debug:main No need to upgrade! sqlite3 3.7.13_0 >= sqlite3 3.7.13_0
206:debug:main epoch: in tree: 20090923 installed: 20090923
207:debug:main libedit 20120601-3.0_0 exists in the ports tree
208:debug:main libedit 20120601-3.0_0  is the latest installed
209:debug:main libedit 20120601-3.0_0  is active
210:debug:main Merging existing variants '' into variants
211:debug:main new fully merged portvariants:
212:debug:main Changing to port directory: /opt/local/var/macports/sources/rsync.macports.org/release/tarballs/ports/devel/libedit
213:debug:main OS darwin/10.8.0 (Mac OS X 10.6) arch i386
214:debug:main org.macports.load registered provides 'load', a pre-existing procedure. Target override will not be provided
215:debug:main org.macports.unload registered provides 'unload', a pre-existing procedure. Target override will not be provided
216:debug:main org.macports.distfiles registered provides 'distfiles', a pre-existing procedure. Target override will not be provided
217:debug:main Using group file /opt/local/var/macports/sources/rsync.macports.org/release/tarballs/ports/_resources/port1.0/group/muniversal-1.0.tcl
218:debug:main Reading variant descriptions from /opt/local/var/macports/sources/rsync.macports.org/release/tarballs/ports/_resources/port1.0/variant_descriptions.conf
219:debug:main universal variant already exists, so not adding the default one
220:debug:main No need to upgrade! libedit 20120601-3.0_0 >= libedit 20120601-3.0_0
221:debug:main epoch: in tree: 0 installed: 0
222:debug:main db46 4.6.21_6 exists in the ports tree
223:debug:main db46 4.6.21_6 +java is the latest installed
224:debug:main db46 4.6.21_6 +java is active
225:debug:main Merging existing variants '+java' into variants
226:debug:main new fully merged portvariants: java +
227:debug:main Changing to port directory: /opt/local/var/macports/sources/rsync.macports.org/release/tarballs/ports/databases/db46
228:debug:main OS darwin/10.8.0 (Mac OS X 10.6) arch i386
229:debug:main org.macports.load registered provides 'load', a pre-existing procedure. Target override will not be provided
230:debug:main org.macports.unload registered provides 'unload', a pre-existing procedure. Target override will not be provided
231:debug:main org.macports.distfiles registered provides 'distfiles', a pre-existing procedure. Target override will not be provided
232:debug:main Using group file /opt/local/var/macports/sources/rsync.macports.org/release/tarballs/ports/_resources/port1.0/group/muniversal-1.0.tcl
233:debug:main Reading variant descriptions from /opt/local/var/macports/sources/rsync.macports.org/release/tarballs/ports/_resources/port1.0/variant_descriptions.conf
234:debug:main universal variant already exists, so not adding the default one
235:debug:main Executing variant java provides java
236:debug:main No need to upgrade! db46 4.6.21_6 >= db46 4.6.21_6
237:debug:main epoch: in tree: 0 installed: 0
238:debug:main bzip2 1.0.6_0 exists in the ports tree
239:debug:main bzip2 1.0.6_0  is the latest installed
240:debug:main bzip2 1.0.6_0  is active
241:debug:main Merging existing variants '' into variants
242:debug:main new fully merged portvariants:
243:debug:main Changing to port directory: /opt/local/var/macports/sources/rsync.macports.org/release/tarballs/ports/archivers/bzip2
244:debug:main OS darwin/10.8.0 (Mac OS X 10.6) arch i386
245:debug:main org.macports.load registered provides 'load', a pre-existing procedure. Target override will not be provided
246:debug:main org.macports.unload registered provides 'unload', a pre-existing procedure. Target override will not be provided
247:debug:main org.macports.distfiles registered provides 'distfiles', a pre-existing procedure. Target override will not be provided
248:debug:main Reading variant descriptions from /opt/local/var/macports/sources/rsync.macports.org/release/tarballs/ports/_resources/port1.0/variant_descriptions.conf
249:debug:main universal variant already exists, so not adding the default one
250:debug:main No need to upgrade! bzip2 1.0.6_0 >= bzip2 1.0.6_0
251:debug:main epoch: in tree: 0 installed: 0
252:debug:main python_select 0.3_1 exists in the ports tree
253:debug:main python_select 0.3_1  is the latest installed
254:debug:main python_select 0.3_1  is active
255:debug:main Merging existing variants '' into variants
256:debug:main new fully merged portvariants:
257:debug:main Changing to port directory: /opt/local/var/macports/sources/rsync.macports.org/release/tarballs/ports/sysutils/python_select
258:debug:main OS darwin/10.8.0 (Mac OS X 10.6) arch i386
259:debug:main org.macports.load registered provides 'load', a pre-existing procedure. Target override will not be provided
260:debug:main org.macports.unload registered provides 'unload', a pre-existing procedure. Target override will not be provided
261:debug:main org.macports.distfiles registered provides 'distfiles', a pre-existing procedure. Target override will not be provided
262:debug:main Using group file /opt/local/var/macports/sources/rsync.macports.org/release/tarballs/ports/_resources/port1.0/group/select-1.0.tcl
263:debug:main universal_variant is false, so not adding the default universal variant
264:debug:main No need to upgrade! python_select 0.3_1 >= python_select 0.3_1
265:debug:main epoch: in tree: 0 installed: 0
266:debug:main py27-sip 4.13.2_0 exists in the ports tree
267:debug:main py27-sip 4.13.2_0  is the latest installed
268:debug:main py27-sip 4.13.2_0  is active
269:debug:main Merging existing variants '' into variants
270:debug:main new fully merged portvariants:
271:debug:main Changing to port directory: /opt/local/var/macports/sources/rsync.macports.org/release/tarballs/ports/python/py-sip
272:debug:main OS darwin/10.8.0 (Mac OS X 10.6) arch i386
273:debug:main org.macports.load registered provides 'load', a pre-existing procedure. Target override will not be provided
274:debug:main org.macports.unload registered provides 'unload', a pre-existing procedure. Target override will not be provided
275:debug:main org.macports.distfiles registered provides 'distfiles', a pre-existing procedure. Target override will not be provided
276:debug:main Using group file /opt/local/var/macports/sources/rsync.macports.org/release/tarballs/ports/_resources/port1.0/group/python-1.0.tcl
277:debug:main Re-registering default for build.cmd
278:debug:main Re-registering default for destroot.cmd
279:debug:main Re-registering default for destroot.destdir
280:debug:main adding the default universal variant
281:debug:main Reading variant descriptions from /opt/local/var/macports/sources/rsync.macports.org/release/tarballs/ports/_resources/port1.0/variant_descriptions.conf
282:debug:main No need to upgrade! py27-sip 4.13.2_0 >= py27-sip 4.13.2_0
283:debug:main epoch: in tree: 0 installed: 0
284:debug:main qt4-mac 4.8.2_0 exists in the ports tree
285:debug:main qt4-mac 4.8.2_0 +framework+quartz is the latest installed
286:debug:main qt4-mac 4.8.2_0 +framework+quartz is active
287:debug:main Merging existing variants '+framework+quartz' into variants
288:debug:main new fully merged portvariants: framework + quartz +
289:debug:main Changing to port directory: /opt/local/var/macports/sources/rsync.macports.org/release/tarballs/ports/aqua/qt4-mac
290:debug:main OS darwin/10.8.0 (Mac OS X 10.6) arch i386
291:debug:main org.macports.load registered provides 'load', a pre-existing procedure. Target override will not be provided
292:debug:main org.macports.unload registered provides 'unload', a pre-existing procedure. Target override will not be provided
293:debug:main org.macports.distfiles registered provides 'distfiles', a pre-existing procedure. Target override will not be provided
294:debug:main Using group file /opt/local/var/macports/sources/rsync.macports.org/release/tarballs/ports/_resources/port1.0/group/qt4-1.0.tcl
295:debug:main Using group file /opt/local/var/macports/sources/rsync.macports.org/release/tarballs/ports/_resources/port1.0/group/xcodeversion-1.0.tcl
296:debug:main adding the default universal variant
297:debug:main Reading variant descriptions from /opt/local/var/macports/sources/rsync.macports.org/release/tarballs/ports/_resources/port1.0/variant_descriptions.conf
298:debug:main Executing variant framework provides framework
299:debug:main Executing variant quartz provides quartz
300:debug:main No need to upgrade! qt4-mac 4.8.2_0 >= qt4-mac 4.8.2_0
301:debug:main epoch: in tree: 0 installed: 0
302:debug:main dbus 1.4.20_1 exists in the ports tree
303:debug:main dbus 1.4.20_1 +startupitem is the latest installed
304:debug:main dbus 1.4.20_1 +startupitem is active
305:debug:main Merging existing variants '+startupitem' into variants
306:debug:main new fully merged portvariants: startupitem +
307:debug:main Changing to port directory: /opt/local/var/macports/sources/rsync.macports.org/release/tarballs/ports/devel/dbus
308:debug:main OS darwin/10.8.0 (Mac OS X 10.6) arch i386
309:debug:main org.macports.load registered provides 'load', a pre-existing procedure. Target override will not be provided
310:debug:main org.macports.unload registered provides 'unload', a pre-existing procedure. Target override will not be provided
311:debug:main org.macports.distfiles registered provides 'distfiles', a pre-existing procedure. Target override will not be provided
312:debug:main Using group file /opt/local/var/macports/sources/rsync.macports.org/release/tarballs/ports/_resources/port1.0/group/muniversal-1.0.tcl
313:debug:main Reading variant descriptions from /opt/local/var/macports/sources/rsync.macports.org/release/tarballs/ports/_resources/port1.0/variant_descriptions.conf
314:debug:main universal variant already exists, so not adding the default one
315:debug:main Executing variant startupitem provides startupitem
316:debug:main No need to upgrade! dbus 1.4.20_1 >= dbus 1.4.20_1
317:debug:main epoch: in tree: 0 installed: 0
318:debug:main tiff 3.9.5_0 exists in the ports tree
319:debug:main tiff 3.9.5_0  is the latest installed
320:debug:main tiff 3.9.5_0  is active
321:debug:main Merging existing variants '' into variants
322:debug:main new fully merged portvariants:
323:debug:main Changing to port directory: /opt/local/var/macports/sources/rsync.macports.org/release/tarballs/ports/graphics/tiff
324:debug:main OS darwin/10.8.0 (Mac OS X 10.6) arch i386
325:debug:main org.macports.load registered provides 'load', a pre-existing procedure. Target override will not be provided
326:debug:main org.macports.unload registered provides 'unload', a pre-existing procedure. Target override will not be provided
327:debug:main org.macports.distfiles registered provides 'distfiles', a pre-existing procedure. Target override will not be provided
328:debug:main Using group file /opt/local/var/macports/sources/rsync.macports.org/release/tarballs/ports/_resources/port1.0/group/xcodeversion-1.0.tcl
329:debug:main adding the default universal variant
330:debug:main Reading variant descriptions from /opt/local/var/macports/sources/rsync.macports.org/release/tarballs/ports/_resources/port1.0/variant_descriptions.conf
331:debug:main No need to upgrade! tiff 3.9.5_0 >= tiff 3.9.5_0
332:debug:main epoch: in tree: 0 installed: 0
333:debug:main jpeg 8d_0 exists in the ports tree
334:debug:main jpeg 8d_0  is the latest installed
335:debug:main jpeg 8d_0  is active
336:debug:main Merging existing variants '' into variants
337:debug:main new fully merged portvariants:
338:debug:main Changing to port directory: /opt/local/var/macports/sources/rsync.macports.org/release/tarballs/ports/graphics/jpeg
339:debug:main OS darwin/10.8.0 (Mac OS X 10.6) arch i386
340:debug:main org.macports.load registered provides 'load', a pre-existing procedure. Target override will not be provided
341:debug:main org.macports.unload registered provides 'unload', a pre-existing procedure. Target override will not be provided
342:debug:main org.macports.distfiles registered provides 'distfiles', a pre-existing procedure. Target override will not be provided
343:debug:main adding the default universal variant
344:debug:main Reading variant descriptions from /opt/local/var/macports/sources/rsync.macports.org/release/tarballs/ports/_resources/port1.0/variant_descriptions.conf
345:debug:main No need to upgrade! jpeg 8d_0 >= jpeg 8d_0
346:debug:main epoch: in tree: 0 installed: 0
347:debug:main libpng 1.4.12_0 exists in the ports tree
348:debug:main libpng 1.4.12_0  is the latest installed
349:debug:main libpng 1.4.12_0  is active
350:debug:main Merging existing variants '' into variants
351:debug:main new fully merged portvariants:
352:debug:main Changing to port directory: /opt/local/var/macports/sources/rsync.macports.org/release/tarballs/ports/graphics/libpng
353:debug:main OS darwin/10.8.0 (Mac OS X 10.6) arch i386
354:debug:main org.macports.load registered provides 'load', a pre-existing procedure. Target override will not be provided
355:debug:main org.macports.unload registered provides 'unload', a pre-existing procedure. Target override will not be provided
356:debug:main org.macports.distfiles registered provides 'distfiles', a pre-existing procedure. Target override will not be provided
357:debug:main adding the default universal variant
358:debug:main Reading variant descriptions from /opt/local/var/macports/sources/rsync.macports.org/release/tarballs/ports/_resources/port1.0/variant_descriptions.conf
359:debug:main No need to upgrade! libpng 1.4.12_0 >= libpng 1.4.12_0
360:debug:main epoch: in tree: 0 installed: 0
361:debug:main libmng 1.0.10_2 exists in the ports tree
362:debug:main libmng 1.0.10_2  is the latest installed
363:debug:main libmng 1.0.10_2  is active
364:debug:main Merging existing variants '' into variants
365:debug:main new fully merged portvariants:
366:debug:main Changing to port directory: /opt/local/var/macports/sources/rsync.macports.org/release/tarballs/ports/graphics/libmng
367:debug:main OS darwin/10.8.0 (Mac OS X 10.6) arch i386
368:debug:main org.macports.load registered provides 'load', a pre-existing procedure. Target override will not be provided
369:debug:main org.macports.unload registered provides 'unload', a pre-existing procedure. Target override will not be provided
370:debug:main org.macports.distfiles registered provides 'distfiles', a pre-existing procedure. Target override will not be provided
371:debug:main adding the default universal variant
372:debug:main Reading variant descriptions from /opt/local/var/macports/sources/rsync.macports.org/release/tarballs/ports/_resources/port1.0/variant_descriptions.conf
373:debug:main No need to upgrade! libmng 1.0.10_2 >= libmng 1.0.10_2
374:debug:main epoch: in tree: 0 installed: 0
375:debug:main lcms 1.19_2 exists in the ports tree
376:debug:main lcms 1.19_2  is the latest installed
377:debug:main lcms 1.19_2  is active
378:debug:main Merging existing variants '' into variants
379:debug:main new fully merged portvariants:
380:debug:main Changing to port directory: /opt/local/var/macports/sources/rsync.macports.org/release/tarballs/ports/graphics/lcms
381:debug:main OS darwin/10.8.0 (Mac OS X 10.6) arch i386
382:debug:main org.macports.load registered provides 'load', a pre-existing procedure. Target override will not be provided
383:debug:main org.macports.unload registered provides 'unload', a pre-existing procedure. Target override will not be provided
384:debug:main org.macports.distfiles registered provides 'distfiles', a pre-existing procedure. Target override will not be provided
385:debug:main Using group file /opt/local/var/macports/sources/rsync.macports.org/release/tarballs/ports/_resources/port1.0/group/muniversal-1.0.tcl
386:debug:main Reading variant descriptions from /opt/local/var/macports/sources/rsync.macports.org/release/tarballs/ports/_resources/port1.0/variant_descriptions.conf
387:debug:main universal variant already exists, so not adding the default one
388:debug:main No need to upgrade! lcms 1.19_2 >= lcms 1.19_2
389:msg:main --->  Computing dependencies for py27-pyqt4:info:main .:debug:main py27-pyqt4 has no conflicts
390:debug:main Searching for dependency: pkgconfig
391:debug:main Found Dependency: receipt exists for pkgconfig
392:debug:main Searching for dependency: python27
393:debug:main Found Dependency: receipt exists for python27
394:debug:main Searching for dependency: py27-sip
395:debug:main Found Dependency: receipt exists for py27-sip
396:debug:main Searching for dependency: qt4-mac
397:debug:main Found Dependency: receipt exists for qt4-mac
398:msg:main
399:debug:main Executing org.macports.main (py27-pyqt4)
400:debug:main changing euid/egid - current euid: 0 - current egid: 0
401:debug:main egid changed to: 501
402:debug:main euid changed to: 503
403:debug:archivefetch archivefetch phase started at Thu Aug  2 15:57:10 EDT 2012
404:msg:archivefetch --->  Fetching archive for py27-pyqt4
405:debug:archivefetch Executing org.macports.archivefetch (py27-pyqt4)
406:debug:archivefetch euid/egid changed to: 0/0
407:debug:archivefetch chowned /opt/local/var/macports/incoming to macports
408:debug:archivefetch euid/egid changed to: 503/501
409:info:archivefetch --->  py27-pyqt4-4.9.1_0.darwin_10.x86_64.tbz2 doesn't seem to exist in /opt/local/var/macports/incoming/verified
410:msg:archivefetch --->  Attempting to fetch py27-pyqt4-4.9.1_0.darwin_10.x86_64.tbz2 from http://packages.macports.org/py27-pyqt4
411:debug:archivefetch Fetching archive failed:: The requested URL returned error: 404
412:debug:archivefetch Privilege de-escalation not attempted as not running as root.
413:debug:fetch fetch phase started at Thu Aug  2 15:57:10 EDT 2012
414:notice:fetch --->  Fetching distfiles for py27-pyqt4
415:debug:fetch Executing org.macports.fetch (py27-pyqt4)
416:debug:fetch Privilege de-escalation not attempted as not running as root.
417:debug:checksum checksum phase started at Thu Aug  2 15:57:10 EDT 2012
418:notice:checksum --->  Verifying checksum(s) for py27-pyqt4
419:debug:checksum Executing org.macports.checksum (py27-pyqt4)
420:info:checksum --->  Checksumming PyQt-mac-gpl-4.9.1.tar.gz
421:debug:checksum Correct (md5) checksum for PyQt-mac-gpl-4.9.1.tar.gz
422:debug:checksum Correct (sha1) checksum for PyQt-mac-gpl-4.9.1.tar.gz
423:debug:checksum Correct (rmd160) checksum for PyQt-mac-gpl-4.9.1.tar.gz
424:debug:checksum Privilege de-escalation not attempted as not running as root.
425:debug:extract extract phase started at Thu Aug  2 15:57:11 EDT 2012
426:notice:extract --->  Extracting py27-pyqt4
427:debug:extract Executing proc-pre-org.macports.extract-extract-0
428:debug:extract Executing org.macports.extract (py27-pyqt4)
429:info:extract --->  Extracting PyQt-mac-gpl-4.9.1.tar.gz
430:debug:extract setting option extract.args to '/opt/local/var/macports/distfiles/python/PyQt-mac-gpl-4.9.1.tar.gz'
431:debug:extract Environment: CPATH='/opt/local/include' CC_PRINT_OPTIONS_FILE='/opt/local/var/macports/build/_opt_local_var_macports_sources_rsync.macports.org_release_tarballs_ports_python_py-pyqt4/py27-pyqt4/work/.CC_PRINT_OPTIONS' LIBRARY_PATH='/opt/local/lib' CC_PRINT_OPTIONS='YES' MACOSX_DEPLOYMENT_TARGET='10.6'
432:debug:extract Assembled command: 'cd "/opt/local/var/macports/build/_opt_local_var_macports_sources_rsync.macports.org_release_tarballs_ports_python_py-pyqt4/py27-pyqt4/work" && /usr/bin/gzip -dc '/opt/local/var/macports/distfiles/python/PyQt-mac-gpl-4.9.1.tar.gz' | /usr/bin/gnutar --no-same-owner -xf -'
433:debug:extract Executing command line:  cd "/opt/local/var/macports/build/_opt_local_var_macports_sources_rsync.macports.org_release_tarballs_ports_python_py-pyqt4/py27-pyqt4/work" && /usr/bin/gzip -dc '/opt/local/var/macports/distfiles/python/PyQt-mac-gpl-4.9.1.tar.gz' | /usr/bin/gnutar --no-same-owner -xf -
434:debug:extract euid/egid changed to: 0/0
435:debug:extract chowned /opt/local/var/macports/build/_opt_local_var_macports_sources_rsync.macports.org_release_tarballs_ports_python_py-pyqt4/py27-pyqt4/work to macports
436:debug:extract euid/egid changed to: 503/501
437:debug:extract Privilege de-escalation not attempted as not running as root.
438:debug:patch patch phase started at Thu Aug  2 15:57:12 EDT 2012
439:debug:patch Executing org.macports.patch (py27-pyqt4)
440:notice:patch --->  Applying patches to py27-pyqt4
441:info:patch --->  Applying patch-configure.py
442:debug:patch Environment: CPATH='/opt/local/include' CC_PRINT_OPTIONS_FILE='/opt/local/var/macports/build/_opt_local_var_macports_sources_rsync.macports.org_release_tarballs_ports_python_py-pyqt4/py27-pyqt4/work/.CC_PRINT_OPTIONS' LIBRARY_PATH='/opt/local/lib' CC_PRINT_OPTIONS='YES' MACOSX_DEPLOYMENT_TARGET='10.6'
443:debug:patch Assembled command: 'cd "/opt/local/var/macports/build/_opt_local_var_macports_sources_rsync.macports.org_release_tarballs_ports_python_py-pyqt4/py27-pyqt4/work/PyQt-mac-gpl-4.9.1" && /usr/bin/patch -p0'
444:debug:patch Executing command line:  cd "/opt/local/var/macports/build/_opt_local_var_macports_sources_rsync.macports.org_release_tarballs_ports_python_py-pyqt4/py27-pyqt4/work/PyQt-mac-gpl-4.9.1" && /usr/bin/patch -p0 < '/opt/local/var/macports/sources/rsync.macports.org/release/tarballs/ports/python/py-pyqt4/files/patch-configure.py'
445:info:patch patching file configure.py
446:info:patch Hunk #1 succeeded at 966 (offset 17 lines).
447:debug:patch Executing proc-post-org.macports.patch-patch-0
448:debug:patch Executing reinplace: /usr/bin/sed s|@@MACPORTS_PYTHON_FRAMEWORK@@|/opt/local/Library/Frameworks/Python.framework/Versions/2.7/Python| < /opt/local/var/macports/build/_opt_local_var_macports_sources_rsync.macports.org_release_tarballs_ports_python_py-pyqt4/py27-pyqt4/work/PyQt-mac-gpl-4.9.1/configure.py >@ file10
449:debug:patch euid/egid changed to: 0/0
450:debug:patch chowned /opt/local/var/macports/build/_opt_local_var_macports_sources_rsync.macports.org_release_tarballs_ports_python_py-pyqt4/py27-pyqt4/work/PyQt-mac-gpl-4.9.1/configure.py to macports
451:debug:patch euid/egid changed to: 503/501
452:debug:patch euid/egid changed to: 0/0
453:debug:patch setting attributes on /opt/local/var/macports/build/_opt_local_var_macports_sources_rsync.macports.org_release_tarballs_ports_python_py-pyqt4/py27-pyqt4/work/PyQt-mac-gpl-4.9.1/configure.py
454:debug:patch euid/egid changed to: 503/501
455:debug:patch Privilege de-escalation not attempted as not running as root.
456:debug:configure configure phase started at Thu Aug  2 15:57:12 EDT 2012
457:notice:configure --->  Configuring py27-pyqt4
458:debug:configure Using compiler 'Mac OS X gcc 4.2'
459:debug:configure Executing proc-pre-org.macports.configure-configure-0
460:debug:configure Executing org.macports.configure (py27-pyqt4)
461:debug:configure Environment: CPATH='/opt/local/include' CFLAGS='-pipe -O2 -arch x86_64' CPPFLAGS='-I/opt/local/include' CXXFLAGS='-pipe -O2 -arch x86_64' LIBRARY_PATH='/opt/local/lib' MACOSX_DEPLOYMENT_TARGET='10.6' PKG_CONFIG_PATH='/opt/local/lib/pkgconfig' CXX='/usr/bin/g++-4.2' CC_PRINT_OPTIONS_FILE='/opt/local/var/macports/build/_opt_local_var_macports_sources_rsync.macports.org_release_tarballs_ports_python_py-pyqt4/py27-pyqt4/work/.CC_PRINT_OPTIONS' F90FLAGS='-pipe -O2 -m64' LDFLAGS='-L/opt/local/lib -arch x86_64' FCFLAGS='-pipe -O2 -m64' OBJC='/usr/bin/gcc-4.2' INSTALL='/usr/bin/install -c' MOC='/opt/local/bin/moc' QMAKESPEC='macx-g++' FFLAGS='-pipe -O2 -m64' OBJCFLAGS='-pipe -O2 -arch x86_64' QTDIR='/opt/local' CC_PRINT_OPTIONS='YES' CC='/usr/bin/gcc-4.2' QMAKE='/opt/local/bin/qmake'
462:debug:configure Assembled command: 'cd "/opt/local/var/macports/build/_opt_local_var_macports_sources_rsync.macports.org_release_tarballs_ports_python_py-pyqt4/py27-pyqt4/work/PyQt-mac-gpl-4.9.1" && /opt/local/Library/Frameworks/Python.framework/Versions/2.7/bin/python2.7 configure.py -q /opt/local/bin/qmake --verbose --confirm-license -e QtGui -e QtHelp -e QtMultimedia -e QtNetwork -e QtDeclarative -e QtOpenGL -e QtScript -e QtScriptTools -e QtSql -e QtSvg -e QtTest -e QtWebKit -e QtXml -e QtXmlPatterns -e QAxContainer --no-qsci-api -e QtDesigner LFLAGS="-F/opt/local/Library/Frameworks -L/opt/local/lib"'
463:debug:configure Executing command line:  cd "/opt/local/var/macports/build/_opt_local_var_macports_sources_rsync.macports.org_release_tarballs_ports_python_py-pyqt4/py27-pyqt4/work/PyQt-mac-gpl-4.9.1" && /opt/local/Library/Frameworks/Python.framework/Versions/2.7/bin/python2.7 configure.py -q /opt/local/bin/qmake --verbose --confirm-license -e QtGui -e QtHelp -e QtMultimedia -e QtNetwork -e QtDeclarative -e QtOpenGL -e QtScript -e QtScriptTools -e QtSql -e QtSvg -e QtTest -e QtWebKit -e QtXml -e QtXmlPatterns -e QAxContainer --no-qsci-api -e QtDesigner LFLAGS="-F/opt/local/Library/Frameworks -L/opt/local/lib"
464:info:configure Error: Failed to determine the layout of your Qt installation. Try again using
465:info:configure the --verbose flag to see more detail about the problem.
466:info:configure Determining the layout of your Qt installation...
467:info:configure /opt/local/bin/qmake -spec macx-g++ -o qtdirs.mk qtdirs.pro
468:info:configure 2012-08-02 15:57:13.015 qmake[79688:907] CFPreferences: user home directory at file://localhost/opt/local/var/macports/home/ is unavailable. User domains will be volatile.
469:info:configure make -f qtdirs.mk
470:info:configure /usr/bin/g++-4.2 -c -pipe -O2 -arch x86_64 -Xarch_x86_64 -mmacosx-version-min=10.6 -Wall -W -DQT_NO_DEBUG -DQT_CORE_LIB -I/opt/local/share/qt4/mkspecs/macx-g++ -I. -I. -I/opt/local/include/QtCore -I/opt/local/include -o qtdirs.o qtdirs.cpp
471:info:configure qtdirs.cpp:1:28: error: QCoreApplication: No such file or directory
472:info:configure qtdirs.cpp:2:17: error: QFile: No such file or directory
473:info:configure qtdirs.cpp:3:24: error: QLibraryInfo: No such file or directory
474:info:configure qtdirs.cpp:4:23: error: QTextStream: No such file or directory
475:info:configure qtdirs.cpp: In function ‘int main(int, char**)’:
476:info:configure qtdirs.cpp:8: error: ‘QCoreApplication’ was not declared in this scope
477:info:configure qtdirs.cpp:8: error: expected `;' before ‘app’
478:info:configure qtdirs.cpp:9: error: ‘QFile’ was not declared in this scope
479:info:configure qtdirs.cpp:9: error: expected `;' before ‘outf’
480:info:configure qtdirs.cpp:11: error: ‘outf’ was not declared in this scope
481:info:configure qtdirs.cpp:11: error: ‘QIODevice’ has not been declared
482:info:configure qtdirs.cpp:11: error: ‘QIODevice’ has not been declared
483:info:configure qtdirs.cpp:11: error: ‘QIODevice’ has not been declared
484:info:configure qtdirs.cpp:14: error: ‘QTextStream’ was not declared in this scope
485:info:configure qtdirs.cpp:14: error: expected `;' before ‘out’
486:info:configure qtdirs.cpp:16: error: ‘out’ was not declared in this scope
487:info:configure qtdirs.cpp:16: error: ‘QLibraryInfo’ has not been declared
488:info:configure qtdirs.cpp:16: error: ‘QLibraryInfo’ has not been declared
489:info:configure qtdirs.cpp:17: error: ‘QLibraryInfo’ has not been declared
490:info:configure qtdirs.cpp:17: error: ‘QLibraryInfo’ has not been declared
491:info:configure qtdirs.cpp:18: error: ‘QLibraryInfo’ has not been declared
492:info:configure qtdirs.cpp:18: error: ‘QLibraryInfo’ has not been declared
493:info:configure qtdirs.cpp:19: error: ‘QLibraryInfo’ has not been declared
494:info:configure qtdirs.cpp:19: error: ‘QLibraryInfo’ has not been declared
495:info:configure qtdirs.cpp:20: error: ‘QLibraryInfo’ has not been declared
496:info:configure qtdirs.cpp:20: error: ‘QLibraryInfo’ has not been declared
497:info:configure qtdirs.cpp:21: error: ‘QLibraryInfo’ has not been declared
498:info:configure qtdirs.cpp:21: error: ‘QLibraryInfo’ has not been declared
499:info:configure qtdirs.cpp:23: error: ‘QT_VERSION’ was not declared in this scope
500:info:configure qtdirs.cpp:24: error: ‘QT_EDITION’ was not declared in this scope
501:info:configure qtdirs.cpp:26: error: ‘QLibraryInfo’ has not been declared
502:info:configure qtdirs.cpp:92: error: ‘qreal’ was not declared in this scope
503:info:configure qtdirs.cpp: At global scope:
504:info:configure qtdirs.cpp:6: warning: unused parameter ‘argc’
505:info:configure qtdirs.cpp:6: warning: unused parameter ‘argv’
506:info:configure make: *** [qtdirs.o] Error 1
507:info:configure Command failed:  cd "/opt/local/var/macports/build/_opt_local_var_macports_sources_rsync.macports.org_release_tarballs_ports_python_py-pyqt4/py27-pyqt4/work/PyQt-mac-gpl-4.9.1" && /opt/local/Library/Frameworks/Python.framework/Versions/2.7/bin/python2.7 configure.py -q /opt/local/bin/qmake --verbose --confirm-license -e QtGui -e QtHelp -e QtMultimedia -e QtNetwork -e QtDeclarative -e QtOpenGL -e QtScript -e QtScriptTools -e QtSql -e QtSvg -e QtTest -e QtWebKit -e QtXml -e QtXmlPatterns -e QAxContainer --no-qsci-api -e QtDesigner LFLAGS="-F/opt/local/Library/Frameworks -L/opt/local/lib"
508:info:configure Exit code: 1
509:error:configure org.macports.configure for port py27-pyqt4 returned: configure failure: command execution failed
510:debug:configure Error code: NONE
511:debug:configure Backtrace: configure failure: command execution failed
512    while executing
513"$procedure $targetname"
514:info:configure Warning: targets not executed for py27-pyqt4: org.macports.activate org.macports.configure org.macports.build org.macports.destroot org.macports.install
515:notice:configure Please see the log file for port py27-pyqt4 for details:
516    /opt/local/var/macports/logs/_opt_local_var_macports_sources_rsync.macports.org_release_tarballs_ports_python_py-pyqt4/py27-pyqt4/main.log