Ticket #35986: main.log

File main.log, 27.2 KB (added by watsodw, 8 years ago)
Line 
1version:1
2:debug:main epoch: in tree: 0 installed: 0
3:debug:main jpeg 8d_0 exists in the ports tree
4:debug:main jpeg 8d_0 +universal is the latest installed
5:debug:main jpeg 8d_0 +universal is active
6:debug:main Merging existing variants '+universal' into variants
7:debug:main new fully merged portvariants: universal +
8:debug:main Changing to port directory: /opt/macports/var/macports/sources/rsync.macports.org/release/tarballs/ports/graphics/jpeg
9:debug:main OS darwin/10.8.0 (Mac OS X 10.6) arch i386
10:debug:main org.macports.load registered provides 'load', a pre-existing procedure. Target override will not be provided
11:debug:main org.macports.unload registered provides 'unload', a pre-existing procedure. Target override will not be provided
12:debug:main org.macports.distfiles registered provides 'distfiles', a pre-existing procedure. Target override will not be provided
13:debug:main adding the default universal variant
14:debug:main Reading variant descriptions from /opt/macports/var/macports/sources/rsync.macports.org/release/tarballs/ports/_resources/port1.0/variant_descriptions.conf
15:debug:main Executing variant universal provides universal
16:debug:main No need to upgrade! jpeg 8d_0 >= jpeg 8d_0
17:debug:main epoch: in tree: 0 installed: 0
18:debug:main libpng 1.5.12_0 exists in the ports tree
19:debug:main libpng 1.5.12_0 +universal is the latest installed
20:debug:main libpng 1.4.12_0 +universal is active
21:debug:main Merging existing variants '+universal' into variants
22:debug:main new fully merged portvariants: universal +
23:debug:main Changing to port directory: /opt/macports/var/macports/sources/rsync.macports.org/release/tarballs/ports/graphics/libpng
24:debug:main OS darwin/10.8.0 (Mac OS X 10.6) arch i386
25:debug:main org.macports.load registered provides 'load', a pre-existing procedure. Target override will not be provided
26:debug:main org.macports.unload registered provides 'unload', a pre-existing procedure. Target override will not be provided
27:debug:main org.macports.distfiles registered provides 'distfiles', a pre-existing procedure. Target override will not be provided
28:debug:main adding the default universal variant
29:debug:main Reading variant descriptions from /opt/macports/var/macports/sources/rsync.macports.org/release/tarballs/ports/_resources/port1.0/variant_descriptions.conf
30:debug:main Executing variant universal provides universal
31:debug:main No need to upgrade! libpng 1.5.12_0 >= libpng 1.5.12_0
32:debug:main epoch: in tree: 0 installed: 0
33:debug:main zlib 1.2.7_0 exists in the ports tree
34:debug:main zlib 1.2.7_0 +universal is the latest installed
35:debug:main zlib 1.2.7_0 +universal is active
36:debug:main Merging existing variants '+universal' into variants
37:debug:main new fully merged portvariants: universal +
38:debug:main Changing to port directory: /opt/macports/var/macports/sources/rsync.macports.org/release/tarballs/ports/archivers/zlib
39:debug:main OS darwin/10.8.0 (Mac OS X 10.6) arch i386
40:debug:main org.macports.load registered provides 'load', a pre-existing procedure. Target override will not be provided
41:debug:main org.macports.unload registered provides 'unload', a pre-existing procedure. Target override will not be provided
42:debug:main org.macports.distfiles registered provides 'distfiles', a pre-existing procedure. Target override will not be provided
43:debug:main Using group file /opt/macports/var/macports/sources/rsync.macports.org/release/tarballs/ports/_resources/port1.0/group/xcodeversion-1.0.tcl
44:debug:main adding the default universal variant
45:debug:main Reading variant descriptions from /opt/macports/var/macports/sources/rsync.macports.org/release/tarballs/ports/_resources/port1.0/variant_descriptions.conf
46:debug:main Executing variant universal provides universal
47:debug:main No need to upgrade! zlib 1.2.7_0 >= zlib 1.2.7_0
48:msg:main --->  Computing dependencies for fltk:info:main .:debug:main Checking for conflicts against fltk
49:debug:main Searching for dependency: fltk-devel
50:debug:main Didn't find receipt, going to depspec regex for: fltk-devel
51:debug:main Searching for dependency: jpeg
52:debug:main Found Dependency: receipt exists for jpeg
53:debug:main Searching for dependency: libpng
54:debug:main Found Dependency: receipt exists for libpng
55:debug:main Searching for dependency: zlib
56:debug:main Found Dependency: receipt exists for zlib
57:msg:main
58:debug:main Executing org.macports.main (fltk)
59:debug:main changing euid/egid - current euid: 0 - current egid: 0
60:debug:main egid changed to: 504
61:debug:main euid changed to: 63920313
62:debug:archivefetch archivefetch phase started at Wed Sep  5 08:06:23 CDT 2012
63:debug:archivefetch Executing org.macports.archivefetch (fltk)
64:debug:archivefetch Privilege de-escalation not attempted as not running as root.
65:debug:fetch fetch phase started at Wed Sep  5 08:06:23 CDT 2012
66:notice:fetch --->  Fetching distfiles for fltk
67:debug:fetch Executing org.macports.fetch (fltk)
68:debug:fetch Privilege de-escalation not attempted as not running as root.
69:debug:checksum checksum phase started at Wed Sep  5 08:06:23 CDT 2012
70:notice:checksum --->  Verifying checksum(s) for fltk
71:debug:checksum Executing org.macports.checksum (fltk)
72:info:checksum --->  Checksumming fltk-1.3.0-source.tar.gz
73:debug:checksum Correct (rmd160) checksum for fltk-1.3.0-source.tar.gz
74:debug:checksum Correct (sha256) checksum for fltk-1.3.0-source.tar.gz
75:debug:checksum Privilege de-escalation not attempted as not running as root.
76:debug:extract extract phase started at Wed Sep  5 08:06:23 CDT 2012
77:notice:extract --->  Extracting fltk
78:debug:extract Executing org.macports.extract (fltk)
79:info:extract --->  Extracting fltk-1.3.0-source.tar.gz
80:debug:extract setting option extract.args to '/opt/macports/var/macports/distfiles/fltk/fltk-1.3.0-source.tar.gz'
81:debug:extract Environment: CPATH='/opt/macports/include' CC_PRINT_OPTIONS_FILE='/opt/macports/var/macports/build/_opt_macports_var_macports_sources_rsync.macports.org_release_tarballs_ports_aqua_fltk/fltk/work/.CC_PRINT_OPTIONS' LIBRARY_PATH='/opt/macports/lib' CC_PRINT_OPTIONS='YES' MACOSX_DEPLOYMENT_TARGET='10.6'
82:debug:extract Assembled command: 'cd "/opt/macports/var/macports/build/_opt_macports_var_macports_sources_rsync.macports.org_release_tarballs_ports_aqua_fltk/fltk/work" && /usr/bin/gzip -dc '/opt/macports/var/macports/distfiles/fltk/fltk-1.3.0-source.tar.gz' | /usr/bin/gnutar --no-same-owner -xf -'
83:debug:extract Executing command line:  cd "/opt/macports/var/macports/build/_opt_macports_var_macports_sources_rsync.macports.org_release_tarballs_ports_aqua_fltk/fltk/work" && /usr/bin/gzip -dc '/opt/macports/var/macports/distfiles/fltk/fltk-1.3.0-source.tar.gz' | /usr/bin/gnutar --no-same-owner -xf -
84:debug:extract euid/egid changed to: 0/0
85:debug:extract chowned /opt/macports/var/macports/build/_opt_macports_var_macports_sources_rsync.macports.org_release_tarballs_ports_aqua_fltk/fltk/work to macports
86:debug:extract euid/egid changed to: 63920313/504
87:debug:extract Privilege de-escalation not attempted as not running as root.
88:debug:patch patch phase started at Wed Sep  5 08:06:23 CDT 2012
89:debug:patch Executing org.macports.patch (fltk)
90:notice:patch --->  Applying patches to fltk
91:info:patch --->  Applying patch-src-filename_list.cxx.diff
92:debug:patch Environment: CPATH='/opt/macports/include' CC_PRINT_OPTIONS_FILE='/opt/macports/var/macports/build/_opt_macports_var_macports_sources_rsync.macports.org_release_tarballs_ports_aqua_fltk/fltk/work/.CC_PRINT_OPTIONS' LIBRARY_PATH='/opt/macports/lib' CC_PRINT_OPTIONS='YES' MACOSX_DEPLOYMENT_TARGET='10.6'
93:debug:patch Assembled command: 'cd "/opt/macports/var/macports/build/_opt_macports_var_macports_sources_rsync.macports.org_release_tarballs_ports_aqua_fltk/fltk/work/fltk-1.3.0" && /usr/bin/patch -p0'
94:debug:patch Executing command line:  cd "/opt/macports/var/macports/build/_opt_macports_var_macports_sources_rsync.macports.org_release_tarballs_ports_aqua_fltk/fltk/work/fltk-1.3.0" && /usr/bin/patch -p0 < '/opt/macports/var/macports/sources/rsync.macports.org/release/tarballs/ports/aqua/fltk/files/patch-src-filename_list.cxx.diff'
95:info:patch patching file src/filename_list.cxx
96:debug:patch Executing proc-post-org.macports.patch-patch-0
97:debug:patch Executing reinplace: /usr/bin/sed s|/Applications|/Applications/MacPorts/fltk|g < /opt/macports/var/macports/build/_opt_macports_var_macports_sources_rsync.macports.org_release_tarballs_ports_aqua_fltk/fltk/work/fltk-1.3.0/fluid/Makefile >@ file10
98:debug:patch euid/egid changed to: 0/0
99:debug:patch chowned /opt/macports/var/macports/build/_opt_macports_var_macports_sources_rsync.macports.org_release_tarballs_ports_aqua_fltk/fltk/work/fltk-1.3.0/fluid/Makefile to macports
100:debug:patch euid/egid changed to: 63920313/504
101:debug:patch euid/egid changed to: 0/0
102:debug:patch setting attributes on /opt/macports/var/macports/build/_opt_macports_var_macports_sources_rsync.macports.org_release_tarballs_ports_aqua_fltk/fltk/work/fltk-1.3.0/fluid/Makefile
103:debug:patch euid/egid changed to: 63920313/504
104:debug:patch Executing reinplace: /usr/bin/sed s|/Applications|/Applications/MacPorts/fltk|g < /opt/macports/var/macports/build/_opt_macports_var_macports_sources_rsync.macports.org_release_tarballs_ports_aqua_fltk/fltk/work/fltk-1.3.0/test/Makefile >@ file10
105:debug:patch euid/egid changed to: 0/0
106:debug:patch chowned /opt/macports/var/macports/build/_opt_macports_var_macports_sources_rsync.macports.org_release_tarballs_ports_aqua_fltk/fltk/work/fltk-1.3.0/test/Makefile to macports
107:debug:patch euid/egid changed to: 63920313/504
108:debug:patch euid/egid changed to: 0/0
109:debug:patch setting attributes on /opt/macports/var/macports/build/_opt_macports_var_macports_sources_rsync.macports.org_release_tarballs_ports_aqua_fltk/fltk/work/fltk-1.3.0/test/Makefile
110:debug:patch euid/egid changed to: 63920313/504
111:debug:patch Privilege de-escalation not attempted as not running as root.
112:debug:configure configure phase started at Wed Sep  5 08:06:23 CDT 2012
113:notice:configure --->  Configuring fltk
114:debug:configure Using compiler 'Mac OS X gcc 4.2'
115:debug:configure Executing org.macports.configure (fltk)
116:debug:configure Environment: CPATH='/opt/macports/include' CFLAGS='-pipe -O2 -arch x86_64 -arch i386' CPPFLAGS='-I/opt/macports/include' CXXFLAGS='-pipe -O2 -arch x86_64 -arch i386' LIBRARY_PATH='/opt/macports/lib' MACOSX_DEPLOYMENT_TARGET='10.6' CXX='/usr/bin/g++-4.2' CC_PRINT_OPTIONS_FILE='/opt/macports/var/macports/build/_opt_macports_var_macports_sources_rsync.macports.org_release_tarballs_ports_aqua_fltk/fltk/work/.CC_PRINT_OPTIONS' F90FLAGS='-pipe -O2' LDFLAGS='-L/opt/macports/lib -arch x86_64 -arch i386' OBJC='/usr/bin/gcc-4.2' FCFLAGS='-pipe -O2' INSTALL='/usr/bin/install -c' OBJCFLAGS='-pipe -O2 -arch x86_64 -arch i386' FFLAGS='-pipe -O2' CC_PRINT_OPTIONS='YES' CC='/usr/bin/gcc-4.2'
117:debug:configure Assembled command: 'cd "/opt/macports/var/macports/build/_opt_macports_var_macports_sources_rsync.macports.org_release_tarballs_ports_aqua_fltk/fltk/work/fltk-1.3.0" && ./configure --prefix=/opt/macports --disable-dependency-tracking --enable-shared --disable-localjpeg --disable-localzlib --disable-localpng --with-archflags="-arch x86_64 -arch i386"'
118:debug:configure Executing command line:  cd "/opt/macports/var/macports/build/_opt_macports_var_macports_sources_rsync.macports.org_release_tarballs_ports_aqua_fltk/fltk/work/fltk-1.3.0" && ./configure --prefix=/opt/macports --disable-dependency-tracking --enable-shared --disable-localjpeg --disable-localzlib --disable-localpng --with-archflags="-arch x86_64 -arch i386"
119:info:configure checking for gcc... /usr/bin/gcc-4.2
120:info:configure checking for C compiler default output file name... a.out
121:info:configure checking whether the C compiler works... yes
122:info:configure checking whether we are cross compiling... no
123:info:configure checking for suffix of executables...
124:info:configure checking for suffix of object files... o
125:info:configure checking whether we are using the GNU C compiler... yes
126:info:configure checking whether /usr/bin/gcc-4.2 accepts -g... yes
127:info:configure checking for /usr/bin/gcc-4.2 option to accept ISO C89... none needed
128:info:configure checking whether we are using the GNU C++ compiler... yes
129:info:configure checking whether /usr/bin/g++-4.2 accepts -g... yes
130:info:configure checking for a BSD-compatible install... /usr/bin/install -c
131:info:configure checking for nroff... /opt/macports/bin/nroff
132:info:configure checking for htmldoc... no
133:info:configure checking for doxygen... /opt/macports/bin/doxygen
134:info:configure checking for ranlib... ranlib
135:info:configure checking for ar... /opt/macports/bin/ar
136:info:configure checking for windres... no
137:info:configure checking for short... yes
138:info:configure checking size of short... 2
139:info:configure checking for int... yes
140:info:configure checking size of int... 4
141:info:configure checking for long... yes
142:info:configure checking size of long... 8
143:info:configure checking whether the compiler recognizes bool as a built-in type... yes
144:info:configure checking for dirent.h that defines DIR... yes
145:info:configure checking for library containing opendir... none required
146:info:configure checking sys/select.h usability... yes
147:info:configure checking sys/select.h presence... no
148:info:configure configure: WARNING: sys/select.h: accepted by the compiler, rejected by the preprocessor!
149:info:configure configure: WARNING: sys/select.h: proceeding with the compiler's result
150:info:configure checking for sys/select.h... yes
151:info:configure checking sys/stdtypes.h usability... no
152:info:configure checking sys/stdtypes.h presence... no
153:info:configure checking for sys/stdtypes.h... no
154:info:configure checking whether we have the POSIX compatible scandir() prototype... no
155:info:configure checking for scandir... yes
156:info:configure checking for vsnprintf... yes
157:info:configure checking for snprintf... yes
158:info:configure checking strings.h usability... yes
159:info:configure checking strings.h presence... no
160:info:configure configure: WARNING: strings.h: accepted by the compiler, rejected by the preprocessor!
161:info:configure configure: WARNING: strings.h: proceeding with the compiler's result
162:info:configure checking for strings.h... yes
163:info:configure checking for strcasecmp... yes
164:info:configure checking for strlcat... yes
165:info:configure checking for strlcpy... yes
166:info:configure checking locale.h usability... yes
167:info:configure checking locale.h presence... no
168:info:configure configure: WARNING: locale.h: accepted by the compiler, rejected by the preprocessor!
169:info:configure configure: WARNING: locale.h: proceeding with the compiler's result
170:info:configure checking for locale.h... yes
171:info:configure checking for localeconv... yes
172:info:configure checking for library containing pow... none required
173:info:configure checking for special C compiler options needed for large files... no
174:info:configure checking for _FILE_OFFSET_BITS value needed for large files... no
175:info:configure checking for long long int... yes
176:info:configure checking for strtoll... yes
177:info:configure checking for library containing dlsym... none required
178:info:configure checking dlfcn.h usability... yes
179:info:configure checking dlfcn.h presence... no
180:info:configure configure: WARNING: dlfcn.h: accepted by the compiler, rejected by the preprocessor!
181:info:configure configure: WARNING: dlfcn.h: proceeding with the compiler's result
182:info:configure checking for dlfcn.h... yes
183:info:configure checking for jpeg_CreateCompress in -ljpeg... yes
184:info:configure checking jpeglib.h usability... yes
185:info:configure checking jpeglib.h presence... no
186:info:configure configure: WARNING: jpeglib.h: accepted by the compiler, rejected by the preprocessor!
187:info:configure configure: WARNING: jpeglib.h: proceeding with the compiler's result
188:info:configure checking for jpeglib.h... yes
189:info:configure checking for gzgets in -lz... yes
190:info:configure checking zlib.h usability... yes
191:info:configure checking zlib.h presence... no
192:info:configure configure: WARNING: zlib.h: accepted by the compiler, rejected by the preprocessor!
193:info:configure configure: WARNING: zlib.h: proceeding with the compiler's result
194:info:configure checking for zlib.h... yes
195:info:configure checking for png_read_info in -lpng... yes
196:info:configure checking png.h usability... yes
197:info:configure checking png.h presence... no
198:info:configure configure: WARNING: png.h: accepted by the compiler, rejected by the preprocessor!
199:info:configure configure: WARNING: png.h: proceeding with the compiler's result
200:info:configure checking for png.h... yes
201:info:configure checking libpng/png.h usability... no
202:info:configure checking libpng/png.h presence... no
203:info:configure checking for libpng/png.h... no
204:info:configure checking for png_get_valid in -lpng... yes
205:info:configure checking for png_set_tRNS_to_alpha in -lpng... yes
206:info:configure checking pthread.h usability... yes
207:info:configure checking pthread.h presence... no
208:info:configure configure: WARNING: pthread.h: accepted by the compiler, rejected by the preprocessor!
209:info:configure configure: WARNING: pthread.h: proceeding with the compiler's result
210:info:configure checking for pthread.h... yes
211:info:configure checking for pthread_create using -lpthreads... no
212:info:configure checking for pthread_create using -lpthread... yes
213:info:configure checking if GCC supports -fno-exceptions... yes
214:info:configure checking if GCC supports -fno-strict-aliasing... yes
215:info:configure
216:info:configure Configuration Summary
217:info:configure -------------------------------------------------------------------------
218:info:configure     Directories: prefix=/opt/macports
219:info:configure                  bindir=${exec_prefix}/bin
220:info:configure                  datadir=${datarootdir}
221:info:configure                  datarootdir=${prefix}/share
222:info:configure                  exec_prefix=${prefix}
223:info:configure                  includedir=${prefix}/include
224:info:configure                  libdir=${exec_prefix}/lib
225:info:configure                  mandir=${datarootdir}/man
226:info:configure        Graphics: Quartz
227:info:configure Image Libraries: JPEG=System
228:info:configure                  PNG=System
229:info:configure                  ZLIB=System
230:info:configure     Large Files: YES
231:info:configure          OpenGL: YES
232:info:configure         Threads: YES
233:info:configure configure: creating ./config.status
234:info:configure config.status: creating makeinclude
235:info:configure config.status: creating fltk.list
236:info:configure config.status: creating fltk-config
237:info:configure config.status: creating fltk.spec
238:info:configure config.status: creating FL/Makefile
239:info:configure config.status: creating config.h
240:debug:configure Executing proc-post-org.macports.configure-configure-0
241:debug:configure Executing reinplace: /usr/bin/sed -E {s|-arch [a-z0-9_]+||g} < /opt/macports/var/macports/build/_opt_macports_var_macports_sources_rsync.macports.org_release_tarballs_ports_aqua_fltk/fltk/work/fltk-1.3.0/fltk-config >@ file10
242:debug:configure euid/egid changed to: 0/0
243:debug:configure chowned /opt/macports/var/macports/build/_opt_macports_var_macports_sources_rsync.macports.org_release_tarballs_ports_aqua_fltk/fltk/work/fltk-1.3.0/fltk-config to macports
244:debug:configure euid/egid changed to: 63920313/504
245:debug:configure euid/egid changed to: 0/0
246:debug:configure setting attributes on /opt/macports/var/macports/build/_opt_macports_var_macports_sources_rsync.macports.org_release_tarballs_ports_aqua_fltk/fltk/work/fltk-1.3.0/fltk-config
247:debug:configure euid/egid changed to: 63920313/504
248:debug:configure Privilege de-escalation not attempted as not running as root.
249:debug:build build phase started at Wed Sep  5 08:06:30 CDT 2012
250:notice:build --->  Building fltk
251:debug:build Executing org.macports.build (fltk)
252:debug:build Environment: CPATH='/opt/macports/include' CC_PRINT_OPTIONS_FILE='/opt/macports/var/macports/build/_opt_macports_var_macports_sources_rsync.macports.org_release_tarballs_ports_aqua_fltk/fltk/work/.CC_PRINT_OPTIONS' LIBRARY_PATH='/opt/macports/lib' CC_PRINT_OPTIONS='YES' MACOSX_DEPLOYMENT_TARGET='10.6'
253:debug:build Assembled command: 'cd "/opt/macports/var/macports/build/_opt_macports_var_macports_sources_rsync.macports.org_release_tarballs_ports_aqua_fltk/fltk/work/fltk-1.3.0" && /usr/bin/make -j8 -w all'
254:debug:build Executing command line:  cd "/opt/macports/var/macports/build/_opt_macports_var_macports_sources_rsync.macports.org_release_tarballs_ports_aqua_fltk/fltk/work/fltk-1.3.0" && /usr/bin/make -j8 -w all
255:info:build make: Entering directory `/opt/macports/var/macports/build/_opt_macports_var_macports_sources_rsync.macports.org_release_tarballs_ports_aqua_fltk/fltk/work/fltk-1.3.0'
256:info:build === making src ===
257:info:build make[1]: Entering directory `/opt/macports/var/macports/build/_opt_macports_var_macports_sources_rsync.macports.org_release_tarballs_ports_aqua_fltk/fltk/work/fltk-1.3.0/src'
258:info:build Compiling Fl_cocoa.mm...
259:info:build Compiling Fl_Quartz_Printer.mm...
260:info:build Compiling Fl_Native_File_Chooser_MAC.mm...
261:info:build Compiling Fl.cxx...
262:info:build Compiling Fl_Adjuster.cxx...
263:info:build Compiling Fl_Bitmap.cxx...
264:info:build Compiling Fl_Browser.cxx...
265:info:build Compiling Fl_Browser_.cxx...
266:info:build Compiling Fl_Browser_load.cxx...
267:info:build Compiling Fl_Box.cxx...
268:info:build Compiling Fl_Button.cxx...
269:info:build Compiling Fl_Chart.cxx...
270:info:build Compiling Fl_Check_Browser.cxx...
271:info:build Compiling Fl_Check_Button.cxx...
272:info:build Compiling Fl_Choice.cxx...
273:info:build Compiling Fl_Clock.cxx...
274:info:build Compiling Fl_Color_Chooser.cxx...
275:info:build Compiling Fl_Counter.cxx...
276:info:build Compiling Fl_Dial.cxx...
277:info:build Compiling Fl_Device.cxx...
278:info:build Compiling Fl_Double_Window.cxx...
279:info:build Compiling Fl_File_Browser.cxx...
280:info:build Compiling Fl_File_Chooser.cxx...
281:info:build Compiling Fl_File_Chooser2.cxx...
282:info:build Compiling Fl_File_Icon.cxx...
283:info:build Compiling Fl_File_Input.cxx...
284:info:build Compiling Fl_Group.cxx...
285:info:build Compiling Fl_Help_View.cxx...
286:info:build Compiling Fl_Image.cxx...
287:info:build Compiling Fl_Input.cxx...
288:info:build Compiling Fl_Input_.cxx...
289:info:build Compiling Fl_Light_Button.cxx...
290:info:build Compiling Fl_Menu.cxx...
291:info:build Compiling Fl_Menu_.cxx...
292:info:build Compiling Fl_Menu_Bar.cxx...
293:info:build Compiling Fl_Sys_Menu_Bar.cxx...
294:info:build Compiling Fl_Menu_Button.cxx...
295:info:build Compiling Fl_Menu_Window.cxx...
296:info:build Compiling Fl_Menu_add.cxx...
297:info:build Compiling Fl_Menu_global.cxx...
298:info:build Compiling Fl_Multi_Label.cxx...
299:info:build Compiling Fl_Native_File_Chooser.cxx...
300:info:build Compiling Fl_Overlay_Window.cxx...
301:info:build Compiling Fl_Pack.cxx...
302:info:build Compiling Fl_Paged_Device.cxx...
303:info:build Compiling Fl_Pixmap.cxx...
304:info:build Compiling Fl_Positioner.cxx...
305:info:build Compiling Fl_Preferences.cxx...
306:info:build Compiling Fl_Printer.cxx...
307:info:build Compiling Fl_Progress.cxx...
308:info:build Compiling Fl_Repeat_Button.cxx...
309:info:build Compiling Fl_Return_Button.cxx...
310:info:build Compiling Fl_Roller.cxx...
311:info:build Compiling Fl_Round_Button.cxx...
312:info:build Compiling Fl_Scroll.cxx...
313:info:build Compiling Fl_Scrollbar.cxx...
314:info:build Compiling Fl_Shared_Image.cxx...
315:info:build Compiling Fl_Single_Window.cxx...
316:info:build Compiling Fl_Slider.cxx...
317:info:build Compiling Fl_Table.cxx...
318:info:build Compiling Fl_Table_Row.cxx...
319:info:build Compiling Fl_Tabs.cxx...
320:info:build Compiling Fl_Text_Buffer.cxx...
321:info:build Compiling Fl_Text_Display.cxx...
322:info:build Compiling Fl_Text_Editor.cxx...
323:info:build Compiling Fl_Tile.cxx...
324:info:build Compiling Fl_Tiled_Image.cxx...
325:info:build Compiling Fl_Tree.cxx...
326:info:build Compiling Fl_Tree_Item.cxx...
327:info:build Compiling Fl_Tree_Item_Array.cxx...
328:info:build Compiling Fl_Tree_Prefs.cxx...
329:info:build Compiling Fl_Tooltip.cxx...
330:info:build Compiling Fl_Valuator.cxx...
331:info:build Compiling Fl_Value_Input.cxx...
332:info:build Compiling Fl_Value_Output.cxx...
333:info:build Compiling Fl_Value_Slider.cxx...
334:info:build Compiling Fl_Widget.cxx...
335:info:build Compiling Fl_Window.cxx...
336:info:build Compiling Fl_Window_fullscreen.cxx...
337:info:build Compiling Fl_Window_hotspot.cxx...
338:info:build Compiling Fl_Window_iconize.cxx...
339:info:build Compiling Fl_Wizard.cxx...
340:info:build Compiling Fl_XBM_Image.cxx...
341:info:build Compiling Fl_XPM_Image.cxx...
342:info:build Compiling Fl_abort.cxx...
343:info:build Compiling Fl_add_idle.cxx...
344:info:build Compiling Fl_arg.cxx...
345:info:build Compiling Fl_compose.cxx...
346:info:build Compiling Fl_display.cxx...
347:info:build Compiling Fl_get_key.cxx...
348:info:build Compiling Fl_get_system_colors.cxx...
349:info:build Compiling Fl_grab.cxx...
350:info:build Compiling Fl_lock.cxx...
351:info:build Compiling Fl_own_colormap.cxx...
352:info:build Compiling Fl_visual.cxx...
353:info:build Compiling Fl_x.cxx...
354:info:build Compiling filename_absolute.cxx...
355:info:build Compiling filename_expand.cxx...
356:info:build Compiling filename_ext.cxx...
357:info:build Compiling filename_isdir.cxx...
358:info:build Compiling filename_list.cxx...
359:info:build filename_list.cxx: In function ‘int fl_filename_list(const char*, dirent***, int (*)(dirent**, dirent**))’:
360:info:build filename_list.cxx:120: error: invalid conversion from ‘int (*)(const dirent**, const dirent**)’ to ‘int (*)(const void*, const void*)’
361:info:build filename_list.cxx:120: error:   initializing argument 4 of ‘int scandir(const char*, dirent***, int (*)(dirent*), int (*)(const void*, const void*))’
362:info:build Compiling filename_match.cxx...
363:info:build filename_list.cxx: In function ‘int fl_filename_list(const char*, dirent***, int (*)(dirent**, dirent**))’:
364:info:build filename_list.cxx:120: error: invalid conversion from ‘int (*)(const dirent**, const dirent**)’ to ‘int (*)(const void*, const void*)’
365:info:build filename_list.cxx:120: error:   initializing argument 4 of ‘int scandir(const char*, dirent***, int (*)(dirent*), int (*)(const void*, const void*))’
366:info:build lipo: can't open input file: /var/tmp//ccOqTp1N.out (No such file or directory)
367:info:build make[1]: *** [filename_list.o] Error 1
368:info:build make[1]: *** Waiting for unfinished jobs....
369:info:build make[1]: Leaving directory `/opt/macports/var/macports/build/_opt_macports_var_macports_sources_rsync.macports.org_release_tarballs_ports_aqua_fltk/fltk/work/fltk-1.3.0/src'
370:info:build make: *** [all] Error 1
371:info:build make: Leaving directory `/opt/macports/var/macports/build/_opt_macports_var_macports_sources_rsync.macports.org_release_tarballs_ports_aqua_fltk/fltk/work/fltk-1.3.0'
372:info:build Command failed:  cd "/opt/macports/var/macports/build/_opt_macports_var_macports_sources_rsync.macports.org_release_tarballs_ports_aqua_fltk/fltk/work/fltk-1.3.0" && /usr/bin/make -j8 -w all
373:info:build Exit code: 2
374:error:build org.macports.build for port fltk returned: command execution failed
375:debug:build Error code: CHILDSTATUS 76482 2
376:debug:build Backtrace: command execution failed
377    while executing
378"system -nice 0 $fullcmdstring"
379    ("eval" body line 1)
380    invoked from within
381"eval system $notty $nice \$fullcmdstring"
382    invoked from within
383"command_exec build"
384    (procedure "portbuild::build_main" line 8)
385    invoked from within
386"$procedure $targetname"
387:info:build Warning: targets not executed for fltk: org.macports.activate org.macports.build org.macports.destroot org.macports.install
388:notice:build Please see the log file for port fltk for details:
389    /opt/macports/var/macports/logs/_opt_macports_var_macports_sources_rsync.macports.org_release_tarballs_ports_aqua_fltk/fltk/main.log