Ticket #36438: main.log

File main.log, 9.6 KB (added by ahelfer1971@…, 7 years ago)

libgdiplus buidl log

Line 
1version:1
2:msg:clean --->  Computing dependencies for libgdiplus:info:clean .:debug:clean libgdiplus has no conflicts
3:debug:clean Searching for dependency: pkgconfig
4:debug:clean Found Dependency: receipt exists for pkgconfig
5:debug:clean Searching for dependency: jpeg
6:debug:clean Found Dependency: receipt exists for jpeg
7:debug:clean Searching for dependency: tiff
8:debug:clean Found Dependency: receipt exists for tiff
9:debug:clean Searching for dependency: giflib
10:debug:clean Found Dependency: receipt exists for giflib
11:debug:clean Searching for dependency: libpng
12:debug:clean Found Dependency: receipt exists for libpng
13:debug:clean Searching for dependency: zlib
14:debug:clean Found Dependency: receipt exists for zlib
15:debug:clean Searching for dependency: fontconfig
16:debug:clean Found Dependency: receipt exists for fontconfig
17:debug:clean Searching for dependency: libiconv
18:debug:clean Found Dependency: receipt exists for libiconv
19:debug:clean Searching for dependency: libexif
20:debug:clean Found Dependency: receipt exists for libexif
21:debug:clean Searching for dependency: glib2
22:debug:clean Found Dependency: receipt exists for glib2
23:debug:clean Searching for dependency: cairo
24:debug:clean Found Dependency: receipt exists for cairo
25:debug:clean Searching for dependency: xorg-libsm
26:debug:clean Found Dependency: receipt exists for xorg-libsm
27:debug:clean Searching for dependency: xrender
28:debug:clean Found Dependency: receipt exists for xrender
29:msg:clean
30:debug:main Executing org.macports.main (libgdiplus)
31:debug:main changing euid/egid - current euid: 0 - current egid: 0
32:debug:main egid changed to: 501
33:debug:main euid changed to: 502
34:debug:main Skipping completed org.macports.archivefetch (libgdiplus)
35:debug:main Privilege de-escalation not attempted as not running as root.
36:debug:main Skipping completed org.macports.fetch (libgdiplus)
37:debug:main Privilege de-escalation not attempted as not running as root.
38:debug:main Skipping completed org.macports.checksum (libgdiplus)
39:debug:main Privilege de-escalation not attempted as not running as root.
40:debug:main Skipping completed org.macports.extract (libgdiplus)
41:debug:main Privilege de-escalation not attempted as not running as root.
42:debug:main Skipping completed org.macports.patch (libgdiplus)
43:debug:main Privilege de-escalation not attempted as not running as root.
44:debug:main Skipping completed org.macports.configure (libgdiplus)
45:debug:main Privilege de-escalation not attempted as not running as root.
46:debug:build build phase started at Tue Oct  2 20:44:28 CDT 2012
47:notice:build --->  Building libgdiplus
48:debug:build Executing org.macports.build (libgdiplus)
49:debug:build Environment: CPATH='/opt/local/include' CC_PRINT_OPTIONS_FILE='/opt/local/var/macports/build/_opt_local_var_macports_sources_rsync.macports.org_release_ports_devel_libgdiplus/libgdiplus/work/.CC_PRINT_OPTIONS' LIBRARY_PATH='/opt/local/lib' CC_PRINT_OPTIONS='YES' MACOSX_DEPLOYMENT_TARGET='10.7'
50:debug:build Assembled command: 'cd "/opt/local/var/macports/build/_opt_local_var_macports_sources_rsync.macports.org_release_ports_devel_libgdiplus/libgdiplus/work/libgdiplus-2.10.9" && /usr/bin/make -j2 -w all'
51:debug:build Executing command line:  cd "/opt/local/var/macports/build/_opt_local_var_macports_sources_rsync.macports.org_release_ports_devel_libgdiplus/libgdiplus/work/libgdiplus-2.10.9" && /usr/bin/make -j2 -w all
52:info:build make: Entering directory `/opt/local/var/macports/build/_opt_local_var_macports_sources_rsync.macports.org_release_ports_devel_libgdiplus/libgdiplus/work/libgdiplus-2.10.9'
53:info:build /usr/bin/make  all-recursive
54:info:build make[1]: Entering directory `/opt/local/var/macports/build/_opt_local_var_macports_sources_rsync.macports.org_release_ports_devel_libgdiplus/libgdiplus/work/libgdiplus-2.10.9'
55:info:build Making all in src
56:info:build make[2]: Entering directory `/opt/local/var/macports/build/_opt_local_var_macports_sources_rsync.macports.org_release_ports_devel_libgdiplus/libgdiplus/work/libgdiplus-2.10.9/src'
57:info:build make[2]: Nothing to be done for `all'.
58:info:build make[2]: Leaving directory `/opt/local/var/macports/build/_opt_local_var_macports_sources_rsync.macports.org_release_ports_devel_libgdiplus/libgdiplus/work/libgdiplus-2.10.9/src'
59:info:build Making all in tests
60:info:build make[2]: Entering directory `/opt/local/var/macports/build/_opt_local_var_macports_sources_rsync.macports.org_release_ports_devel_libgdiplus/libgdiplus/work/libgdiplus-2.10.9/tests'
61:info:build /bin/sh ../libtool --tag=CC   --mode=link /usr/bin/clang  -no-cpp-precomp -pipe -O2 -arch x86_64 -arch i386 -lpthread  -flat_namespace -undefined suppress -L/opt/local/lib -arch x86_64 -arch i386 -o testgdi testgdi.o ../src/libgdiplus.la -lfontconfig
62:info:build /bin/sh ../libtool --tag=CC   --mode=link /usr/bin/clang  -no-cpp-precomp -pipe -O2 -arch x86_64 -arch i386 -lpthread  -flat_namespace -undefined suppress -L/opt/local/lib -arch x86_64 -arch i386 -o testbits testbits.o ../src/libgdiplus.la -lfontconfig
63:info:build libtool: link: /usr/bin/clang -no-cpp-precomp -pipe -O2 -arch x86_64 -arch i386 -flat_namespace -undefined suppress -arch x86_64 -arch i386 -o .libs/testbits testbits.o  -L/opt/local/lib ../src/.libs/libgdiplus.dylib -lpthread /opt/local/lib/libglib-2.0.dylib -lresolv /opt/local/lib/libcairo.dylib /opt/local/lib/libpixman-1.dylib /opt/local/lib/libxcb-shm.dylib /opt/local/lib/libX11-xcb.dylib /opt/local/lib/libxcb-render.dylib /opt/local/lib/libXrender.dylib -L/lib /opt/local/lib/libtiff.dylib /opt/local/lib/libjpeg.dylib /opt/local/lib/libgif.dylib /opt/local/lib/libSM.dylib /opt/local/lib/libICE.dylib /opt/local/lib/libX11.dylib /opt/local/lib/libxcb.dylib /opt/local/lib/libXau.dylib /opt/local/lib/libXdmcp.dylib /opt/local/lib/libpng15.dylib /opt/local/lib/libexif.dylib /opt/local/lib/libintl.dylib -lc -lm /opt/local/lib/libfontconfig.dylib /opt/local/lib/libiconv.dylib /opt/local/lib/libfreetype.dylib -lz -lbz2 /opt/local/lib/libexpat.dylib -framework Foundation -framework Carbon
64:info:build libtool: link: /usr/bin/clang -no-cpp-precomp -pipe -O2 -arch x86_64 -arch i386 -flat_namespace -undefined suppress -arch x86_64 -arch i386 -o .libs/testgdi testgdi.o  -L/opt/local/lib ../src/.libs/libgdiplus.dylib -lpthread /opt/local/lib/libglib-2.0.dylib -lresolv /opt/local/lib/libcairo.dylib /opt/local/lib/libpixman-1.dylib /opt/local/lib/libxcb-shm.dylib /opt/local/lib/libX11-xcb.dylib /opt/local/lib/libxcb-render.dylib /opt/local/lib/libXrender.dylib -L/lib /opt/local/lib/libtiff.dylib /opt/local/lib/libjpeg.dylib /opt/local/lib/libgif.dylib /opt/local/lib/libSM.dylib /opt/local/lib/libICE.dylib /opt/local/lib/libX11.dylib /opt/local/lib/libxcb.dylib /opt/local/lib/libXau.dylib /opt/local/lib/libXdmcp.dylib /opt/local/lib/libpng15.dylib /opt/local/lib/libexif.dylib /opt/local/lib/libintl.dylib -lc -lm /opt/local/lib/libfontconfig.dylib /opt/local/lib/libiconv.dylib /opt/local/lib/libfreetype.dylib -lz -lbz2 /opt/local/lib/libexpat.dylib -framework Foundation -framework Carbon
65:info:build clang: warning: argument unused during compilation: '-no-cpp-precomp'
66:info:build clang: warning: argument unused during compilation: '-no-cpp-precomp'
67:info:build ld: warning: directory not found for option '-L/lib'
68:info:build ld: warning: directory not found for option '-L/lib'
69:info:build ld: warning: directory not found for option '-L/lib'
70:info:build ld: warning: directory not found for option '-L/lib'
71:info:build ld: in /opt/local/lib/libstdc++.6.dylib, file was built for unsupported file format which is not the architecture being linked (i386) for architecture i386
72:info:build ld: in /opt/local/lib/libstdc++.6.dylib, file was built for unsupported file format which is not the architecture being linked (i386) for architecture i386
73:info:build clang: error: linker command failed with exit code 1 (use -v to see invocation)
74:info:build clang: error: linker command failed with exit code 1 (use -v to see invocation)
75:info:build make[2]: *** [testgdi] Error 1
76:info:build make[2]: *** Waiting for unfinished jobs....
77:info:build make[2]: *** [testbits] Error 1
78:info:build make[2]: Leaving directory `/opt/local/var/macports/build/_opt_local_var_macports_sources_rsync.macports.org_release_ports_devel_libgdiplus/libgdiplus/work/libgdiplus-2.10.9/tests'
79:info:build make[1]: *** [all-recursive] Error 1
80:info:build make[1]: Leaving directory `/opt/local/var/macports/build/_opt_local_var_macports_sources_rsync.macports.org_release_ports_devel_libgdiplus/libgdiplus/work/libgdiplus-2.10.9'
81:info:build make: *** [all] Error 2
82:info:build make: Leaving directory `/opt/local/var/macports/build/_opt_local_var_macports_sources_rsync.macports.org_release_ports_devel_libgdiplus/libgdiplus/work/libgdiplus-2.10.9'
83:info:build Command failed:  cd "/opt/local/var/macports/build/_opt_local_var_macports_sources_rsync.macports.org_release_ports_devel_libgdiplus/libgdiplus/work/libgdiplus-2.10.9" && /usr/bin/make -j2 -w all
84:info:build Exit code: 2
85:error:build org.macports.build for port libgdiplus returned: command execution failed
86:debug:build Error code: CHILDSTATUS 80755 2
87:debug:build Backtrace: command execution failed
88    while executing
89"system -nice 0 $fullcmdstring"
90    ("eval" body line 1)
91    invoked from within
92"eval system $notty $nice \$fullcmdstring"
93    invoked from within
94"command_exec build"
95    (procedure "portbuild::build_main" line 8)
96    invoked from within
97"$procedure $targetname"
98:info:build Warning: targets not executed for libgdiplus: org.macports.install org.macports.build org.macports.destroot
99:notice:build Please see the log file for port libgdiplus for details:
100    /opt/local/var/macports/logs/_opt_local_var_macports_sources_rsync.macports.org_release_ports_devel_libgdiplus/libgdiplus/main.log