Ticket #36782: main.log

File main.log, 64.6 KB (added by jeremy.booker@…, 8 years ago)
Line 
1version:1
2:debug:main Attempting ln -sf /opt/local/var/macports/build/_opt_local_var_macports_sources_rsync.macports.org_release_tarballs_ports_security_cyrus-sasl2/cyrus-sasl2/work /opt/local/var/macports/sources/rsync.macports.org/release/tarballs/ports/security/cyrus-sasl2/work
3:debug:main changing euid/egid - current euid: 0 - current egid: 0
4:debug:main egid changed to: 501
5:debug:main euid changed to: 502
6:debug:main Executing org.macports.main (cyrus-sasl2)
7:debug:main Privilege de-escalation not attempted as not running as root.
8:debug:archivefetch archivefetch phase started at Mon Oct 29 12:37:01 EDT 2012
9:msg:archivefetch --->  Fetching archive for cyrus-sasl2
10:debug:archivefetch Executing org.macports.archivefetch (cyrus-sasl2)
11:debug:archivefetch euid/egid changed to: 0/0
12:debug:archivefetch chowned /opt/local/var/macports/incoming to macports
13:debug:archivefetch euid/egid changed to: 502/501
14:info:archivefetch --->  cyrus-sasl2-2.1.25_3+kerberos+universal.darwin_10.i386-x86_64.tbz2 doesn't seem to exist in /opt/local/var/macports/incoming/verified
15:msg:archivefetch --->  Attempting to fetch cyrus-sasl2-2.1.25_3+kerberos+universal.darwin_10.i386-x86_64.tbz2 from http://packages.macports.org/cyrus-sasl2
16:debug:archivefetch Fetching archive failed:: The requested URL returned error: 404
17:msg:archivefetch --->  Attempting to fetch cyrus-sasl2-2.1.25_3+kerberos+universal.darwin_10.i386-x86_64.tbz2 from http://lil.fr.packages.macports.org/cyrus-sasl2
18:debug:archivefetch Fetching archive failed:: The requested URL returned error: 404
19:msg:archivefetch --->  Attempting to fetch cyrus-sasl2-2.1.25_3+kerberos+universal.darwin_10.i386-x86_64.tbz2 from http://mse.uk.packages.macports.org/sites/packages.macports.org/cyrus-sasl2
20:debug:archivefetch Fetching archive failed:: The requested URL returned error: 404
21:debug:archivefetch Privilege de-escalation not attempted as not running as root.
22:debug:fetch fetch phase started at Mon Oct 29 12:37:04 EDT 2012
23:notice:fetch --->  Fetching distfiles for cyrus-sasl2
24:debug:fetch Executing org.macports.fetch (cyrus-sasl2)
25:debug:fetch Privilege de-escalation not attempted as not running as root.
26:debug:checksum checksum phase started at Mon Oct 29 12:37:04 EDT 2012
27:notice:checksum --->  Verifying checksum(s) for cyrus-sasl2
28:debug:checksum Executing org.macports.checksum (cyrus-sasl2)
29:info:checksum --->  Checksumming cyrus-sasl-2.1.25.tar.gz
30:debug:checksum Correct (rmd160) checksum for cyrus-sasl-2.1.25.tar.gz
31:debug:checksum Correct (sha256) checksum for cyrus-sasl-2.1.25.tar.gz
32:debug:checksum Privilege de-escalation not attempted as not running as root.
33:debug:extract extract phase started at Mon Oct 29 12:37:04 EDT 2012
34:notice:extract --->  Extracting cyrus-sasl2
35:debug:extract Executing org.macports.extract (cyrus-sasl2)
36:info:extract --->  Extracting cyrus-sasl-2.1.25.tar.gz
37:debug:extract setting option extract.args to '/opt/local/var/macports/distfiles/cyrus-sasl2/cyrus-sasl-2.1.25.tar.gz'
38:debug:extract Environment: CPATH='/opt/local/include' CC_PRINT_OPTIONS_FILE='/opt/local/var/macports/build/_opt_local_var_macports_sources_rsync.macports.org_release_tarballs_ports_security_cyrus-sasl2/cyrus-sasl2/work/.CC_PRINT_OPTIONS' LIBRARY_PATH='/opt/local/lib' CC_PRINT_OPTIONS='YES' MACOSX_DEPLOYMENT_TARGET='10.6'
39:debug:extract Assembled command: 'cd "/opt/local/var/macports/build/_opt_local_var_macports_sources_rsync.macports.org_release_tarballs_ports_security_cyrus-sasl2/cyrus-sasl2/work" && /usr/bin/gzip -dc '/opt/local/var/macports/distfiles/cyrus-sasl2/cyrus-sasl-2.1.25.tar.gz' | /usr/bin/gnutar --no-same-owner -xf -'
40:debug:extract Executing command line:  cd "/opt/local/var/macports/build/_opt_local_var_macports_sources_rsync.macports.org_release_tarballs_ports_security_cyrus-sasl2/cyrus-sasl2/work" && /usr/bin/gzip -dc '/opt/local/var/macports/distfiles/cyrus-sasl2/cyrus-sasl-2.1.25.tar.gz' | /usr/bin/gnutar --no-same-owner -xf -
41:debug:extract euid/egid changed to: 0/0
42:debug:extract chowned /opt/local/var/macports/build/_opt_local_var_macports_sources_rsync.macports.org_release_tarballs_ports_security_cyrus-sasl2/cyrus-sasl2/work to macports
43:debug:extract euid/egid changed to: 502/501
44:debug:extract Privilege de-escalation not attempted as not running as root.
45:debug:patch patch phase started at Mon Oct 29 12:37:06 EDT 2012
46:debug:patch Executing org.macports.patch (cyrus-sasl2)
47:notice:patch --->  Applying patches to cyrus-sasl2
48:info:patch --->  Applying patch-config_ltconfig
49:debug:patch Environment: CPATH='/opt/local/include' CC_PRINT_OPTIONS_FILE='/opt/local/var/macports/build/_opt_local_var_macports_sources_rsync.macports.org_release_tarballs_ports_security_cyrus-sasl2/cyrus-sasl2/work/.CC_PRINT_OPTIONS' LIBRARY_PATH='/opt/local/lib' CC_PRINT_OPTIONS='YES' MACOSX_DEPLOYMENT_TARGET='10.6'
50:debug:patch Assembled command: 'cd "/opt/local/var/macports/build/_opt_local_var_macports_sources_rsync.macports.org_release_tarballs_ports_security_cyrus-sasl2/cyrus-sasl2/work/cyrus-sasl-2.1.25" && /usr/bin/patch -p0'
51:debug:patch Executing command line:  cd "/opt/local/var/macports/build/_opt_local_var_macports_sources_rsync.macports.org_release_tarballs_ports_security_cyrus-sasl2/cyrus-sasl2/work/cyrus-sasl-2.1.25" && /usr/bin/patch -p0 < '/opt/local/var/macports/sources/rsync.macports.org/release/tarballs/ports/security/cyrus-sasl2/files/patch-config_ltconfig'
52:info:patch patching file config/ltconfig
53:info:patch --->  Applying patch-saslauthd_config_ltconfig
54:debug:patch Environment: CPATH='/opt/local/include' CC_PRINT_OPTIONS_FILE='/opt/local/var/macports/build/_opt_local_var_macports_sources_rsync.macports.org_release_tarballs_ports_security_cyrus-sasl2/cyrus-sasl2/work/.CC_PRINT_OPTIONS' LIBRARY_PATH='/opt/local/lib' CC_PRINT_OPTIONS='YES' MACOSX_DEPLOYMENT_TARGET='10.6'
55:debug:patch Assembled command: 'cd "/opt/local/var/macports/build/_opt_local_var_macports_sources_rsync.macports.org_release_tarballs_ports_security_cyrus-sasl2/cyrus-sasl2/work/cyrus-sasl-2.1.25" && /usr/bin/patch -p0'
56:debug:patch Executing command line:  cd "/opt/local/var/macports/build/_opt_local_var_macports_sources_rsync.macports.org_release_tarballs_ports_security_cyrus-sasl2/cyrus-sasl2/work/cyrus-sasl-2.1.25" && /usr/bin/patch -p0 < '/opt/local/var/macports/sources/rsync.macports.org/release/tarballs/ports/security/cyrus-sasl2/files/patch-saslauthd_config_ltconfig'
57:info:patch patching file saslauthd/config/ltconfig
58:info:patch --->  Applying patch-utils_Makefile.in.diff
59:debug:patch Environment: CPATH='/opt/local/include' CC_PRINT_OPTIONS_FILE='/opt/local/var/macports/build/_opt_local_var_macports_sources_rsync.macports.org_release_tarballs_ports_security_cyrus-sasl2/cyrus-sasl2/work/.CC_PRINT_OPTIONS' LIBRARY_PATH='/opt/local/lib' CC_PRINT_OPTIONS='YES' MACOSX_DEPLOYMENT_TARGET='10.6'
60:debug:patch Assembled command: 'cd "/opt/local/var/macports/build/_opt_local_var_macports_sources_rsync.macports.org_release_tarballs_ports_security_cyrus-sasl2/cyrus-sasl2/work/cyrus-sasl-2.1.25" && /usr/bin/patch -p0'
61:debug:patch Executing command line:  cd "/opt/local/var/macports/build/_opt_local_var_macports_sources_rsync.macports.org_release_tarballs_ports_security_cyrus-sasl2/cyrus-sasl2/work/cyrus-sasl-2.1.25" && /usr/bin/patch -p0 < '/opt/local/var/macports/sources/rsync.macports.org/release/tarballs/ports/security/cyrus-sasl2/files/patch-utils_Makefile.in.diff'
62:info:patch patching file utils/Makefile.in
63:info:patch --->  Applying patch-gssapi.c.diff
64:debug:patch Environment: CPATH='/opt/local/include' CC_PRINT_OPTIONS_FILE='/opt/local/var/macports/build/_opt_local_var_macports_sources_rsync.macports.org_release_tarballs_ports_security_cyrus-sasl2/cyrus-sasl2/work/.CC_PRINT_OPTIONS' LIBRARY_PATH='/opt/local/lib' CC_PRINT_OPTIONS='YES' MACOSX_DEPLOYMENT_TARGET='10.6'
65:debug:patch Assembled command: 'cd "/opt/local/var/macports/build/_opt_local_var_macports_sources_rsync.macports.org_release_tarballs_ports_security_cyrus-sasl2/cyrus-sasl2/work/cyrus-sasl-2.1.25" && /usr/bin/patch -p0'
66:debug:patch Executing command line:  cd "/opt/local/var/macports/build/_opt_local_var_macports_sources_rsync.macports.org_release_tarballs_ports_security_cyrus-sasl2/cyrus-sasl2/work/cyrus-sasl-2.1.25" && /usr/bin/patch -p0 < '/opt/local/var/macports/sources/rsync.macports.org/release/tarballs/ports/security/cyrus-sasl2/files/patch-gssapi.c.diff'
67:info:patch patching file plugins/gssapi.c
68:info:patch --->  Applying patch-lib_saslutil.c.diff
69:debug:patch Environment: CPATH='/opt/local/include' CC_PRINT_OPTIONS_FILE='/opt/local/var/macports/build/_opt_local_var_macports_sources_rsync.macports.org_release_tarballs_ports_security_cyrus-sasl2/cyrus-sasl2/work/.CC_PRINT_OPTIONS' LIBRARY_PATH='/opt/local/lib' CC_PRINT_OPTIONS='YES' MACOSX_DEPLOYMENT_TARGET='10.6'
70:debug:patch Assembled command: 'cd "/opt/local/var/macports/build/_opt_local_var_macports_sources_rsync.macports.org_release_tarballs_ports_security_cyrus-sasl2/cyrus-sasl2/work/cyrus-sasl-2.1.25" && /usr/bin/patch -p0'
71:debug:patch Executing command line:  cd "/opt/local/var/macports/build/_opt_local_var_macports_sources_rsync.macports.org_release_tarballs_ports_security_cyrus-sasl2/cyrus-sasl2/work/cyrus-sasl-2.1.25" && /usr/bin/patch -p0 < '/opt/local/var/macports/sources/rsync.macports.org/release/tarballs/ports/security/cyrus-sasl2/files/patch-lib_saslutil.c.diff'
72:info:patch patching file lib/saslutil.c
73:debug:patch Privilege de-escalation not attempted as not running as root.
74:debug:configure configure phase started at Mon Oct 29 12:37:06 EDT 2012
75:notice:configure --->  Configuring cyrus-sasl2
76:debug:configure Using compiler 'Mac OS X gcc 4.2'
77:debug:configure Executing org.macports.configure (cyrus-sasl2)
78:info:configure --->  Configuring cyrus-sasl2 for architecture x86_64
79:debug:configure Environment: CPATH='/opt/local/include' CFLAGS='-pipe -O2 -arch x86_64' CPPFLAGS='-I/opt/local/include' CXXFLAGS='-pipe -O2 -arch x86_64' LIBRARY_PATH='/opt/local/lib' MACOSX_DEPLOYMENT_TARGET='10.6' CXX='/usr/bin/g++-4.2' CC_PRINT_OPTIONS_FILE='/opt/local/var/macports/build/_opt_local_var_macports_sources_rsync.macports.org_release_tarballs_ports_security_cyrus-sasl2/cyrus-sasl2/work/.CC_PRINT_OPTIONS' F90FLAGS='-pipe -O2 -m64' LDFLAGS='-L/opt/local/lib -arch x86_64' FCFLAGS='-pipe -O2 -m64' OBJC='/usr/bin/gcc-4.2' INSTALL='/usr/bin/install -c' NM='/usr/bin/nm' OBJCFLAGS='-pipe -O2 -arch x86_64' FFLAGS='-pipe -O2 -m64' CC_PRINT_OPTIONS='YES' CC='/usr/bin/gcc-4.2'
80:debug:configure Assembled command: 'cd "/opt/local/var/macports/build/_opt_local_var_macports_sources_rsync.macports.org_release_tarballs_ports_security_cyrus-sasl2/cyrus-sasl2/work/cyrus-sasl-2.1.25-x86_64" && ./configure --prefix=/opt/local --disable-dependency-tracking --mandir=/opt/local/share/man --with-openssl=/opt/local --with-dbpath=/opt/local/etc/sasldb2 --with-plugindir=/opt/local/lib/sasl2 --with-saslauthd=/opt/local/var/state/saslauthd --with-pwcheck=/opt/local/var/pwcheck --disable-macos-framework --enable-srp --enable-srp-setpass --enable-login --enable-ntlm --with-rc4=openssl --disable-dependency-tracking --enable-keep-db-open --with-gss_impl=mit --enable-gssapi=/opt/local --host=x86_64-apple-darwin10.8.0'
81:debug:configure Executing command line:  cd "/opt/local/var/macports/build/_opt_local_var_macports_sources_rsync.macports.org_release_tarballs_ports_security_cyrus-sasl2/cyrus-sasl2/work/cyrus-sasl-2.1.25-x86_64" && ./configure --prefix=/opt/local --disable-dependency-tracking --mandir=/opt/local/share/man --with-openssl=/opt/local --with-dbpath=/opt/local/etc/sasldb2 --with-plugindir=/opt/local/lib/sasl2 --with-saslauthd=/opt/local/var/state/saslauthd --with-pwcheck=/opt/local/var/pwcheck --disable-macos-framework --enable-srp --enable-srp-setpass --enable-login --enable-ntlm --with-rc4=openssl --disable-dependency-tracking --enable-keep-db-open --with-gss_impl=mit --enable-gssapi=/opt/local --host=x86_64-apple-darwin10.8.0
82:info:configure configure: WARNING: If you wanted to set the --build type, don't use --host.
83:info:configure     If a cross compiler is detected then cross compile mode will be used.
84:info:configure configure: creating cache ./config.cache
85:info:configure checking build system type... i386-apple-darwin10.8.0
86:info:configure checking host system type... x86_64-apple-darwin10.8.0
87:info:configure checking target system type... x86_64-apple-darwin10.8.0
88:info:configure checking for a BSD-compatible install... /usr/bin/install -c
89:info:configure checking whether build environment is sane... yes
90:info:configure checking for x86_64-apple-darwin10.8.0-strip... no
91:info:configure checking for strip... strip
92:info:configure checking for a thread-safe mkdir -p... config/install-sh -c -d
93:info:configure checking for gawk... no
94:info:configure checking for mawk... no
95:info:configure checking for nawk... no
96:info:configure checking for awk... awk
97:info:configure checking whether make sets $(MAKE)... yes
98:info:configure checking for x86_64-apple-darwin10.8.0-gcc... /usr/bin/gcc-4.2
99:info:configure checking for C compiler default output file name... a.out
100:info:configure checking whether the C compiler works... yes
101:info:configure checking whether we are cross compiling... yes
102:info:configure checking for suffix of executables...
103:info:configure checking for suffix of object files... o
104:info:configure checking whether we are using the GNU C compiler... yes
105:info:configure checking whether /usr/bin/gcc-4.2 accepts -g... yes
106:info:configure checking for /usr/bin/gcc-4.2 option to accept ISO C89... none needed
107:info:configure checking for style of include used by make... GNU
108:info:configure checking dependency style of /usr/bin/gcc-4.2... none
109:info:configure checking how to run the C preprocessor... /usr/bin/gcc-4.2 -E
110:info:configure checking for gawk... (cached) awk
111:info:configure checking whether ln -s works... yes
112:info:configure checking whether make sets $(MAKE)... (cached) yes
113:info:configure checking for a BSD-compatible install... /usr/bin/install -c
114:info:configure checking for __attribute__... yes
115:info:configure checking for runpath switch... -Wl,-rpath,
116:info:configure checking for x86_64-apple-darwin10.8.0-ranlib... no
117:info:configure checking for ranlib... ranlib
118:info:configure configure: WARNING: using cross tools not prefixed with host triplet
119:info:configure checking for ld used by GCC... /usr/libexec/gcc/i686-apple-darwin10/4.2.1/ld
120:info:configure checking if the linker (/usr/libexec/gcc/i686-apple-darwin10/4.2.1/ld) is GNU ld... no
121:info:configure checking for BSD-compatible nm... /usr/bin/nm
122:info:configure configure: updating cache ./config.cache
123:info:configure loading cache ./config.cache within ltconfig
124:info:configure checking for object suffix... o
125:info:configure checking for executable suffix... no
126:info:configure checking for /usr/bin/gcc-4.2 option to produce PIC... -fno-common
127:info:configure checking if /usr/bin/gcc-4.2 PIC flag -fno-common works... yes
128:info:configure checking if /usr/bin/gcc-4.2 supports -c -o file.o... yes
129:info:configure checking if /usr/bin/gcc-4.2 supports -c -o file.lo... yes
130:info:configure checking if /usr/bin/gcc-4.2 supports -fno-rtti -fno-exceptions ... no
131:info:configure checking if /usr/bin/gcc-4.2 static flag -static works... none
132:info:configure checking if the linker (/usr/libexec/gcc/i686-apple-darwin10/4.2.1/ld) is GNU ld... no
133:info:configure checking whether the linker (/usr/libexec/gcc/i686-apple-darwin10/4.2.1/ld) supports shared libraries... yes
134:info:configure checking command to parse /usr/bin/nm output... ok
135:info:configure checking how to hardcode library paths into programs... unsupported
136:info:configure checking for /usr/libexec/gcc/i686-apple-darwin10/4.2.1/ld option to reload object files... -r
137:info:configure checking dynamic linker characteristics... darwin10.8.0 dyld
138:info:configure checking if libtool supports shared libraries... yes
139:info:configure checking whether to build shared libraries... yes
140:info:configure checking whether to build static libraries... no
141:info:configure checking for objdir... .libs
142:info:configure creating libtool
143:info:configure updating cache ./config.cache
144:info:configure configure: loading cache ./config.cache
145:info:configure checking for connect... yes
146:info:configure checking for res_search... yes
147:info:configure checking for dn_expand... yes
148:info:configure checking for dns_lookup... no
149:info:configure checking DB path to use... /opt/local/etc/sasldb2
150:info:configure checking for grep that handles long lines and -e... /usr/bin/grep
151:info:configure checking for egrep... /usr/bin/grep -E
152:info:configure checking for ANSI C header files... yes
153:info:configure checking for sys/types.h... yes
154:info:configure checking for sys/stat.h... yes
155:info:configure checking for stdlib.h... yes
156:info:configure checking for string.h... yes
157:info:configure checking for memory.h... yes
158:info:configure checking for strings.h... yes
159:info:configure checking for inttypes.h... yes
160:info:configure checking for stdint.h... yes
161:info:configure checking for unistd.h... yes
162:info:configure checking db.h usability... yes
163:info:configure checking db.h presence... yes
164:info:configure checking for db.h... yes
165:info:configure checking ndbm.h usability... yes
166:info:configure checking ndbm.h presence... yes
167:info:configure checking for ndbm.h... yes
168:info:configure checking for dbm_open in -lndbm... no
169:info:configure checking for dbm_open... yes
170:info:configure checking DB library to use... ndbm
171:info:configure checking if Berkeley DB handle is kept open in SASLDB... no
172:info:configure checking for dlopen in -ldl... yes
173:info:configure checking /dev/random to use... /dev/random
174:info:configure checking for nm... /usr/bin/nm
175:info:configure checking for underscore before symbols... yes
176:info:configure checking whether dlsym adds the underscore for us... configure: WARNING: cross-compiler
177:info:configure
178:info:configure checking for syslog... yes
179:info:configure checking security/pam_appl.h usability... yes
180:info:configure checking security/pam_appl.h presence... yes
181:info:configure checking for security/pam_appl.h... yes
182:info:configure checking pam/pam_appl.h usability... no
183:info:configure checking pam/pam_appl.h presence... no
184:info:configure checking for pam/pam_appl.h... no
185:info:configure checking for pam_start... no
186:info:configure checking if I should include saslauthd... /opt/local/var/state/saslauthd
187:info:configure checking to include Courier authdaemond support... /dev/null
188:info:configure checking for getspnam... no
189:info:configure checking if I should include pwcheck... /opt/local/var/pwcheck
190:info:configure checking if I should include the alwaystrue verifier... no
191:info:configure checking if we should enable sasl_checkapop... enabled
192:info:configure checking CRAM-MD5... enabled
193:info:configure checking size of long... 8
194:info:configure checking what directory libraries are found in... lib
195:info:configure checking for RSAPublicEncrypt in -lrsaref... no
196:info:configure checking openssl/evp.h usability... yes
197:info:configure checking openssl/evp.h presence... yes
198:info:configure checking for openssl/evp.h... yes
199:info:configure checking for EVP_DigestInit in -lcrypto... yes
200:info:configure checking for OpenSSL... yes
201:info:configure checking for des_cbc_encrypt in -lcrypto... no
202:info:configure checking for DES_cbc_encrypt in -lcrypto... yes
203:info:configure checking openssl/des.h usability... yes
204:info:configure checking openssl/des.h presence... yes
205:info:configure checking for openssl/des.h... yes
206:info:configure checking DIGEST-MD5... enabled
207:info:configure checking SCRAM... enabled
208:info:configure checking OTP... enabled
209:info:configure checking for opiechallenge in -lopie... no
210:info:configure checking for OPIE... no
211:info:configure checking SRP... enabled
212:info:configure checking if we should enable setting SRP secrets with saslpasswd... enabled
213:info:configure checking KERBEROS_V4... disabled
214:info:configure checking for crypt... yes
215:info:configure configure: WARNING: The system type is not recognized. If you believe that CyberSafe GSSAPI works on this platform, please update the configure script
216:info:configure checking gssapi.h usability... yes
217:info:configure checking gssapi.h presence... yes
218:info:configure checking for gssapi.h... yes
219:info:configure checking gssapi/gssapi_ext.h usability... yes
220:info:configure checking gssapi/gssapi_ext.h presence... yes
221:info:configure checking for gssapi/gssapi_ext.h... yes
222:info:configure checking for res_search in -lresolv... yes
223:info:configure checking for krb5int_getspecific in -lkrb5support... yes
224:info:configure checking for gss_unwrap in -lgssapi_krb5... yes
225:info:configure checking GSSAPI... with implementation mit
226:info:configure checking for res_search in -lresolv... (cached) yes
227:info:configure checking for gsskrb5_register_acceptor_identity... no
228:info:configure checking for gss_decapsulate_token... no
229:info:configure checking for gss_encapsulate_token... no
230:info:configure checking for gss_oid_equal... no
231:info:configure checking for gss_get_name_attribute... no
232:info:configure checking to use mutexes aroung GSS calls... yes
233:info:configure checking PLAIN... enabled
234:info:configure checking ANONYMOUS... enabled
235:info:configure checking LOGIN... enabled
236:info:configure checking NTLM... enabled
237:info:configure checking PASSDSS... disabled
238:info:configure checking SQL... disabled
239:info:configure checking LDAPDB... disabled
240:info:configure checking for dmalloc library... no
241:info:configure checking for sfio library... no
242:info:configure checking for getsubopt... yes
243:info:configure checking for snprintf... yes
244:info:configure checking for vsnprintf... yes
245:info:configure checking for inet_aton in -lresolv... yes
246:info:configure checking for getaddrinfo... yes
247:info:configure checking for gai_strerror... yes
248:info:configure checking for getnameinfo... yes
249:info:configure checking for an ANSI C-conforming const... yes
250:info:configure checking for inline... inline
251:info:configure checking for mode_t... yes
252:info:configure checking for pid_t... yes
253:info:configure checking return type of signal handlers... void
254:info:configure checking whether time.h and sys/time.h may both be included... yes
255:info:configure checking for ANSI C header files... (cached) yes
256:info:configure checking for dirent.h that defines DIR... yes
257:info:configure checking for library containing opendir... none required
258:info:configure checking for sys/wait.h that is POSIX.1 compatible... yes
259:info:configure checking des.h usability... no
260:info:configure checking des.h presence... no
261:info:configure checking for des.h... no
262:info:configure checking dlfcn.h usability... yes
263:info:configure checking dlfcn.h presence... yes
264:info:configure checking for dlfcn.h... yes
265:info:configure checking fcntl.h usability... yes
266:info:configure checking fcntl.h presence... yes
267:info:configure checking for fcntl.h... yes
268:info:configure checking limits.h usability... yes
269:info:configure checking limits.h presence... yes
270:info:configure checking for limits.h... yes
271:info:configure checking malloc.h usability... no
272:info:configure checking malloc.h presence... no
273:info:configure checking for malloc.h... no
274:info:configure checking paths.h usability... yes
275:info:configure checking paths.h presence... yes
276:info:configure checking for paths.h... yes
277:info:configure checking for strings.h... (cached) yes
278:info:configure checking sys/file.h usability... yes
279:info:configure checking sys/file.h presence... yes
280:info:configure checking for sys/file.h... yes
281:info:configure checking sys/time.h usability... yes
282:info:configure checking sys/time.h presence... yes
283:info:configure checking for sys/time.h... yes
284:info:configure checking syslog.h usability... yes
285:info:configure checking syslog.h presence... yes
286:info:configure checking for syslog.h... yes
287:info:configure checking for unistd.h... (cached) yes
288:info:configure checking for inttypes.h... (cached) yes
289:info:configure checking sys/uio.h usability... yes
290:info:configure checking sys/uio.h presence... yes
291:info:configure checking for sys/uio.h... yes
292:info:configure checking sys/param.h usability... yes
293:info:configure checking sys/param.h presence... yes
294:info:configure checking for sys/param.h... yes
295:info:configure checking sysexits.h usability... yes
296:info:configure checking sysexits.h presence... yes
297:info:configure checking for sysexits.h... yes
298:info:configure checking stdarg.h usability... yes
299:info:configure checking stdarg.h presence... yes
300:info:configure checking for stdarg.h... yes
301:info:configure checking varargs.h usability... no
302:info:configure checking varargs.h presence... no
303:info:configure checking for varargs.h... no
304:info:configure checking whether you have ss_family in struct sockaddr_storage... yes
305:info:configure checking whether you have sa_len in struct sockaddr... yes
306:info:configure checking for socklen_t... yes
307:info:configure checking for gethostname... yes
308:info:configure checking for getdomainname... yes
309:info:configure checking for getpwnam... yes
310:info:configure checking for getspnam... (cached) no
311:info:configure checking for gettimeofday... yes
312:info:configure checking for inet_aton... yes
313:info:configure checking for memcpy... yes
314:info:configure checking for mkdir... yes
315:info:configure checking for select... yes
316:info:configure checking for socket... yes
317:info:configure checking for strchr... yes
318:info:configure checking for strdup... yes
319:info:configure checking for strerror... yes
320:info:configure checking for strspn... yes
321:info:configure checking for strstr... yes
322:info:configure checking for strtol... yes
323:info:configure checking for jrand48... yes
324:info:configure checking for getpassphrase... no
325:info:configure configure: updating cache ./config.cache
326:info:configure configure: creating ./config.status
327:info:configure config.status: creating Makefile
328:info:configure config.status: creating include/Makefile
329:info:configure config.status: creating sasldb/Makefile
330:info:configure config.status: creating plugins/Makefile
331:info:configure config.status: creating lib/Makefile
332:info:configure config.status: creating utils/Makefile
333:info:configure config.status: creating doc/Makefile
334:info:configure config.status: creating sample/Makefile
335:info:configure config.status: creating java/Makefile
336:info:configure config.status: creating java/CyrusSasl/Makefile
337:info:configure config.status: creating java/Test/Makefile
338:info:configure config.status: creating java/javax/Makefile
339:info:configure config.status: creating java/javax/security/Makefile
340:info:configure config.status: creating java/javax/security/auth/Makefile
341:info:configure config.status: creating java/javax/security/auth/callback/Makefile
342:info:configure config.status: creating pwcheck/Makefile
343:info:configure config.status: creating man/Makefile
344:info:configure config.status: creating config.h
345:info:configure config.status: executing depfiles commands
346:info:configure === configuring in saslauthd (/opt/local/var/macports/build/_opt_local_var_macports_sources_rsync.macports.org_release_tarballs_ports_security_cyrus-sasl2/cyrus-sasl2/work/cyrus-sasl-2.1.25-x86_64/saslauthd)
347:info:configure configure: running /bin/sh ./configure --disable-option-checking '--prefix=/opt/local'  '--mandir=/opt/local/share/man' '--with-openssl=/opt/local' '--with-dbpath=/opt/local/etc/sasldb2' '--with-plugindir=/opt/local/lib/sasl2' '--with-saslauthd=/opt/local/var/state/saslauthd' '--with-pwcheck=/opt/local/var/pwcheck' '--disable-macos-framework' '--enable-srp' '--enable-srp-setpass' '--enable-login' '--enable-ntlm' '--with-rc4=openssl' '--disable-dependency-tracking' '--enable-keep-db-open' '--with-gss_impl=mit' '--enable-gssapi=/opt/local' '--host=x86_64-apple-darwin10.8.0' 'host_alias=x86_64-apple-darwin10.8.0' 'CC=/usr/bin/gcc-4.2' 'CFLAGS=-pipe -O2 -arch x86_64' 'LDFLAGS=-L/opt/local/lib -arch x86_64' 'CPPFLAGS=-I/opt/local/include' --cache-file=.././config.cache --srcdir=.
348:info:configure configure: WARNING: If you wanted to set the --build type, don't use --host.
349:info:configure     If a cross compiler is detected then cross compile mode will be used.
350:info:configure configure: loading cache .././config.cache
351:info:configure checking build system type... (cached) i386-apple-darwin10.8.0
352:info:configure checking host system type... (cached) x86_64-apple-darwin10.8.0
353:info:configure checking for a BSD-compatible install... /usr/bin/install -c
354:info:configure checking whether build environment is sane... yes
355:info:configure checking for x86_64-apple-darwin10.8.0-strip... no
356:info:configure checking for strip... (cached) strip
357:info:configure checking for a thread-safe mkdir -p... config/install-sh -c -d
358:info:configure checking for gawk... (cached) awk
359:info:configure checking whether make sets $(MAKE)... (cached) yes
360:info:configure checking for x86_64-apple-darwin10.8.0-gcc... (cached) /usr/bin/gcc-4.2
361:info:configure checking for C compiler default output file name... a.out
362:info:configure checking whether the C compiler works... yes
363:info:configure checking whether we are cross compiling... yes
364:info:configure checking for suffix of executables...
365:info:configure checking for suffix of object files... (cached) o
366:info:configure checking whether we are using the GNU C compiler... (cached) yes
367:info:configure checking whether /usr/bin/gcc-4.2 accepts -g... (cached) yes
368:info:configure checking for /usr/bin/gcc-4.2 option to accept ISO C89... (cached) none needed
369:info:configure checking for style of include used by make... GNU
370:info:configure checking dependency style of /usr/bin/gcc-4.2... (cached) none
371:info:configure checking how to run the C preprocessor... (cached) /usr/bin/gcc-4.2 -E
372:info:configure checking for gawk... (cached) awk
373:info:configure checking whether make sets $(MAKE)... (cached) yes
374:info:configure checking whether ln -s works... yes
375:info:configure checking for a BSD-compatible install... /usr/bin/install -c
376:info:configure checking for __attribute__... (cached) yes
377:info:configure checking for runpath switch... (cached) -Wl,-rpath,
378:info:configure checking for connect... (cached) yes
379:info:configure checking for res_search... (cached) yes
380:info:configure checking for dn_expand... (cached) yes
381:info:configure checking for dns_lookup... (cached) no
382:info:configure checking for grep that handles long lines and -e... (cached) /usr/bin/grep
383:info:configure checking for egrep... (cached) /usr/bin/grep -E
384:info:configure checking for ANSI C header files... (cached) yes
385:info:configure checking for sys/types.h... (cached) yes
386:info:configure checking for sys/stat.h... (cached) yes
387:info:configure checking for stdlib.h... (cached) yes
388:info:configure checking for string.h... (cached) yes
389:info:configure checking for memory.h... (cached) yes
390:info:configure checking for strings.h... (cached) yes
391:info:configure checking for inttypes.h... (cached) yes
392:info:configure checking for stdint.h... (cached) yes
393:info:configure checking for unistd.h... (cached) yes
394:info:configure checking size of long... (cached) 8
395:info:configure checking what directory libraries are found in... (cached) lib
396:info:configure checking for RSAPublicEncrypt in -lrsaref... (cached) no
397:info:configure checking for openssl/evp.h... (cached) yes
398:info:configure checking for EVP_DigestInit in -lcrypto... (cached) yes
399:info:configure checking for OpenSSL... yes
400:info:configure checking for des_cbc_encrypt in -lcrypto... (cached) no
401:info:configure checking for DES_cbc_encrypt in -lcrypto... (cached) yes
402:info:configure checking for openssl/des.h... (cached) yes
403:info:configure checking KERBEROS_V4... disabled
404:info:configure checking for crypt... (cached) yes
405:info:configure configure: WARNING: The system type is not recognized. If you believe that CyberSafe GSSAPI works on this platform, please update the configure script
406:info:configure checking for gssapi.h... (cached) yes
407:info:configure checking for gssapi/gssapi_ext.h... (cached) yes
408:info:configure checking for res_search in -lresolv... (cached) yes
409:info:configure checking for krb5int_getspecific in -lkrb5support... (cached) yes
410:info:configure checking for gss_unwrap in -lgssapi_krb5... (cached) yes
411:info:configure checking GSSAPI... with implementation mit
412:info:configure checking for res_search in -lresolv... (cached) yes
413:info:configure checking for gsskrb5_register_acceptor_identity... (cached) no
414:info:configure checking for gss_decapsulate_token... (cached) no
415:info:configure checking for gss_encapsulate_token... (cached) no
416:info:configure checking for gss_oid_equal... (cached) no
417:info:configure checking for gss_get_name_attribute... (cached) no
418:info:configure checking for crypt... (cached) yes
419:info:configure checking for pam_start in -lpam... yes
420:info:configure checking for security/pam_appl.h... (cached) yes
421:info:configure checking for PAM support... yes
422:info:configure checking for inet_aton in -lresolv... (cached) yes
423:info:configure checking to include LDAP support... no
424:info:configure checking for ANSI C header files... (cached) yes
425:info:configure checking for sys/wait.h that is POSIX.1 compatible... (cached) yes
426:info:configure checking whether time.h and sys/time.h may both be included... (cached) yes
427:info:configure checking crypt.h usability... no
428:info:configure checking crypt.h presence... no
429:info:configure checking for crypt.h... no
430:info:configure checking for fcntl.h... (cached) yes
431:info:configure checking krb5.h usability... yes
432:info:configure checking krb5.h presence... yes
433:info:configure checking for krb5.h... yes
434:info:configure checking for strings.h... (cached) yes
435:info:configure checking for syslog.h... (cached) yes
436:info:configure checking for unistd.h... (cached) yes
437:info:configure checking for sys/time.h... (cached) yes
438:info:configure checking for sys/uio.h... (cached) yes
439:info:configure checking for an ANSI C-conforming const... (cached) yes
440:info:configure checking for pid_t... (cached) yes
441:info:configure checking whether /usr/bin/gcc-4.2 implements __func__... yes
442:info:configure checking return type of signal handlers... (cached) void
443:info:configure checking for gethostname... (cached) yes
444:info:configure checking for mkdir... (cached) yes
445:info:configure checking for socket... (cached) yes
446:info:configure checking for strdup... (cached) yes
447:info:configure checking for getspnam... (cached) no
448:info:configure checking for getuserpw... no
449:info:configure checking for strlcat... yes
450:info:configure checking for strlcpy... yes
451:info:configure checking for getaddrinfo... (cached) yes
452:info:configure checking for getnameinfo... (cached) yes
453:info:configure checking whether you have ss_family in struct sockaddr_storage... (cached) yes
454:info:configure checking whether you have sa_len in struct sockaddr... (cached) yes
455:info:configure checking for socklen_t... (cached) yes
456:info:configure configure: updating cache .././config.cache
457:info:configure configure: creating ./config.status
458:info:configure config.status: creating Makefile
459:info:configure config.status: creating saslauthd.h
460:info:configure config.status: executing depfiles commands
461:info:configure Configuration Complete. Type 'make' to build.
462:info:configure --->  Configuring cyrus-sasl2 for architecture i386
463:debug:configure Environment: CPATH='/opt/local/include' CFLAGS='-pipe -O2 -arch i386' CPPFLAGS='-I/opt/local/include' CXXFLAGS='-pipe -O2 -arch i386' LIBRARY_PATH='/opt/local/lib' MACOSX_DEPLOYMENT_TARGET='10.6' CXX='/usr/bin/g++-4.2' CC_PRINT_OPTIONS_FILE='/opt/local/var/macports/build/_opt_local_var_macports_sources_rsync.macports.org_release_tarballs_ports_security_cyrus-sasl2/cyrus-sasl2/work/.CC_PRINT_OPTIONS' F90FLAGS='-pipe -O2 -m32' LDFLAGS='-L/opt/local/lib -arch i386' FCFLAGS='-pipe -O2 -m32' OBJC='/usr/bin/gcc-4.2' INSTALL='/usr/bin/install -c' NM='/usr/bin/nm' OBJCFLAGS='-pipe -O2 -arch i386' FFLAGS='-pipe -O2 -m32' CC_PRINT_OPTIONS='YES' CC='/usr/bin/gcc-4.2'
464:debug:configure Assembled command: 'cd "/opt/local/var/macports/build/_opt_local_var_macports_sources_rsync.macports.org_release_tarballs_ports_security_cyrus-sasl2/cyrus-sasl2/work/cyrus-sasl-2.1.25-i386" && ./configure --prefix=/opt/local --disable-dependency-tracking --disable-dependency-tracking --mandir=/opt/local/share/man --with-openssl=/opt/local --with-dbpath=/opt/local/etc/sasldb2 --with-plugindir=/opt/local/lib/sasl2 --with-saslauthd=/opt/local/var/state/saslauthd --with-pwcheck=/opt/local/var/pwcheck --disable-macos-framework --enable-srp --enable-srp-setpass --enable-login --enable-ntlm --with-rc4=openssl --disable-dependency-tracking --enable-keep-db-open --with-gss_impl=mit --enable-gssapi=/opt/local'
465:debug:configure Executing command line:  cd "/opt/local/var/macports/build/_opt_local_var_macports_sources_rsync.macports.org_release_tarballs_ports_security_cyrus-sasl2/cyrus-sasl2/work/cyrus-sasl-2.1.25-i386" && ./configure --prefix=/opt/local --disable-dependency-tracking --disable-dependency-tracking --mandir=/opt/local/share/man --with-openssl=/opt/local --with-dbpath=/opt/local/etc/sasldb2 --with-plugindir=/opt/local/lib/sasl2 --with-saslauthd=/opt/local/var/state/saslauthd --with-pwcheck=/opt/local/var/pwcheck --disable-macos-framework --enable-srp --enable-srp-setpass --enable-login --enable-ntlm --with-rc4=openssl --disable-dependency-tracking --enable-keep-db-open --with-gss_impl=mit --enable-gssapi=/opt/local
466:info:configure configure: creating cache ./config.cache
467:info:configure checking build system type... i386-apple-darwin10.8.0
468:info:configure checking host system type... i386-apple-darwin10.8.0
469:info:configure checking target system type... i386-apple-darwin10.8.0
470:info:configure checking for a BSD-compatible install... /usr/bin/install -c
471:info:configure checking whether build environment is sane... yes
472:info:configure checking for a thread-safe mkdir -p... config/install-sh -c -d
473:info:configure checking for gawk... no
474:info:configure checking for mawk... no
475:info:configure checking for nawk... no
476:info:configure checking for awk... awk
477:info:configure checking whether make sets $(MAKE)... yes
478:info:configure checking for gcc... /usr/bin/gcc-4.2
479:info:configure checking for C compiler default output file name... a.out
480:info:configure checking whether the C compiler works... yes
481:info:configure checking whether we are cross compiling... no
482:info:configure checking for suffix of executables...
483:info:configure checking for suffix of object files... o
484:info:configure checking whether we are using the GNU C compiler... yes
485:info:configure checking whether /usr/bin/gcc-4.2 accepts -g... yes
486:info:configure checking for /usr/bin/gcc-4.2 option to accept ISO C89... none needed
487:info:configure checking for style of include used by make... GNU
488:info:configure checking dependency style of /usr/bin/gcc-4.2... none
489:info:configure checking how to run the C preprocessor... /usr/bin/gcc-4.2 -E
490:info:configure checking for gawk... (cached) awk
491:info:configure checking whether ln -s works... yes
492:info:configure checking whether make sets $(MAKE)... (cached) yes
493:info:configure checking for a BSD-compatible install... /usr/bin/install -c
494:info:configure checking for __attribute__... yes
495:info:configure checking for runpath switch... -Wl,-rpath,
496:info:configure checking for ranlib... ranlib
497:info:configure checking for ld used by GCC... /usr/libexec/gcc/i686-apple-darwin10/4.2.1/ld
498:info:configure checking if the linker (/usr/libexec/gcc/i686-apple-darwin10/4.2.1/ld) is GNU ld... no
499:info:configure checking for BSD-compatible nm... /usr/bin/nm
500:info:configure configure: updating cache ./config.cache
501:info:configure loading cache ./config.cache within ltconfig
502:info:configure checking for object suffix... o
503:info:configure checking for executable suffix... no
504:info:configure checking for /usr/bin/gcc-4.2 option to produce PIC... -fno-common
505:info:configure checking if /usr/bin/gcc-4.2 PIC flag -fno-common works... yes
506:info:configure checking if /usr/bin/gcc-4.2 supports -c -o file.o... yes
507:info:configure checking if /usr/bin/gcc-4.2 supports -c -o file.lo... yes
508:info:configure checking if /usr/bin/gcc-4.2 supports -fno-rtti -fno-exceptions ... no
509:info:configure checking if /usr/bin/gcc-4.2 static flag -static works... none
510:info:configure checking if the linker (/usr/libexec/gcc/i686-apple-darwin10/4.2.1/ld) is GNU ld... no
511:info:configure checking whether the linker (/usr/libexec/gcc/i686-apple-darwin10/4.2.1/ld) supports shared libraries... yes
512:info:configure checking command to parse /usr/bin/nm output... ok
513:info:configure checking how to hardcode library paths into programs... unsupported
514:info:configure checking for /usr/libexec/gcc/i686-apple-darwin10/4.2.1/ld option to reload object files... -r
515:info:configure checking dynamic linker characteristics... darwin10.8.0 dyld
516:info:configure checking if libtool supports shared libraries... yes
517:info:configure checking whether to build shared libraries... yes
518:info:configure checking whether to build static libraries... no
519:info:configure checking for objdir... .libs
520:info:configure creating libtool
521:info:configure updating cache ./config.cache
522:info:configure configure: loading cache ./config.cache
523:info:configure checking for connect... yes
524:info:configure checking for res_search... yes
525:info:configure checking for dn_expand... yes
526:info:configure checking for dns_lookup... no
527:info:configure checking DB path to use... /opt/local/etc/sasldb2
528:info:configure checking for grep that handles long lines and -e... /usr/bin/grep
529:info:configure checking for egrep... /usr/bin/grep -E
530:info:configure checking for ANSI C header files... yes
531:info:configure checking for sys/types.h... yes
532:info:configure checking for sys/stat.h... yes
533:info:configure checking for stdlib.h... yes
534:info:configure checking for string.h... yes
535:info:configure checking for memory.h... yes
536:info:configure checking for strings.h... yes
537:info:configure checking for inttypes.h... yes
538:info:configure checking for stdint.h... yes
539:info:configure checking for unistd.h... yes
540:info:configure checking db.h usability... yes
541:info:configure checking db.h presence... yes
542:info:configure checking for db.h... yes
543:info:configure checking ndbm.h usability... yes
544:info:configure checking ndbm.h presence... yes
545:info:configure checking for ndbm.h... yes
546:info:configure checking for dbm_open in -lndbm... no
547:info:configure checking for dbm_open... yes
548:info:configure checking DB library to use... ndbm
549:info:configure checking if Berkeley DB handle is kept open in SASLDB... no
550:info:configure checking for dlopen in -ldl... yes
551:info:configure checking /dev/random to use... /dev/random
552:info:configure checking for nm... /usr/bin/nm
553:info:configure checking for underscore before symbols... yes
554:info:configure checking whether dlsym adds the underscore for us... yes
555:info:configure checking for syslog... yes
556:info:configure checking security/pam_appl.h usability... yes
557:info:configure checking security/pam_appl.h presence... yes
558:info:configure checking for security/pam_appl.h... yes
559:info:configure checking pam/pam_appl.h usability... no
560:info:configure checking pam/pam_appl.h presence... no
561:info:configure checking for pam/pam_appl.h... no
562:info:configure checking for pam_start... no
563:info:configure checking if I should include saslauthd... /opt/local/var/state/saslauthd
564:info:configure checking to include Courier authdaemond support... /dev/null
565:info:configure checking for getspnam... no
566:info:configure checking if I should include pwcheck... /opt/local/var/pwcheck
567:info:configure checking if I should include the alwaystrue verifier... no
568:info:configure checking if we should enable sasl_checkapop... enabled
569:info:configure checking CRAM-MD5... enabled
570:info:configure checking size of long... 4
571:info:configure checking what directory libraries are found in... lib
572:info:configure checking for RSAPublicEncrypt in -lrsaref... no
573:info:configure checking openssl/evp.h usability... yes
574:info:configure checking openssl/evp.h presence... yes
575:info:configure checking for openssl/evp.h... yes
576:info:configure checking for EVP_DigestInit in -lcrypto... yes
577:info:configure checking for OpenSSL... yes
578:info:configure checking for des_cbc_encrypt in -lcrypto... no
579:info:configure checking for DES_cbc_encrypt in -lcrypto... yes
580:info:configure checking openssl/des.h usability... yes
581:info:configure checking openssl/des.h presence... yes
582:info:configure checking for openssl/des.h... yes
583:info:configure checking DIGEST-MD5... enabled
584:info:configure checking SCRAM... enabled
585:info:configure checking OTP... enabled
586:info:configure checking for opiechallenge in -lopie... no
587:info:configure checking for OPIE... no
588:info:configure checking SRP... enabled
589:info:configure checking if we should enable setting SRP secrets with saslpasswd... enabled
590:info:configure checking KERBEROS_V4... disabled
591:info:configure checking for crypt... yes
592:info:configure configure: WARNING: The system type is not recognized. If you believe that CyberSafe GSSAPI works on this platform, please update the configure script
593:info:configure checking gssapi.h usability... yes
594:info:configure checking gssapi.h presence... yes
595:info:configure checking for gssapi.h... yes
596:info:configure checking gssapi/gssapi_ext.h usability... yes
597:info:configure checking gssapi/gssapi_ext.h presence... yes
598:info:configure checking for gssapi/gssapi_ext.h... yes
599:info:configure checking for res_search in -lresolv... yes
600:info:configure checking for krb5int_getspecific in -lkrb5support... yes
601:info:configure checking for gss_unwrap in -lgssapi_krb5... yes
602:info:configure checking GSSAPI... with implementation mit
603:info:configure checking for res_search in -lresolv... (cached) yes
604:info:configure checking for gsskrb5_register_acceptor_identity... no
605:info:configure checking for gss_decapsulate_token... no
606:info:configure checking for gss_encapsulate_token... no
607:info:configure checking for gss_oid_equal... no
608:info:configure checking for gss_get_name_attribute... no
609:info:configure checking to use mutexes aroung GSS calls... yes
610:info:configure checking PLAIN... enabled
611:info:configure checking ANONYMOUS... enabled
612:info:configure checking LOGIN... enabled
613:info:configure checking NTLM... enabled
614:info:configure checking PASSDSS... disabled
615:info:configure checking SQL... disabled
616:info:configure checking LDAPDB... disabled
617:info:configure checking for dmalloc library... no
618:info:configure checking for sfio library... no
619:info:configure checking for getsubopt... yes
620:info:configure checking for snprintf... yes
621:info:configure checking for vsnprintf... yes
622:info:configure checking for inet_aton in -lresolv... yes
623:info:configure checking for getaddrinfo... yes
624:info:configure checking for gai_strerror... yes
625:info:configure checking for getnameinfo... yes
626:info:configure checking for an ANSI C-conforming const... yes
627:info:configure checking for inline... inline
628:info:configure checking for mode_t... yes
629:info:configure checking for pid_t... yes
630:info:configure checking return type of signal handlers... void
631:info:configure checking whether time.h and sys/time.h may both be included... yes
632:info:configure checking for ANSI C header files... (cached) yes
633:info:configure checking for dirent.h that defines DIR... yes
634:info:configure checking for library containing opendir... none required
635:info:configure checking for sys/wait.h that is POSIX.1 compatible... yes
636:info:configure checking des.h usability... no
637:info:configure checking des.h presence... no
638:info:configure checking for des.h... no
639:info:configure checking dlfcn.h usability... yes
640:info:configure checking dlfcn.h presence... yes
641:info:configure checking for dlfcn.h... yes
642:info:configure checking fcntl.h usability... yes
643:info:configure checking fcntl.h presence... yes
644:info:configure checking for fcntl.h... yes
645:info:configure checking limits.h usability... yes
646:info:configure checking limits.h presence... yes
647:info:configure checking for limits.h... yes
648:info:configure checking malloc.h usability... no
649:info:configure checking malloc.h presence... no
650:info:configure checking for malloc.h... no
651:info:configure checking paths.h usability... yes
652:info:configure checking paths.h presence... yes
653:info:configure checking for paths.h... yes
654:info:configure checking for strings.h... (cached) yes
655:info:configure checking sys/file.h usability... yes
656:info:configure checking sys/file.h presence... yes
657:info:configure checking for sys/file.h... yes
658:info:configure checking sys/time.h usability... yes
659:info:configure checking sys/time.h presence... yes
660:info:configure checking for sys/time.h... yes
661:info:configure checking syslog.h usability... yes
662:info:configure checking syslog.h presence... yes
663:info:configure checking for syslog.h... yes
664:info:configure checking for unistd.h... (cached) yes
665:info:configure checking for inttypes.h... (cached) yes
666:info:configure checking sys/uio.h usability... yes
667:info:configure checking sys/uio.h presence... yes
668:info:configure checking for sys/uio.h... yes
669:info:configure checking sys/param.h usability... yes
670:info:configure checking sys/param.h presence... yes
671:info:configure checking for sys/param.h... yes
672:info:configure checking sysexits.h usability... yes
673:info:configure checking sysexits.h presence... yes
674:info:configure checking for sysexits.h... yes
675:info:configure checking stdarg.h usability... yes
676:info:configure checking stdarg.h presence... yes
677:info:configure checking for stdarg.h... yes
678:info:configure checking varargs.h usability... no
679:info:configure checking varargs.h presence... no
680:info:configure checking for varargs.h... no
681:info:configure checking whether you have ss_family in struct sockaddr_storage... yes
682:info:configure checking whether you have sa_len in struct sockaddr... yes
683:info:configure checking for socklen_t... yes
684:info:configure checking for gethostname... yes
685:info:configure checking for getdomainname... yes
686:info:configure checking for getpwnam... yes
687:info:configure checking for getspnam... (cached) no
688:info:configure checking for gettimeofday... yes
689:info:configure checking for inet_aton... yes
690:info:configure checking for memcpy... yes
691:info:configure checking for mkdir... yes
692:info:configure checking for select... yes
693:info:configure checking for socket... yes
694:info:configure checking for strchr... yes
695:info:configure checking for strdup... yes
696:info:configure checking for strerror... yes
697:info:configure checking for strspn... yes
698:info:configure checking for strstr... yes
699:info:configure checking for strtol... yes
700:info:configure checking for jrand48... yes
701:info:configure checking for getpassphrase... no
702:info:configure configure: updating cache ./config.cache
703:info:configure configure: creating ./config.status
704:info:configure config.status: creating Makefile
705:info:configure config.status: creating include/Makefile
706:info:configure config.status: creating sasldb/Makefile
707:info:configure config.status: creating plugins/Makefile
708:info:configure config.status: creating lib/Makefile
709:info:configure config.status: creating utils/Makefile
710:info:configure config.status: creating doc/Makefile
711:info:configure config.status: creating sample/Makefile
712:info:configure config.status: creating java/Makefile
713:info:configure config.status: creating java/CyrusSasl/Makefile
714:info:configure config.status: creating java/Test/Makefile
715:info:configure config.status: creating java/javax/Makefile
716:info:configure config.status: creating java/javax/security/Makefile
717:info:configure config.status: creating java/javax/security/auth/Makefile
718:info:configure config.status: creating java/javax/security/auth/callback/Makefile
719:info:configure config.status: creating pwcheck/Makefile
720:info:configure config.status: creating man/Makefile
721:info:configure config.status: creating config.h
722:info:configure config.status: executing depfiles commands
723:info:configure === configuring in saslauthd (/opt/local/var/macports/build/_opt_local_var_macports_sources_rsync.macports.org_release_tarballs_ports_security_cyrus-sasl2/cyrus-sasl2/work/cyrus-sasl-2.1.25-i386/saslauthd)
724:info:configure configure: running /bin/sh ./configure --disable-option-checking '--prefix=/opt/local'  '--mandir=/opt/local/share/man' '--with-openssl=/opt/local' '--with-dbpath=/opt/local/etc/sasldb2' '--with-plugindir=/opt/local/lib/sasl2' '--with-saslauthd=/opt/local/var/state/saslauthd' '--with-pwcheck=/opt/local/var/pwcheck' '--disable-macos-framework' '--enable-srp' '--enable-srp-setpass' '--enable-login' '--enable-ntlm' '--with-rc4=openssl' '--disable-dependency-tracking' '--enable-keep-db-open' '--with-gss_impl=mit' '--enable-gssapi=/opt/local' 'CC=/usr/bin/gcc-4.2' 'CFLAGS=-pipe -O2 -arch i386' 'LDFLAGS=-L/opt/local/lib -arch i386' 'CPPFLAGS=-I/opt/local/include' --cache-file=.././config.cache --srcdir=.
725:info:configure configure: loading cache .././config.cache
726:info:configure checking build system type... (cached) i386-apple-darwin10.8.0
727:info:configure checking host system type... (cached) i386-apple-darwin10.8.0
728:info:configure checking for a BSD-compatible install... /usr/bin/install -c
729:info:configure checking whether build environment is sane... yes
730:info:configure checking for a thread-safe mkdir -p... config/install-sh -c -d
731:info:configure checking for gawk... (cached) awk
732:info:configure checking whether make sets $(MAKE)... (cached) yes
733:info:configure checking for gcc... (cached) /usr/bin/gcc-4.2
734:info:configure checking for C compiler default output file name... a.out
735:info:configure checking whether the C compiler works... yes
736:info:configure checking whether we are cross compiling... no
737:info:configure checking for suffix of executables...
738:info:configure checking for suffix of object files... (cached) o
739:info:configure checking whether we are using the GNU C compiler... (cached) yes
740:info:configure checking whether /usr/bin/gcc-4.2 accepts -g... (cached) yes
741:info:configure checking for /usr/bin/gcc-4.2 option to accept ISO C89... (cached) none needed
742:info:configure checking for style of include used by make... GNU
743:info:configure checking dependency style of /usr/bin/gcc-4.2... (cached) none
744:info:configure checking how to run the C preprocessor... (cached) /usr/bin/gcc-4.2 -E
745:info:configure checking for gawk... (cached) awk
746:info:configure checking whether make sets $(MAKE)... (cached) yes
747:info:configure checking whether ln -s works... yes
748:info:configure checking for a BSD-compatible install... /usr/bin/install -c
749:info:configure checking for __attribute__... (cached) yes
750:info:configure checking for runpath switch... (cached) -Wl,-rpath,
751:info:configure checking for connect... (cached) yes
752:info:configure checking for res_search... (cached) yes
753:info:configure checking for dn_expand... (cached) yes
754:info:configure checking for dns_lookup... (cached) no
755:info:configure checking for grep that handles long lines and -e... (cached) /usr/bin/grep
756:info:configure checking for egrep... (cached) /usr/bin/grep -E
757:info:configure checking for ANSI C header files... (cached) yes
758:info:configure checking for sys/types.h... (cached) yes
759:info:configure checking for sys/stat.h... (cached) yes
760:info:configure checking for stdlib.h... (cached) yes
761:info:configure checking for string.h... (cached) yes
762:info:configure checking for memory.h... (cached) yes
763:info:configure checking for strings.h... (cached) yes
764:info:configure checking for inttypes.h... (cached) yes
765:info:configure checking for stdint.h... (cached) yes
766:info:configure checking for unistd.h... (cached) yes
767:info:configure checking size of long... (cached) 4
768:info:configure checking what directory libraries are found in... (cached) lib
769:info:configure checking for RSAPublicEncrypt in -lrsaref... (cached) no
770:info:configure checking for openssl/evp.h... (cached) yes
771:info:configure checking for EVP_DigestInit in -lcrypto... (cached) yes
772:info:configure checking for OpenSSL... yes
773:info:configure checking for des_cbc_encrypt in -lcrypto... (cached) no
774:info:configure checking for DES_cbc_encrypt in -lcrypto... (cached) yes
775:info:configure checking for openssl/des.h... (cached) yes
776:info:configure checking KERBEROS_V4... disabled
777:info:configure checking for crypt... (cached) yes
778:info:configure configure: WARNING: The system type is not recognized. If you believe that CyberSafe GSSAPI works on this platform, please update the configure script
779:info:configure checking for gssapi.h... (cached) yes
780:info:configure checking for gssapi/gssapi_ext.h... (cached) yes
781:info:configure checking for res_search in -lresolv... (cached) yes
782:info:configure checking for krb5int_getspecific in -lkrb5support... (cached) yes
783:info:configure checking for gss_unwrap in -lgssapi_krb5... (cached) yes
784:info:configure checking GSSAPI... with implementation mit
785:info:configure checking for res_search in -lresolv... (cached) yes
786:info:configure checking for gsskrb5_register_acceptor_identity... (cached) no
787:info:configure checking for gss_decapsulate_token... (cached) no
788:info:configure checking for gss_encapsulate_token... (cached) no
789:info:configure checking for gss_oid_equal... (cached) no
790:info:configure checking for gss_get_name_attribute... (cached) no
791:info:configure checking for crypt... (cached) yes
792:info:configure checking for pam_start in -lpam... yes
793:info:configure checking for security/pam_appl.h... (cached) yes
794:info:configure checking for PAM support... yes
795:info:configure checking for inet_aton in -lresolv... (cached) yes
796:info:configure checking to include LDAP support... no
797:info:configure checking for ANSI C header files... (cached) yes
798:info:configure checking for sys/wait.h that is POSIX.1 compatible... (cached) yes
799:info:configure checking whether time.h and sys/time.h may both be included... (cached) yes
800:info:configure checking crypt.h usability... no
801:info:configure checking crypt.h presence... no
802:info:configure checking for crypt.h... no
803:info:configure checking for fcntl.h... (cached) yes
804:info:configure checking krb5.h usability... yes
805:info:configure checking krb5.h presence... yes
806:info:configure checking for krb5.h... yes
807:info:configure checking for strings.h... (cached) yes
808:info:configure checking for syslog.h... (cached) yes
809:info:configure checking for unistd.h... (cached) yes
810:info:configure checking for sys/time.h... (cached) yes
811:info:configure checking for sys/uio.h... (cached) yes
812:info:configure checking for an ANSI C-conforming const... (cached) yes
813:info:configure checking for pid_t... (cached) yes
814:info:configure checking whether /usr/bin/gcc-4.2 implements __func__... yes
815:info:configure checking return type of signal handlers... (cached) void
816:info:configure checking for gethostname... (cached) yes
817:info:configure checking for mkdir... (cached) yes
818:info:configure checking for socket... (cached) yes
819:info:configure checking for strdup... (cached) yes
820:info:configure checking for getspnam... (cached) no
821:info:configure checking for getuserpw... no
822:info:configure checking for strlcat... yes
823:info:configure checking for strlcpy... yes
824:info:configure checking for getaddrinfo... (cached) yes
825:info:configure checking for getnameinfo... (cached) yes
826:info:configure checking whether you have ss_family in struct sockaddr_storage... (cached) yes
827:info:configure checking whether you have sa_len in struct sockaddr... (cached) yes
828:info:configure checking for socklen_t... (cached) yes
829:info:configure configure: updating cache .././config.cache
830:info:configure configure: creating ./config.status
831:info:configure config.status: creating Makefile
832:info:configure config.status: creating saslauthd.h
833:info:configure config.status: executing depfiles commands
834:info:configure Configuration Complete. Type 'make' to build.
835:debug:configure Privilege de-escalation not attempted as not running as root.
836:debug:build build phase started at Mon Oct 29 12:38:30 EDT 2012
837:notice:build --->  Building cyrus-sasl2
838:debug:build Executing proc-pre-org.macports.build-build-0
839:debug:build Executing reinplace: /usr/bin/sed -E {s|^CC=\"([^\"]+)\"|CC="\1 -arch x86_64"|g} < /opt/local/var/macports/build/_opt_local_var_macports_sources_rsync.macports.org_release_tarballs_ports_security_cyrus-sasl2/cyrus-sasl2/work/cyrus-sasl-2.1.25-x86_64/libtool >@ file12
840:debug:build euid/egid changed to: 0/0
841:debug:build chowned /opt/local/var/macports/build/_opt_local_var_macports_sources_rsync.macports.org_release_tarballs_ports_security_cyrus-sasl2/cyrus-sasl2/work/cyrus-sasl-2.1.25-x86_64/libtool to macports
842:debug:build euid/egid changed to: 502/501
843:debug:build euid/egid changed to: 0/0
844:debug:build setting attributes on /opt/local/var/macports/build/_opt_local_var_macports_sources_rsync.macports.org_release_tarballs_ports_security_cyrus-sasl2/cyrus-sasl2/work/cyrus-sasl-2.1.25-x86_64/libtool
845:debug:build euid/egid changed to: 502/501
846:debug:build Executing reinplace: /usr/bin/sed -E {s|^CC=\"([^\"]+)\"|CC="\1 -arch i386"|g} < /opt/local/var/macports/build/_opt_local_var_macports_sources_rsync.macports.org_release_tarballs_ports_security_cyrus-sasl2/cyrus-sasl2/work/cyrus-sasl-2.1.25-i386/libtool >@ file12
847:debug:build euid/egid changed to: 0/0
848:debug:build chowned /opt/local/var/macports/build/_opt_local_var_macports_sources_rsync.macports.org_release_tarballs_ports_security_cyrus-sasl2/cyrus-sasl2/work/cyrus-sasl-2.1.25-i386/libtool to macports
849:debug:build euid/egid changed to: 502/501
850:debug:build euid/egid changed to: 0/0
851:debug:build setting attributes on /opt/local/var/macports/build/_opt_local_var_macports_sources_rsync.macports.org_release_tarballs_ports_security_cyrus-sasl2/cyrus-sasl2/work/cyrus-sasl-2.1.25-i386/libtool
852:debug:build euid/egid changed to: 502/501
853:debug:build Executing org.macports.build (cyrus-sasl2)
854:info:build --->  Building cyrus-sasl2 for architecture x86_64
855:debug:build port disallows a parallel build
856:debug:build Environment: CPATH='/opt/local/include' CC_PRINT_OPTIONS_FILE='/opt/local/var/macports/build/_opt_local_var_macports_sources_rsync.macports.org_release_tarballs_ports_security_cyrus-sasl2/cyrus-sasl2/work/.CC_PRINT_OPTIONS' LIBRARY_PATH='/opt/local/lib' CC_PRINT_OPTIONS='YES' MACOSX_DEPLOYMENT_TARGET='10.6'
857:debug:build Assembled command: 'cd "/opt/local/var/macports/build/_opt_local_var_macports_sources_rsync.macports.org_release_tarballs_ports_security_cyrus-sasl2/cyrus-sasl2/work/cyrus-sasl-2.1.25-x86_64" && /usr/bin/make -w all'
858:debug:build Executing command line:  cd "/opt/local/var/macports/build/_opt_local_var_macports_sources_rsync.macports.org_release_tarballs_ports_security_cyrus-sasl2/cyrus-sasl2/work/cyrus-sasl-2.1.25-x86_64" && /usr/bin/make -w all
859:info:build make: Entering directory `/opt/local/var/macports/build/_opt_local_var_macports_sources_rsync.macports.org_release_tarballs_ports_security_cyrus-sasl2/cyrus-sasl2/work/cyrus-sasl-2.1.25-x86_64'
860:info:build /usr/bin/make  all-recursive
861:info:build make[1]: Entering directory `/opt/local/var/macports/build/_opt_local_var_macports_sources_rsync.macports.org_release_tarballs_ports_security_cyrus-sasl2/cyrus-sasl2/work/cyrus-sasl-2.1.25-x86_64'
862:info:build Making all in include
863:info:build make[2]: Entering directory `/opt/local/var/macports/build/_opt_local_var_macports_sources_rsync.macports.org_release_tarballs_ports_security_cyrus-sasl2/cyrus-sasl2/work/cyrus-sasl-2.1.25-x86_64/include'
864:info:build /usr/bin/gcc-4.2 -DHAVE_CONFIG_H -I. -I..   -I/opt/local/include -DOBSOLETE_CRAM_ATTR=1 -I/opt/local/include -I/opt/local/include  -Wall -W -pipe -O2 -arch x86_64 -c makemd5.c
865:info:build /bin/sh ../libtool   --mode=link /usr/bin/gcc-4.2  -Wall -W -pipe -O2 -arch x86_64  -L/opt/local/lib -Wl,-rpath,/opt/local/lib -L/opt/local/lib -arch x86_64 -L/opt/local/lib -o makemd5 makemd5.o  -lresolv -lresolv 
866:info:build mkdir .libs
867:info:build /usr/bin/gcc-4.2 -Wall -W -pipe -O2 -arch x86_64 -L/opt/local/lib -Wl,-rpath,/opt/local/lib -L/opt/local/lib -arch x86_64 -L/opt/local/lib -o makemd5 makemd5.o -lresolv -lresolv
868:info:build rm -f md5global.h
869:info:build ./makemd5 md5global.h
870:info:build make[2]: ./makemd5: Bad CPU type in executable
871:info:build make[2]: *** [md5global.h] Error 1
872:info:build make[2]: Leaving directory `/opt/local/var/macports/build/_opt_local_var_macports_sources_rsync.macports.org_release_tarballs_ports_security_cyrus-sasl2/cyrus-sasl2/work/cyrus-sasl-2.1.25-x86_64/include'
873:info:build make[1]: *** [all-recursive] Error 1
874:info:build make[1]: Leaving directory `/opt/local/var/macports/build/_opt_local_var_macports_sources_rsync.macports.org_release_tarballs_ports_security_cyrus-sasl2/cyrus-sasl2/work/cyrus-sasl-2.1.25-x86_64'
875:info:build make: *** [all] Error 2
876:info:build make: Leaving directory `/opt/local/var/macports/build/_opt_local_var_macports_sources_rsync.macports.org_release_tarballs_ports_security_cyrus-sasl2/cyrus-sasl2/work/cyrus-sasl-2.1.25-x86_64'
877:info:build Command failed:  cd "/opt/local/var/macports/build/_opt_local_var_macports_sources_rsync.macports.org_release_tarballs_ports_security_cyrus-sasl2/cyrus-sasl2/work/cyrus-sasl-2.1.25-x86_64" && /usr/bin/make -w all
878:info:build Exit code: 2
879:error:build org.macports.build for port cyrus-sasl2 returned: command execution failed
880:debug:build Error code: NONE
881:debug:build Backtrace: command execution failed
882    while executing
883"$procedure $targetname"
884:info:build Warning: targets not executed for cyrus-sasl2: org.macports.activate org.macports.build org.macports.destroot org.macports.install
885:error:build Failed to install cyrus-sasl2
886:debug:build couldn't open "/System/Library/Frameworks/Tcl.framework/Versions/8.5/Resources/tclIndex": no such file or directory
887    while executing
888"open [file join $dir tclIndex]"
889:notice:build Please see the log file for port cyrus-sasl2 for details:
890    /opt/local/var/macports/logs/_opt_local_var_macports_sources_rsync.macports.org_release_tarballs_ports_security_cyrus-sasl2/cyrus-sasl2/main.log