Ticket #36928: main.log

File main.log, 17.1 KB (added by liut12@…, 8 years ago)

cairo error log

Line 
1version:1
2:debug:main changing euid/egid - current euid: 0 - current egid: 0
3:debug:main egid changed to: 501
4:debug:main euid changed to: 502
5:debug:main Executing org.macports.main (cairo)
6:debug:main Privilege de-escalation not attempted as not running as root.
7:debug:main Skipping completed org.macports.archivefetch (cairo)
8:debug:main Privilege de-escalation not attempted as not running as root.
9:debug:main Skipping completed org.macports.fetch (cairo)
10:debug:main Privilege de-escalation not attempted as not running as root.
11:debug:main Skipping completed org.macports.checksum (cairo)
12:debug:main Privilege de-escalation not attempted as not running as root.
13:debug:main Skipping completed org.macports.extract (cairo)
14:debug:main Privilege de-escalation not attempted as not running as root.
15:debug:main Skipping completed org.macports.patch (cairo)
16:debug:main Privilege de-escalation not attempted as not running as root.
17:debug:main Skipping completed org.macports.configure (cairo)
18:debug:main Privilege de-escalation not attempted as not running as root.
19:debug:build build phase started at Thu Nov  8 18:46:58 PST 2012
20:notice:build --->  Building cairo
21:debug:build Executing org.macports.build (cairo)
22:debug:build Environment: CPATH='/opt/local/include' CC_PRINT_OPTIONS_FILE='/opt/local/var/macports/build/_opt_local_var_macports_sources_rsync.macports.org_release_tarballs_ports_graphics_cairo/cairo/work/.CC_PRINT_OPTIONS' LIBRARY_PATH='/opt/local/lib' CC_PRINT_OPTIONS='YES' MACOSX_DEPLOYMENT_TARGET='10.8'
23:debug:build Assembled command: 'cd "/opt/local/var/macports/build/_opt_local_var_macports_sources_rsync.macports.org_release_tarballs_ports_graphics_cairo/cairo/work/cairo-1.12.8" && /usr/bin/make -j5 -w all'
24:debug:build Executing command line:  cd "/opt/local/var/macports/build/_opt_local_var_macports_sources_rsync.macports.org_release_tarballs_ports_graphics_cairo/cairo/work/cairo-1.12.8" && /usr/bin/make -j5 -w all
25:info:build make: Entering directory `/opt/local/var/macports/build/_opt_local_var_macports_sources_rsync.macports.org_release_tarballs_ports_graphics_cairo/cairo/work/cairo-1.12.8'
26:info:build /usr/bin/make  all-recursive
27:info:build make[1]: Entering directory `/opt/local/var/macports/build/_opt_local_var_macports_sources_rsync.macports.org_release_tarballs_ports_graphics_cairo/cairo/work/cairo-1.12.8'
28:info:build Making all in src
29:info:build make[2]: Entering directory `/opt/local/var/macports/build/_opt_local_var_macports_sources_rsync.macports.org_release_tarballs_ports_graphics_cairo/cairo/work/cairo-1.12.8/src'
30:info:build /usr/bin/make  all-am
31:info:build make[3]: Entering directory `/opt/local/var/macports/build/_opt_local_var_macports_sources_rsync.macports.org_release_tarballs_ports_graphics_cairo/cairo/work/cairo-1.12.8/src'
32:info:build /bin/sh ../libtool  --tag=CC   --mode=compile /usr/bin/clang -DHAVE_CONFIG_H -I. -I..  -I. -D_REENTRANT       -I/opt/local/include/pixman-1      -I/opt/local/include   -I/opt/local/include/freetype2 -I/opt/local/include    -I/opt/local/include/libpng15   -I/opt/local/include   -I/opt/local/include   -I/opt/local/include   -I/opt/local/include      -Wall -Wextra -Wold-style-definition -Wdeclaration-after-statement -Wmissing-declarations -Werror-implicit-function-declaration -Wnested-externs -Wpointer-arith -Wwrite-strings -Wsign-compare -Wstrict-prototypes -Wmissing-prototypes -Wpacked -Wswitch-enum -Wmissing-format-attribute -Wbad-function-cast -Wvolatile-register-var -Wstrict-aliasing=2 -Winit-self -Wno-missing-field-initializers -Wno-unused-parameter -Wno-attributes -Wno-long-long -Winline -erroff=E_ENUM_TYPE_MISMATCH_ARG -erroff=E_ENUM_TYPE_MISMATCH_OP -fno-strict-aliasing -fno-common -Wp,-D_FORTIFY_SOURCE=2                        -I/opt/local/include  -I/opt/local/include  -pipe -O2 -arch x86_64 -MT cairo-xlib-xcb-surface.lo -MD -MP -MF .deps/cairo-xlib-xcb-surface.Tpo -c -o cairo-xlib-xcb-surface.lo cairo-xlib-xcb-surface.c
33:info:build libtool: compile:  /usr/bin/clang -DHAVE_CONFIG_H -I. -I.. -I. -D_REENTRANT -I/opt/local/include/pixman-1 -I/opt/local/include -I/opt/local/include/freetype2 -I/opt/local/include -I/opt/local/include/libpng15 -I/opt/local/include -I/opt/local/include -I/opt/local/include -I/opt/local/include -Wall -Wextra -Wold-style-definition -Wdeclaration-after-statement -Wmissing-declarations -Werror-implicit-function-declaration -Wnested-externs -Wpointer-arith -Wwrite-strings -Wsign-compare -Wstrict-prototypes -Wmissing-prototypes -Wpacked -Wswitch-enum -Wmissing-format-attribute -Wbad-function-cast -Wvolatile-register-var -Wstrict-aliasing=2 -Winit-self -Wno-missing-field-initializers -Wno-unused-parameter -Wno-attributes -Wno-long-long -Winline -erroff=E_ENUM_TYPE_MISMATCH_ARG -erroff=E_ENUM_TYPE_MISMATCH_OP -fno-strict-aliasing -fno-common -Wp,-D_FORTIFY_SOURCE=2 -I/opt/local/include -I/opt/local/include -pipe -O2 -arch x86_64 -MT cairo-xlib-xcb-surface.lo -MD -MP -MF .deps/cairo-xlib-xcb-surface.Tpo -c cairo-xlib-xcb-surface.c  -fno-common -DPIC -o .libs/cairo-xlib-xcb-surface.o
34:info:build clang: warning: argument unused during compilation: '-e rroff=E_ENUM_TYPE_MISMATCH_ARG'
35:info:build clang: warning: argument unused during compilation: '-e rroff=E_ENUM_TYPE_MISMATCH_OP'
36:info:build In file included from cairo-xlib-xcb-surface.c:47:
37:info:build ./cairo-xlib-xrender-private.h:102:16: error: redefinition of '_XLinearGradient'
38:info:build typedef struct _XLinearGradient {
39:info:build                ^
40:info:build /opt/local/include/X11/extensions/Xrender.h:186:16: note: previous definition is here
41:info:build typedef struct _XLinearGradient {
42:info:build                ^
43:info:build In file included from cairo-xlib-xcb-surface.c:47:
44:info:build ./cairo-xlib-xrender-private.h:105:3: error: typedef redefinition with different types ('struct XLinearGradient' vs 'struct _XLinearGradient')
45:info:build } XLinearGradient;
46:info:build   ^
47:info:build /opt/local/include/X11/extensions/Xrender.h:189:3: note: previous definition is here
48:info:build } XLinearGradient;
49:info:build   ^
50:info:build In file included from cairo-xlib-xcb-surface.c:47:
51:info:build ./cairo-xlib-xrender-private.h:111:16: error: redefinition of '_XCircle'
52:info:build typedef struct _XCircle {
53:info:build                ^
54:info:build /opt/local/include/X11/extensions/Xrender.h:146:16: note: previous definition is here
55:info:build typedef struct _XCircle {
56:info:build                ^
57:info:build In file included from cairo-xlib-xcb-surface.c:47:
58:info:build ./cairo-xlib-xrender-private.h:115:3: error: typedef redefinition with different types ('struct XCircle' vs 'struct _XCircle')
59:info:build } XCircle;
60:info:build   ^
61:info:build /opt/local/include/X11/extensions/Xrender.h:150:3: note: previous definition is here
62:info:build } XCircle;
63:info:build   ^
64:info:build In file included from cairo-xlib-xcb-surface.c:47:
65:info:build ./cairo-xlib-xrender-private.h:116:16: error: redefinition of '_XRadialGradient'
66:info:build typedef struct _XRadialGradient {
67:info:build                ^
68:info:build /opt/local/include/X11/extensions/Xrender.h:191:16: note: previous definition is here
69:info:build typedef struct _XRadialGradient {
70:info:build                ^
71:info:build In file included from cairo-xlib-xcb-surface.c:47:
72:info:build ./cairo-xlib-xrender-private.h:119:3: error: typedef redefinition with different types ('struct XRadialGradient' vs 'struct _XRadialGradient')
73:info:build } XRadialGradient;
74:info:build   ^
75:info:build /opt/local/include/X11/extensions/Xrender.h:194:3: note: previous definition is here
76:info:build } XRadialGradient;
77:info:build   ^
78:info:build In file included from cairo-xlib-xcb-surface.c:47:
79:info:build ./cairo-xlib-xrender-private.h:125:16: error: redefinition of '_XConicalGradient'
80:info:build typedef struct _XConicalGradient {
81:info:build                ^
82:info:build /opt/local/include/X11/extensions/Xrender.h:196:16: note: previous definition is here
83:info:build typedef struct _XConicalGradient {
84:info:build                ^
85:info:build In file included from cairo-xlib-xcb-surface.c:47:
86:info:build ./cairo-xlib-xrender-private.h:128:3: error: typedef redefinition with different types ('struct XConicalGradient' vs 'struct _XConicalGradient')
87:info:build } XConicalGradient;
88:info:build   ^
89:info:build /opt/local/include/X11/extensions/Xrender.h:199:3: note: previous definition is here
90:info:build } XConicalGradient;
91:info:build   ^
92:info:build cairo-xlib-xcb-surface.c:185:12: warning: implicit conversion from enumeration type 'cairo_status_t' (aka 'enum _cairo_status') to different enumeration type 'cairo_int_status_t' (aka 'enum _cairo_int_status') [-Wconversion]
93:info:build     return _cairo_surface_paint (&surface->xcb->base, op, source, clip);
94:info:build     ~~~~~~ ^~~~~~~~~~~~~~~~~~~~~~~~~~~~~~~~~~~~~~~~~~~~~~~~~~~~~~~~~~~~
95:info:build cairo-xlib-xcb-surface.c:196:12: warning: implicit conversion from enumeration type 'cairo_status_t' (aka 'enum _cairo_status') to different enumeration type 'cairo_int_status_t' (aka 'enum _cairo_int_status') [-Wconversion]
96:info:build     return _cairo_surface_mask (&surface->xcb->base, op, source, mask, clip);
97:info:build     ~~~~~~ ^~~~~~~~~~~~~~~~~~~~~~~~~~~~~~~~~~~~~~~~~~~~~~~~~~~~~~~~~~~~~~~~~
98:info:build cairo-xlib-xcb-surface.c:212:12: warning: implicit conversion from enumeration type 'cairo_status_t' (aka 'enum _cairo_status') to different enumeration type 'cairo_int_status_t' (aka 'enum _cairo_int_status') [-Wconversion]
99:info:build     return _cairo_surface_stroke (&surface->xcb->base,
100:info:build     ~~~~~~ ^~~~~~~~~~~~~~~~~~~~~~~~~~~~~~~~~~~~~~~~~~~
101:info:build cairo-xlib-xcb-surface.c:228:12: warning: implicit conversion from enumeration type 'cairo_status_t' (aka 'enum _cairo_status') to different enumeration type 'cairo_int_status_t' (aka 'enum _cairo_int_status') [-Wconversion]
102:info:build     return _cairo_surface_fill (&surface->xcb->base,
103:info:build     ~~~~~~ ^~~~~~~~~~~~~~~~~~~~~~~~~~~~~~~~~~~~~~~~~
104:info:build cairo-xlib-xcb-surface.c:244:12: warning: implicit conversion from enumeration type 'cairo_status_t' (aka 'enum _cairo_status') to different enumeration type 'cairo_int_status_t' (aka 'enum _cairo_int_status') [-Wconversion]
105:info:build     return _cairo_surface_show_text_glyphs (&surface->xcb->base, op, source,
106:info:build     ~~~~~~ ^~~~~~~~~~~~~~~~~~~~~~~~~~~~~~~~~~~~~~~~~~~~~~~~~~~~~~~~~~~~~~~~~
107:info:build cairo-xlib-xcb-surface.c:612:11: warning: implicit conversion from enumeration type 'cairo_int_status_t' (aka 'enum _cairo_int_status') to different enumeration type 'cairo_status_t' (aka 'enum _cairo_status') [-Wconversion]
108:info:build         status = _cairo_surface_set_error (abstract_surface,
109:info:build                ~ ^~~~~~~~~~~~~~~~~~~~~~~~~~~~~~~~~~~~~~~~~~~
110:info:build cairo-xlib-xcb-surface.c:613:30: warning: implicit conversion from enumeration type 'cairo_status_t' (aka 'enum _cairo_status') to different enumeration type 'cairo_int_status_t' (aka 'enum _cairo_int_status') [-Wconversion]
111:info:build                                            _cairo_error (CAIRO_STATUS_SURFACE_FINISHED));
112:info:build                                            ^~~~~~~~~~~~~~~~~~~~~~~~~~~~~~~~~~~~~~~~~~~~
113:info:build cairo-xlib-xcb-surface.c:618:11: warning: implicit conversion from enumeration type 'cairo_int_status_t' (aka 'enum _cairo_int_status') to different enumeration type 'cairo_status_t' (aka 'enum _cairo_status') [-Wconversion]
114:info:build         status = _cairo_surface_set_error (abstract_surface,
115:info:build                ~ ^~~~~~~~~~~~~~~~~~~~~~~~~~~~~~~~~~~~~~~~~~~
116:info:build cairo-xlib-xcb-surface.c:619:30: warning: implicit conversion from enumeration type 'enum _cairo_status' to different enumeration type 'cairo_int_status_t' (aka 'enum _cairo_int_status') [-Wconversion]
117:info:build                                            CAIRO_STATUS_SURFACE_TYPE_MISMATCH);
118:info:build                                            ^~~~~~~~~~~~~~~~~~~~~~~~~~~~~~~~~~
119:info:build cairo-xlib-xcb-surface.c:625:11: warning: implicit conversion from enumeration type 'cairo_int_status_t' (aka 'enum _cairo_int_status') to different enumeration type 'cairo_status_t' (aka 'enum _cairo_status') [-Wconversion]
120:info:build         status = _cairo_surface_set_error (abstract_surface,
121:info:build                ~ ^~~~~~~~~~~~~~~~~~~~~~~~~~~~~~~~~~~~~~~~~~~
122:info:build cairo-xlib-xcb-surface.c:626:30: warning: implicit conversion from enumeration type 'cairo_status_t' (aka 'enum _cairo_status') to different enumeration type 'cairo_int_status_t' (aka 'enum _cairo_int_status') [-Wconversion]
123:info:build                                            _cairo_error (surface->xcb->base.status));
124:info:build                                            ^~~~~~~~~~~~~~~~~~~~~~~~~~~~~~~~~~~~~~~~
125:info:build cairo-xlib-xcb-surface.c:642:11: warning: implicit conversion from enumeration type 'cairo_int_status_t' (aka 'enum _cairo_int_status') to different enumeration type 'cairo_status_t' (aka 'enum _cairo_status') [-Wconversion]
126:info:build         status = _cairo_surface_set_error (abstract_surface,
127:info:build                ~ ^~~~~~~~~~~~~~~~~~~~~~~~~~~~~~~~~~~~~~~~~~~
128:info:build cairo-xlib-xcb-surface.c:643:30: warning: implicit conversion from enumeration type 'cairo_status_t' (aka 'enum _cairo_status') to different enumeration type 'cairo_int_status_t' (aka 'enum _cairo_int_status') [-Wconversion]
129:info:build                                            _cairo_error (CAIRO_STATUS_SURFACE_FINISHED));
130:info:build                                            ^~~~~~~~~~~~~~~~~~~~~~~~~~~~~~~~~~~~~~~~~~~~
131:info:build cairo-xlib-xcb-surface.c:648:11: warning: implicit conversion from enumeration type 'cairo_int_status_t' (aka 'enum _cairo_int_status') to different enumeration type 'cairo_status_t' (aka 'enum _cairo_status') [-Wconversion]
132:info:build         status = _cairo_surface_set_error (abstract_surface,
133:info:build                ~ ^~~~~~~~~~~~~~~~~~~~~~~~~~~~~~~~~~~~~~~~~~~
134:info:build cairo-xlib-xcb-surface.c:649:30: warning: implicit conversion from enumeration type 'enum _cairo_status' to different enumeration type 'cairo_int_status_t' (aka 'enum _cairo_int_status') [-Wconversion]
135:info:build                                            CAIRO_STATUS_SURFACE_TYPE_MISMATCH);
136:info:build                                            ^~~~~~~~~~~~~~~~~~~~~~~~~~~~~~~~~~
137:info:build cairo-xlib-xcb-surface.c:655:11: warning: implicit conversion from enumeration type 'cairo_int_status_t' (aka 'enum _cairo_int_status') to different enumeration type 'cairo_status_t' (aka 'enum _cairo_status') [-Wconversion]
138:info:build         status = _cairo_surface_set_error (abstract_surface,
139:info:build                ~ ^~~~~~~~~~~~~~~~~~~~~~~~~~~~~~~~~~~~~~~~~~~
140:info:build cairo-xlib-xcb-surface.c:656:30: warning: implicit conversion from enumeration type 'cairo_status_t' (aka 'enum _cairo_status') to different enumeration type 'cairo_int_status_t' (aka 'enum _cairo_int_status') [-Wconversion]
141:info:build                                            _cairo_error (surface->xcb->base.status));
142:info:build                                            ^~~~~~~~~~~~~~~~~~~~~~~~~~~~~~~~~~~~~~~~
143:info:build 17 warnings and 8 errors generated.
144:info:build make[3]: *** [cairo-xlib-xcb-surface.lo] Error 1
145:info:build make[3]: Leaving directory `/opt/local/var/macports/build/_opt_local_var_macports_sources_rsync.macports.org_release_tarballs_ports_graphics_cairo/cairo/work/cairo-1.12.8/src'
146:info:build make[2]: *** [all] Error 2
147:info:build make[2]: Leaving directory `/opt/local/var/macports/build/_opt_local_var_macports_sources_rsync.macports.org_release_tarballs_ports_graphics_cairo/cairo/work/cairo-1.12.8/src'
148:info:build make[1]: *** [all-recursive] Error 1
149:info:build make[1]: Leaving directory `/opt/local/var/macports/build/_opt_local_var_macports_sources_rsync.macports.org_release_tarballs_ports_graphics_cairo/cairo/work/cairo-1.12.8'
150:info:build make: *** [all] Error 2
151:info:build make: Leaving directory `/opt/local/var/macports/build/_opt_local_var_macports_sources_rsync.macports.org_release_tarballs_ports_graphics_cairo/cairo/work/cairo-1.12.8'
152:info:build Command failed:  cd "/opt/local/var/macports/build/_opt_local_var_macports_sources_rsync.macports.org_release_tarballs_ports_graphics_cairo/cairo/work/cairo-1.12.8" && /usr/bin/make -j5 -w all
153:info:build Exit code: 2
154:error:build org.macports.build for port cairo returned: command execution failed
155:debug:build Error code: CHILDSTATUS 347 2
156:debug:build Backtrace: command execution failed
157    while executing
158"system -nice 0 $fullcmdstring"
159    ("eval" body line 1)
160    invoked from within
161"eval system $notty $nice \$fullcmdstring"
162    invoked from within
163"command_exec build"
164    (procedure "portbuild::build_main" line 8)
165    invoked from within
166"$procedure $targetname"
167:info:build Warning: targets not executed for cairo: org.macports.activate org.macports.build org.macports.destroot org.macports.install
168:error:build Failed to install cairo
169:debug:build couldn't open "/System/Library/Frameworks/Tcl.framework/Versions/8.5/Resources/tclIndex": no such file or directory
170    while executing
171"open [file join $dir tclIndex]"
172:notice:build Please see the log file for port cairo for details:
173    /opt/local/var/macports/logs/_opt_local_var_macports_sources_rsync.macports.org_release_tarballs_ports_graphics_cairo/cairo/main.log