Ticket #37144: main.log

File main.log, 174.2 KB (added by dmollaaliod@…, 8 years ago)

Log file

Line 
1version:1
2:debug:main epoch: in tree: 0 installed: 0
3:debug:main libtool 2.4.2_3 exists in the ports tree
4:debug:main libtool 2.4.2_3  is the latest installed
5:debug:main libtool 2.4.2_3  is active
6:debug:main Merging existing variants '' into variants
7:debug:main new fully merged portvariants:
8:debug:main Changing to port directory: /opt/local/var/macports/sources/rsync.macports.org/release/tarballs/ports/devel/libtool
9:debug:main OS darwin/12.2.0 (Mac OS X 10.8) arch i386
10:debug:main org.macports.load registered provides 'load', a pre-existing procedure. Target override will not be provided
11:debug:main org.macports.unload registered provides 'unload', a pre-existing procedure. Target override will not be provided
12:debug:main org.macports.distfiles registered provides 'distfiles', a pre-existing procedure. Target override will not be provided
13:debug:main adding the default universal variant
14:debug:main Reading variant descriptions from /opt/local/var/macports/sources/rsync.macports.org/release/tarballs/ports/_resources/port1.0/variant_descriptions.conf
15:debug:main No need to upgrade! libtool 2.4.2_3 >= libtool 2.4.2_3
16:debug:main epoch: in tree: 0 installed: 0
17:debug:main makeicns 1.4.10a_0 exists in the ports tree
18:debug:main makeicns 1.4.10a_0  is the latest installed
19:debug:main makeicns 1.4.10a_0  is active
20:debug:main Merging existing variants '' into variants
21:debug:main new fully merged portvariants:
22:debug:main Changing to port directory: /opt/local/var/macports/sources/rsync.macports.org/release/tarballs/ports/graphics/makeicns
23:debug:main OS darwin/12.2.0 (Mac OS X 10.8) arch i386
24:debug:main org.macports.load registered provides 'load', a pre-existing procedure. Target override will not be provided
25:debug:main org.macports.unload registered provides 'unload', a pre-existing procedure. Target override will not be provided
26:debug:main org.macports.distfiles registered provides 'distfiles', a pre-existing procedure. Target override will not be provided
27:debug:main Reading variant descriptions from /opt/local/var/macports/sources/rsync.macports.org/release/tarballs/ports/_resources/port1.0/variant_descriptions.conf
28:debug:main universal variant already exists, so not adding the default one
29:debug:main No need to upgrade! makeicns 1.4.10a_0 >= makeicns 1.4.10a_0
30:debug:main epoch: in tree: 0 installed: 0
31:debug:main aqbanking 4.2.4_1 exists in the ports tree
32:debug:main aqbanking 4.2.4_1  is the latest installed
33:debug:main aqbanking 4.2.4_1  is active
34:debug:main Merging existing variants '' into variants
35:debug:main new fully merged portvariants:
36:debug:main Changing to port directory: /opt/local/var/macports/sources/rsync.macports.org/release/tarballs/ports/devel/aqbanking
37:debug:main OS darwin/12.2.0 (Mac OS X 10.8) arch i386
38:debug:main org.macports.load registered provides 'load', a pre-existing procedure. Target override will not be provided
39:debug:main org.macports.unload registered provides 'unload', a pre-existing procedure. Target override will not be provided
40:debug:main org.macports.distfiles registered provides 'distfiles', a pre-existing procedure. Target override will not be provided
41:debug:main universal_variant is false, so not adding the default universal variant
42:debug:main No need to upgrade! aqbanking 4.2.4_1 >= aqbanking 4.2.4_1
43:debug:main epoch: in tree: 0 installed: 0
44:debug:main gwenhywfar 3.11.3_2 exists in the ports tree
45:debug:main gwenhywfar 3.11.3_2  is the latest installed
46:debug:main gwenhywfar 3.11.3_2  is active
47:debug:main Merging existing variants '' into variants
48:debug:main new fully merged portvariants:
49:debug:main Changing to port directory: /opt/local/var/macports/sources/rsync.macports.org/release/tarballs/ports/devel/gwenhywfar
50:debug:main OS darwin/12.2.0 (Mac OS X 10.8) arch i386
51:debug:main org.macports.load registered provides 'load', a pre-existing procedure. Target override will not be provided
52:debug:main org.macports.unload registered provides 'unload', a pre-existing procedure. Target override will not be provided
53:debug:main org.macports.distfiles registered provides 'distfiles', a pre-existing procedure. Target override will not be provided
54:debug:main adding the default universal variant
55:debug:main Reading variant descriptions from /opt/local/var/macports/sources/rsync.macports.org/release/tarballs/ports/_resources/port1.0/variant_descriptions.conf
56:debug:main No need to upgrade! gwenhywfar 3.11.3_2 >= gwenhywfar 3.11.3_2
57:debug:main epoch: in tree: 1 installed: 1
58:debug:main openssl 1.0.1c_0 exists in the ports tree
59:debug:main openssl 1.0.1c_0  is the latest installed
60:debug:main openssl 1.0.1c_0  is active
61:debug:main Merging existing variants '' into variants
62:debug:main new fully merged portvariants:
63:debug:main Changing to port directory: /opt/local/var/macports/sources/rsync.macports.org/release/tarballs/ports/devel/openssl
64:debug:main OS darwin/12.2.0 (Mac OS X 10.8) arch i386
65:debug:main org.macports.load registered provides 'load', a pre-existing procedure. Target override will not be provided
66:debug:main org.macports.unload registered provides 'unload', a pre-existing procedure. Target override will not be provided
67:debug:main org.macports.distfiles registered provides 'distfiles', a pre-existing procedure. Target override will not be provided
68:debug:main Using group file /opt/local/var/macports/sources/rsync.macports.org/release/tarballs/ports/_resources/port1.0/group/muniversal-1.0.tcl
69:debug:main Reading variant descriptions from /opt/local/var/macports/sources/rsync.macports.org/release/tarballs/ports/_resources/port1.0/variant_descriptions.conf
70:debug:main universal variant already exists, so not adding the default one
71:debug:main No need to upgrade! openssl 1.0.1c_0 >= openssl 1.0.1c_0
72:debug:main epoch: in tree: 0 installed: 0
73:debug:main zlib 1.2.7_0 exists in the ports tree
74:debug:main zlib 1.2.7_0  is the latest installed
75:debug:main zlib 1.2.7_0  is active
76:debug:main Merging existing variants '' into variants
77:debug:main new fully merged portvariants:
78:debug:main Changing to port directory: /opt/local/var/macports/sources/rsync.macports.org/release/tarballs/ports/archivers/zlib
79:debug:main OS darwin/12.2.0 (Mac OS X 10.8) arch i386
80:debug:main org.macports.load registered provides 'load', a pre-existing procedure. Target override will not be provided
81:debug:main org.macports.unload registered provides 'unload', a pre-existing procedure. Target override will not be provided
82:debug:main org.macports.distfiles registered provides 'distfiles', a pre-existing procedure. Target override will not be provided
83:debug:main Using group file /opt/local/var/macports/sources/rsync.macports.org/release/tarballs/ports/_resources/port1.0/group/xcodeversion-1.0.tcl
84:debug:main adding the default universal variant
85:debug:main Reading variant descriptions from /opt/local/var/macports/sources/rsync.macports.org/release/tarballs/ports/_resources/port1.0/variant_descriptions.conf
86:debug:main No need to upgrade! zlib 1.2.7_0 >= zlib 1.2.7_0
87:debug:main epoch: in tree: 0 installed: 0
88:debug:main libgcrypt 1.5.0_0 exists in the ports tree
89:debug:main libgcrypt 1.5.0_0  is the latest installed
90:debug:main libgcrypt 1.5.0_0  is active
91:debug:main Merging existing variants '' into variants
92:debug:main new fully merged portvariants:
93:debug:main Changing to port directory: /opt/local/var/macports/sources/rsync.macports.org/release/tarballs/ports/devel/libgcrypt
94:debug:main OS darwin/12.2.0 (Mac OS X 10.8) arch i386
95:debug:main org.macports.load registered provides 'load', a pre-existing procedure. Target override will not be provided
96:debug:main org.macports.unload registered provides 'unload', a pre-existing procedure. Target override will not be provided
97:debug:main org.macports.distfiles registered provides 'distfiles', a pre-existing procedure. Target override will not be provided
98:debug:main Using group file /opt/local/var/macports/sources/rsync.macports.org/release/tarballs/ports/_resources/port1.0/group/muniversal-1.0.tcl
99:debug:main Reading variant descriptions from /opt/local/var/macports/sources/rsync.macports.org/release/tarballs/ports/_resources/port1.0/variant_descriptions.conf
100:debug:main universal variant already exists, so not adding the default one
101:debug:main No need to upgrade! libgcrypt 1.5.0_0 >= libgcrypt 1.5.0_0
102:debug:main epoch: in tree: 0 installed: 0
103:debug:main libgpg-error 1.10_0 exists in the ports tree
104:debug:main libgpg-error 1.10_0  is the latest installed
105:debug:main libgpg-error 1.10_0  is active
106:debug:main Merging existing variants '' into variants
107:debug:main new fully merged portvariants:
108:debug:main Changing to port directory: /opt/local/var/macports/sources/rsync.macports.org/release/tarballs/ports/devel/libgpg-error
109:debug:main OS darwin/12.2.0 (Mac OS X 10.8) arch i386
110:debug:main org.macports.load registered provides 'load', a pre-existing procedure. Target override will not be provided
111:debug:main org.macports.unload registered provides 'unload', a pre-existing procedure. Target override will not be provided
112:debug:main org.macports.distfiles registered provides 'distfiles', a pre-existing procedure. Target override will not be provided
113:debug:main Using group file /opt/local/var/macports/sources/rsync.macports.org/release/tarballs/ports/_resources/port1.0/group/archcheck-1.0.tcl
114:debug:main adding the default universal variant
115:debug:main Reading variant descriptions from /opt/local/var/macports/sources/rsync.macports.org/release/tarballs/ports/_resources/port1.0/variant_descriptions.conf
116:debug:main No need to upgrade! libgpg-error 1.10_0 >= libgpg-error 1.10_0
117:debug:main epoch: in tree: 0 installed: 0
118:debug:main libiconv 1.14_0 exists in the ports tree
119:debug:main libiconv 1.14_0  is the latest installed
120:debug:main libiconv 1.14_0  is active
121:debug:main Merging existing variants '' into variants
122:debug:main new fully merged portvariants:
123:debug:main Changing to port directory: /opt/local/var/macports/sources/rsync.macports.org/release/tarballs/ports/textproc/libiconv
124:debug:main OS darwin/12.2.0 (Mac OS X 10.8) arch i386
125:debug:main org.macports.load registered provides 'load', a pre-existing procedure. Target override will not be provided
126:debug:main org.macports.unload registered provides 'unload', a pre-existing procedure. Target override will not be provided
127:debug:main org.macports.distfiles registered provides 'distfiles', a pre-existing procedure. Target override will not be provided
128:debug:main Using group file /opt/local/var/macports/sources/rsync.macports.org/release/tarballs/ports/_resources/port1.0/group/muniversal-1.0.tcl
129:debug:main Reading variant descriptions from /opt/local/var/macports/sources/rsync.macports.org/release/tarballs/ports/_resources/port1.0/variant_descriptions.conf
130:debug:main universal variant already exists, so not adding the default one
131:debug:main No need to upgrade! libiconv 1.14_0 >= libiconv 1.14_0
132:debug:main epoch: in tree: 0 installed: 0
133:debug:main gettext 0.18.1.1_2 exists in the ports tree
134:debug:main gettext 0.18.1.1_2  is the latest installed
135:debug:main gettext 0.18.1.1_2  is active
136:debug:main Merging existing variants '' into variants
137:debug:main new fully merged portvariants:
138:debug:main Changing to port directory: /opt/local/var/macports/sources/rsync.macports.org/release/tarballs/ports/devel/gettext
139:debug:main OS darwin/12.2.0 (Mac OS X 10.8) arch i386
140:debug:main org.macports.load registered provides 'load', a pre-existing procedure. Target override will not be provided
141:debug:main org.macports.unload registered provides 'unload', a pre-existing procedure. Target override will not be provided
142:debug:main org.macports.distfiles registered provides 'distfiles', a pre-existing procedure. Target override will not be provided
143:debug:main Using group file /opt/local/var/macports/sources/rsync.macports.org/release/tarballs/ports/_resources/port1.0/group/muniversal-1.0.tcl
144:debug:main Reading variant descriptions from /opt/local/var/macports/sources/rsync.macports.org/release/tarballs/ports/_resources/port1.0/variant_descriptions.conf
145:debug:main Using group file /opt/local/var/macports/sources/rsync.macports.org/release/tarballs/ports/_resources/port1.0/group/archcheck-1.0.tcl
146:debug:main universal variant already exists, so not adding the default one
147:debug:main No need to upgrade! gettext 0.18.1.1_2 >= gettext 0.18.1.1_2
148:debug:main epoch: in tree: 0 installed: 0
149:debug:main ncurses 5.9_1 exists in the ports tree
150:debug:main ncurses 5.9_1  is the latest installed
151:debug:main ncurses 5.9_1  is active
152:debug:main Merging existing variants '' into variants
153:debug:main new fully merged portvariants:
154:debug:main Changing to port directory: /opt/local/var/macports/sources/rsync.macports.org/release/tarballs/ports/devel/ncurses
155:debug:main OS darwin/12.2.0 (Mac OS X 10.8) arch i386
156:debug:main org.macports.load registered provides 'load', a pre-existing procedure. Target override will not be provided
157:debug:main org.macports.unload registered provides 'unload', a pre-existing procedure. Target override will not be provided
158:debug:main org.macports.distfiles registered provides 'distfiles', a pre-existing procedure. Target override will not be provided
159:debug:main adding the default universal variant
160:debug:main Reading variant descriptions from /opt/local/var/macports/sources/rsync.macports.org/release/tarballs/ports/_resources/port1.0/variant_descriptions.conf
161:debug:main No need to upgrade! ncurses 5.9_1 >= ncurses 5.9_1
162:debug:main epoch: in tree: 0 installed: 0
163:debug:main expat 2.1.0_0 exists in the ports tree
164:debug:main expat 2.1.0_0  is the latest installed
165:debug:main expat 2.1.0_0  is active
166:debug:main Merging existing variants '' into variants
167:debug:main new fully merged portvariants:
168:debug:main Changing to port directory: /opt/local/var/macports/sources/rsync.macports.org/release/tarballs/ports/textproc/expat
169:debug:main OS darwin/12.2.0 (Mac OS X 10.8) arch i386
170:debug:main org.macports.load registered provides 'load', a pre-existing procedure. Target override will not be provided
171:debug:main org.macports.unload registered provides 'unload', a pre-existing procedure. Target override will not be provided
172:debug:main org.macports.distfiles registered provides 'distfiles', a pre-existing procedure. Target override will not be provided
173:debug:main adding the default universal variant
174:debug:main Reading variant descriptions from /opt/local/var/macports/sources/rsync.macports.org/release/tarballs/ports/_resources/port1.0/variant_descriptions.conf
175:debug:main No need to upgrade! expat 2.1.0_0 >= expat 2.1.0_0
176:debug:main epoch: in tree: 0 installed: 0
177:debug:main libxml2 2.8.0_0 exists in the ports tree
178:debug:main libxml2 2.8.0_0  is the latest installed
179:debug:main libxml2 2.8.0_0  is active
180:debug:main Merging existing variants '' into variants
181:debug:main new fully merged portvariants:
182:debug:main Changing to port directory: /opt/local/var/macports/sources/rsync.macports.org/release/tarballs/ports/textproc/libxml2
183:debug:main OS darwin/12.2.0 (Mac OS X 10.8) arch i386
184:debug:main org.macports.load registered provides 'load', a pre-existing procedure. Target override will not be provided
185:debug:main org.macports.unload registered provides 'unload', a pre-existing procedure. Target override will not be provided
186:debug:main org.macports.distfiles registered provides 'distfiles', a pre-existing procedure. Target override will not be provided
187:debug:main adding the default universal variant
188:debug:main Reading variant descriptions from /opt/local/var/macports/sources/rsync.macports.org/release/tarballs/ports/_resources/port1.0/variant_descriptions.conf
189:debug:main No need to upgrade! libxml2 2.8.0_0 >= libxml2 2.8.0_0
190:debug:main epoch: in tree: 0 installed: 0
191:debug:main xz 5.0.4_0 exists in the ports tree
192:debug:main xz 5.0.4_0  is the latest installed
193:debug:main xz 5.0.4_0  is active
194:debug:main Merging existing variants '' into variants
195:debug:main new fully merged portvariants:
196:debug:main Changing to port directory: /opt/local/var/macports/sources/rsync.macports.org/release/tarballs/ports/archivers/xz
197:debug:main OS darwin/12.2.0 (Mac OS X 10.8) arch i386
198:debug:main org.macports.load registered provides 'load', a pre-existing procedure. Target override will not be provided
199:debug:main org.macports.unload registered provides 'unload', a pre-existing procedure. Target override will not be provided
200:debug:main org.macports.distfiles registered provides 'distfiles', a pre-existing procedure. Target override will not be provided
201:debug:main adding the default universal variant
202:debug:main Reading variant descriptions from /opt/local/var/macports/sources/rsync.macports.org/release/tarballs/ports/_resources/port1.0/variant_descriptions.conf
203:debug:main No need to upgrade! xz 5.0.4_0 >= xz 5.0.4_0
204:debug:main epoch: in tree: 0 installed: 0
205:debug:main gnutls 2.12.19_0 exists in the ports tree
206:debug:main gnutls 2.12.19_0  is the latest installed
207:debug:main gnutls 2.12.19_0  is active
208:debug:main Merging existing variants '' into variants
209:debug:main new fully merged portvariants:
210:debug:main Changing to port directory: /opt/local/var/macports/sources/rsync.macports.org/release/tarballs/ports/devel/gnutls
211:debug:main OS darwin/12.2.0 (Mac OS X 10.8) arch i386
212:debug:main org.macports.load registered provides 'load', a pre-existing procedure. Target override will not be provided
213:debug:main org.macports.unload registered provides 'unload', a pre-existing procedure. Target override will not be provided
214:debug:main org.macports.distfiles registered provides 'distfiles', a pre-existing procedure. Target override will not be provided
215:debug:main adding the default universal variant
216:debug:main Reading variant descriptions from /opt/local/var/macports/sources/rsync.macports.org/release/tarballs/ports/_resources/port1.0/variant_descriptions.conf
217:debug:main No need to upgrade! gnutls 2.12.19_0 >= gnutls 2.12.19_0
218:debug:main epoch: in tree: 0 installed: 0
219:debug:main libtasn1 2.11_0 exists in the ports tree
220:debug:main libtasn1 2.11_0  is the latest installed
221:debug:main libtasn1 2.11_0  is active
222:debug:main Merging existing variants '' into variants
223:debug:main new fully merged portvariants:
224:debug:main Changing to port directory: /opt/local/var/macports/sources/rsync.macports.org/release/tarballs/ports/devel/libtasn1
225:debug:main OS darwin/12.2.0 (Mac OS X 10.8) arch i386
226:debug:main org.macports.load registered provides 'load', a pre-existing procedure. Target override will not be provided
227:debug:main org.macports.unload registered provides 'unload', a pre-existing procedure. Target override will not be provided
228:debug:main org.macports.distfiles registered provides 'distfiles', a pre-existing procedure. Target override will not be provided
229:debug:main adding the default universal variant
230:debug:main Reading variant descriptions from /opt/local/var/macports/sources/rsync.macports.org/release/tarballs/ports/_resources/port1.0/variant_descriptions.conf
231:debug:main No need to upgrade! libtasn1 2.11_0 >= libtasn1 2.11_0
232:debug:main epoch: in tree: 0 installed: 0
233:debug:main lzo2 2.05_1 exists in the ports tree
234:debug:main lzo2 2.05_1  is the latest installed
235:debug:main lzo2 2.05_1  is active
236:debug:main Merging existing variants '' into variants
237:debug:main new fully merged portvariants:
238:debug:main Changing to port directory: /opt/local/var/macports/sources/rsync.macports.org/release/tarballs/ports/archivers/lzo2
239:debug:main OS darwin/12.2.0 (Mac OS X 10.8) arch i386
240:debug:main org.macports.load registered provides 'load', a pre-existing procedure. Target override will not be provided
241:debug:main org.macports.unload registered provides 'unload', a pre-existing procedure. Target override will not be provided
242:debug:main org.macports.distfiles registered provides 'distfiles', a pre-existing procedure. Target override will not be provided
243:debug:main Using group file /opt/local/var/macports/sources/rsync.macports.org/release/tarballs/ports/_resources/port1.0/group/muniversal-1.0.tcl
244:debug:main Reading variant descriptions from /opt/local/var/macports/sources/rsync.macports.org/release/tarballs/ports/_resources/port1.0/variant_descriptions.conf
245:debug:main universal variant already exists, so not adding the default one
246:debug:main No need to upgrade! lzo2 2.05_1 >= lzo2 2.05_1
247:debug:main epoch: in tree: 0 installed: 0
248:debug:main readline 6.2.000_0 exists in the ports tree
249:debug:main readline 6.2.000_0  is the latest installed
250:debug:main readline 6.2.000_0  is active
251:debug:main Merging existing variants '' into variants
252:debug:main new fully merged portvariants:
253:debug:main Changing to port directory: /opt/local/var/macports/sources/rsync.macports.org/release/tarballs/ports/devel/readline
254:debug:main OS darwin/12.2.0 (Mac OS X 10.8) arch i386
255:debug:main org.macports.load registered provides 'load', a pre-existing procedure. Target override will not be provided
256:debug:main org.macports.unload registered provides 'unload', a pre-existing procedure. Target override will not be provided
257:debug:main org.macports.distfiles registered provides 'distfiles', a pre-existing procedure. Target override will not be provided
258:debug:main Using group file /opt/local/var/macports/sources/rsync.macports.org/release/tarballs/ports/_resources/port1.0/group/muniversal-1.0.tcl
259:debug:main Reading variant descriptions from /opt/local/var/macports/sources/rsync.macports.org/release/tarballs/ports/_resources/port1.0/variant_descriptions.conf
260:debug:main universal variant already exists, so not adding the default one
261:debug:main No need to upgrade! readline 6.2.000_0 >= readline 6.2.000_0
262:debug:main epoch: in tree: 0 installed: 0
263:debug:main qt3 3.3.8_12 exists in the ports tree
264:debug:main qt3 3.3.8_12  is the latest installed
265:debug:main qt3 3.3.8_12  is active
266:debug:main Merging existing variants '' into variants
267:debug:main new fully merged portvariants:
268:debug:main Changing to port directory: /opt/local/var/macports/sources/rsync.macports.org/release/tarballs/ports/x11/qt3
269:debug:main OS darwin/12.2.0 (Mac OS X 10.8) arch i386
270:debug:main org.macports.load registered provides 'load', a pre-existing procedure. Target override will not be provided
271:debug:main org.macports.unload registered provides 'unload', a pre-existing procedure. Target override will not be provided
272:debug:main org.macports.distfiles registered provides 'distfiles', a pre-existing procedure. Target override will not be provided
273:debug:main universal_variant is false, so not adding the default universal variant
274:debug:main No need to upgrade! qt3 3.3.8_12 >= qt3 3.3.8_12
275:debug:main epoch: in tree: 1 installed: 1
276:debug:main mesa 8.0.4_1 exists in the ports tree
277:debug:main mesa 8.0.4_1 +python27 is the latest installed
278:debug:main mesa 8.0.4_1 +python27 is active
279:debug:main Merging existing variants '+python27' into variants
280:debug:main new fully merged portvariants: python27 +
281:debug:main Changing to port directory: /opt/local/var/macports/sources/rsync.macports.org/release/tarballs/ports/x11/mesa
282:debug:main OS darwin/12.2.0 (Mac OS X 10.8) arch i386
283:debug:main org.macports.load registered provides 'load', a pre-existing procedure. Target override will not be provided
284:debug:main org.macports.unload registered provides 'unload', a pre-existing procedure. Target override will not be provided
285:debug:main org.macports.distfiles registered provides 'distfiles', a pre-existing procedure. Target override will not be provided
286:debug:main Reading variant descriptions from /opt/local/var/macports/sources/rsync.macports.org/release/tarballs/ports/_resources/port1.0/variant_descriptions.conf
287:debug:main universal variant already exists, so not adding the default one
288:debug:main Executing variant python27 provides python27
289:debug:main No need to upgrade! mesa 8.0.4_1 >= mesa 8.0.4_1
290:debug:main epoch: in tree: 0 installed: 0
291:debug:main xorg-glproto 1.4.16_0 exists in the ports tree
292:debug:main xorg-glproto 1.4.16_0  is the latest installed
293:debug:main xorg-glproto 1.4.16_0  is active
294:debug:main Merging existing variants '' into variants
295:debug:main new fully merged portvariants:
296:debug:main Changing to port directory: /opt/local/var/macports/sources/rsync.macports.org/release/tarballs/ports/x11/xorg-glproto
297:debug:main OS darwin/12.2.0 (Mac OS X 10.8) arch i386
298:debug:main org.macports.load registered provides 'load', a pre-existing procedure. Target override will not be provided
299:debug:main org.macports.unload registered provides 'unload', a pre-existing procedure. Target override will not be provided
300:debug:main org.macports.distfiles registered provides 'distfiles', a pre-existing procedure. Target override will not be provided
301:debug:main only one arch supported, so not adding the default universal variant
302:debug:main No need to upgrade! xorg-glproto 1.4.16_0 >= xorg-glproto 1.4.16_0
303:debug:main epoch: in tree: 0 installed: 0
304:debug:main xorg-dri2proto 2.8_0 exists in the ports tree
305:debug:main xorg-dri2proto 2.8_0  is the latest installed
306:debug:main xorg-dri2proto 2.8_0  is active
307:debug:main Merging existing variants '' into variants
308:debug:main new fully merged portvariants:
309:debug:main Changing to port directory: /opt/local/var/macports/sources/rsync.macports.org/release/tarballs/ports/x11/xorg-dri2proto
310:debug:main OS darwin/12.2.0 (Mac OS X 10.8) arch i386
311:debug:main org.macports.load registered provides 'load', a pre-existing procedure. Target override will not be provided
312:debug:main org.macports.unload registered provides 'unload', a pre-existing procedure. Target override will not be provided
313:debug:main org.macports.distfiles registered provides 'distfiles', a pre-existing procedure. Target override will not be provided
314:debug:main only one arch supported, so not adding the default universal variant
315:debug:main No need to upgrade! xorg-dri2proto 2.8_0 >= xorg-dri2proto 2.8_0
316:debug:main epoch: in tree: 0 installed: 0
317:debug:main xorg-libXfixes 5.0_0 exists in the ports tree
318:debug:main xorg-libXfixes 5.0_0  is the latest installed
319:debug:main xorg-libXfixes 5.0_0  is active
320:debug:main Merging existing variants '' into variants
321:debug:main new fully merged portvariants:
322:debug:main Changing to port directory: /opt/local/var/macports/sources/rsync.macports.org/release/tarballs/ports/x11/xorg-libXfixes
323:debug:main OS darwin/12.2.0 (Mac OS X 10.8) arch i386
324:debug:main org.macports.load registered provides 'load', a pre-existing procedure. Target override will not be provided
325:debug:main org.macports.unload registered provides 'unload', a pre-existing procedure. Target override will not be provided
326:debug:main org.macports.distfiles registered provides 'distfiles', a pre-existing procedure. Target override will not be provided
327:debug:main adding the default universal variant
328:debug:main Reading variant descriptions from /opt/local/var/macports/sources/rsync.macports.org/release/tarballs/ports/_resources/port1.0/variant_descriptions.conf
329:debug:main No need to upgrade! xorg-libXfixes 5.0_0 >= xorg-libXfixes 5.0_0
330:debug:main epoch: in tree: 0 installed: 0
331:debug:main xorg-libX11 1.5.0_0 exists in the ports tree
332:debug:main xorg-libX11 1.5.0_0  is the latest installed
333:debug:main xorg-libX11 1.5.0_0  is active
334:debug:main Merging existing variants '' into variants
335:debug:main new fully merged portvariants:
336:debug:main Changing to port directory: /opt/local/var/macports/sources/rsync.macports.org/release/tarballs/ports/x11/xorg-libX11
337:debug:main OS darwin/12.2.0 (Mac OS X 10.8) arch i386
338:debug:main org.macports.load registered provides 'load', a pre-existing procedure. Target override will not be provided
339:debug:main org.macports.unload registered provides 'unload', a pre-existing procedure. Target override will not be provided
340:debug:main org.macports.distfiles registered provides 'distfiles', a pre-existing procedure. Target override will not be provided
341:debug:main adding the default universal variant
342:debug:main Reading variant descriptions from /opt/local/var/macports/sources/rsync.macports.org/release/tarballs/ports/_resources/port1.0/variant_descriptions.conf
343:debug:main No need to upgrade! xorg-libX11 1.5.0_0 >= xorg-libX11 1.5.0_0
344:debug:main epoch: in tree: 0 installed: 0
345:debug:main xorg-libXdmcp 1.1.1_0 exists in the ports tree
346:debug:main xorg-libXdmcp 1.1.1_0  is the latest installed
347:debug:main xorg-libXdmcp 1.1.1_0  is active
348:debug:main Merging existing variants '' into variants
349:debug:main new fully merged portvariants:
350:debug:main Changing to port directory: /opt/local/var/macports/sources/rsync.macports.org/release/tarballs/ports/x11/xorg-libXdmcp
351:debug:main OS darwin/12.2.0 (Mac OS X 10.8) arch i386
352:debug:main org.macports.load registered provides 'load', a pre-existing procedure. Target override will not be provided
353:debug:main org.macports.unload registered provides 'unload', a pre-existing procedure. Target override will not be provided
354:debug:main org.macports.distfiles registered provides 'distfiles', a pre-existing procedure. Target override will not be provided
355:debug:main adding the default universal variant
356:debug:main Reading variant descriptions from /opt/local/var/macports/sources/rsync.macports.org/release/tarballs/ports/_resources/port1.0/variant_descriptions.conf
357:debug:main No need to upgrade! xorg-libXdmcp 1.1.1_0 >= xorg-libXdmcp 1.1.1_0
358:debug:main epoch: in tree: 0 installed: 0
359:debug:main xorg-libXau 1.0.7_0 exists in the ports tree
360:debug:main xorg-libXau 1.0.7_0  is the latest installed
361:debug:main xorg-libXau 1.0.7_0  is active
362:debug:main Merging existing variants '' into variants
363:debug:main new fully merged portvariants:
364:debug:main Changing to port directory: /opt/local/var/macports/sources/rsync.macports.org/release/tarballs/ports/x11/xorg-libXau
365:debug:main OS darwin/12.2.0 (Mac OS X 10.8) arch i386
366:debug:main org.macports.load registered provides 'load', a pre-existing procedure. Target override will not be provided
367:debug:main org.macports.unload registered provides 'unload', a pre-existing procedure. Target override will not be provided
368:debug:main org.macports.distfiles registered provides 'distfiles', a pre-existing procedure. Target override will not be provided
369:debug:main adding the default universal variant
370:debug:main Reading variant descriptions from /opt/local/var/macports/sources/rsync.macports.org/release/tarballs/ports/_resources/port1.0/variant_descriptions.conf
371:debug:main No need to upgrade! xorg-libXau 1.0.7_0 >= xorg-libXau 1.0.7_0
372:debug:main epoch: in tree: 0 installed: 0
373:debug:main xorg-xproto 7.0.23_0 exists in the ports tree
374:debug:main xorg-xproto 7.0.23_0  is the latest installed
375:debug:main xorg-xproto 7.0.23_0  is active
376:debug:main Merging existing variants '' into variants
377:debug:main new fully merged portvariants:
378:debug:main Changing to port directory: /opt/local/var/macports/sources/rsync.macports.org/release/tarballs/ports/x11/xorg-xproto
379:debug:main OS darwin/12.2.0 (Mac OS X 10.8) arch i386
380:debug:main org.macports.load registered provides 'load', a pre-existing procedure. Target override will not be provided
381:debug:main org.macports.unload registered provides 'unload', a pre-existing procedure. Target override will not be provided
382:debug:main org.macports.distfiles registered provides 'distfiles', a pre-existing procedure. Target override will not be provided
383:debug:main only one arch supported, so not adding the default universal variant
384:debug:main No need to upgrade! xorg-xproto 7.0.23_0 >= xorg-xproto 7.0.23_0
385:debug:main epoch: in tree: 0 installed: 0
386:debug:main xorg-libxcb 1.8.1_2 exists in the ports tree
387:debug:main xorg-libxcb 1.8.1_2 +python27 is the latest installed
388:debug:main xorg-libxcb 1.8.1_2 +python27 is active
389:debug:main Merging existing variants '+python27' into variants
390:debug:main new fully merged portvariants: python27 +
391:debug:main Changing to port directory: /opt/local/var/macports/sources/rsync.macports.org/release/tarballs/ports/x11/xorg-libxcb
392:debug:main OS darwin/12.2.0 (Mac OS X 10.8) arch i386
393:debug:main org.macports.load registered provides 'load', a pre-existing procedure. Target override will not be provided
394:debug:main org.macports.unload registered provides 'unload', a pre-existing procedure. Target override will not be provided
395:debug:main org.macports.distfiles registered provides 'distfiles', a pre-existing procedure. Target override will not be provided
396:debug:main adding the default universal variant
397:debug:main Reading variant descriptions from /opt/local/var/macports/sources/rsync.macports.org/release/tarballs/ports/_resources/port1.0/variant_descriptions.conf
398:debug:main Executing variant python27 provides python27
399:debug:main No need to upgrade! xorg-libxcb 1.8.1_2 >= xorg-libxcb 1.8.1_2
400:debug:main epoch: in tree: 0 installed: 0
401:debug:main xorg-xcb-proto 1.7.1_0 exists in the ports tree
402:debug:main xorg-xcb-proto 1.7.1_0 +python27 is the latest installed
403:debug:main xorg-xcb-proto 1.7.1_0 +python27 is active
404:debug:main Merging existing variants '+python27' into variants
405:debug:main new fully merged portvariants: python27 +
406:debug:main Changing to port directory: /opt/local/var/macports/sources/rsync.macports.org/release/tarballs/ports/x11/xorg-xcb-proto
407:debug:main OS darwin/12.2.0 (Mac OS X 10.8) arch i386
408:debug:main org.macports.load registered provides 'load', a pre-existing procedure. Target override will not be provided
409:debug:main org.macports.unload registered provides 'unload', a pre-existing procedure. Target override will not be provided
410:debug:main org.macports.distfiles registered provides 'distfiles', a pre-existing procedure. Target override will not be provided
411:debug:main only one arch supported, so not adding the default universal variant
412:debug:main Executing variant python27 provides python27
413:debug:main No need to upgrade! xorg-xcb-proto 1.7.1_0 >= xorg-xcb-proto 1.7.1_0
414:debug:main epoch: in tree: 2 installed: 2
415:debug:main python27 2.7.3_1 exists in the ports tree
416:debug:main python27 2.7.3_1  is the latest installed
417:debug:main python27 2.7.3_1  is active
418:debug:main Merging existing variants '' into variants
419:debug:main new fully merged portvariants:
420:debug:main Changing to port directory: /opt/local/var/macports/sources/rsync.macports.org/release/tarballs/ports/lang/python27
421:debug:main OS darwin/12.2.0 (Mac OS X 10.8) arch i386
422:debug:main org.macports.load registered provides 'load', a pre-existing procedure. Target override will not be provided
423:debug:main org.macports.unload registered provides 'unload', a pre-existing procedure. Target override will not be provided
424:debug:main org.macports.distfiles registered provides 'distfiles', a pre-existing procedure. Target override will not be provided
425:debug:main Using group file /opt/local/var/macports/sources/rsync.macports.org/release/tarballs/ports/_resources/port1.0/group/select-1.0.tcl
426:debug:main Reading variant descriptions from /opt/local/var/macports/sources/rsync.macports.org/release/tarballs/ports/_resources/port1.0/variant_descriptions.conf
427:debug:main universal variant already exists, so not adding the default one
428:debug:main No need to upgrade! python27 2.7.3_1 >= python27 2.7.3_1
429:debug:main epoch: in tree: 0 installed: 0
430:debug:main sqlite3 3.7.14.1_0 exists in the ports tree
431:debug:main sqlite3 3.7.14.1_0  is the latest installed
432:debug:main sqlite3 3.7.14.1_0  is active
433:debug:main Merging existing variants '' into variants
434:debug:main new fully merged portvariants:
435:debug:main Changing to port directory: /opt/local/var/macports/sources/rsync.macports.org/release/tarballs/ports/databases/sqlite3
436:debug:main OS darwin/12.2.0 (Mac OS X 10.8) arch i386
437:debug:main org.macports.load registered provides 'load', a pre-existing procedure. Target override will not be provided
438:debug:main org.macports.unload registered provides 'unload', a pre-existing procedure. Target override will not be provided
439:debug:main org.macports.distfiles registered provides 'distfiles', a pre-existing procedure. Target override will not be provided
440:debug:main adding the default universal variant
441:debug:main Reading variant descriptions from /opt/local/var/macports/sources/rsync.macports.org/release/tarballs/ports/_resources/port1.0/variant_descriptions.conf
442:debug:main No need to upgrade! sqlite3 3.7.14.1_0 >= sqlite3 3.7.14.1_0
443:debug:main epoch: in tree: 20090923 installed: 20090923
444:debug:main libedit 20120601-3.0_0 exists in the ports tree
445:debug:main libedit 20120601-3.0_0  is the latest installed
446:debug:main libedit 20120601-3.0_0  is active
447:debug:main Merging existing variants '' into variants
448:debug:main new fully merged portvariants:
449:debug:main Changing to port directory: /opt/local/var/macports/sources/rsync.macports.org/release/tarballs/ports/devel/libedit
450:debug:main OS darwin/12.2.0 (Mac OS X 10.8) arch i386
451:debug:main org.macports.load registered provides 'load', a pre-existing procedure. Target override will not be provided
452:debug:main org.macports.unload registered provides 'unload', a pre-existing procedure. Target override will not be provided
453:debug:main org.macports.distfiles registered provides 'distfiles', a pre-existing procedure. Target override will not be provided
454:debug:main Using group file /opt/local/var/macports/sources/rsync.macports.org/release/tarballs/ports/_resources/port1.0/group/muniversal-1.0.tcl
455:debug:main Reading variant descriptions from /opt/local/var/macports/sources/rsync.macports.org/release/tarballs/ports/_resources/port1.0/variant_descriptions.conf
456:debug:main universal variant already exists, so not adding the default one
457:debug:main No need to upgrade! libedit 20120601-3.0_0 >= libedit 20120601-3.0_0
458:debug:main epoch: in tree: 0 installed: 0
459:debug:main db46 4.6.21_7 exists in the ports tree
460:debug:main db46 4.6.21_7  is the latest installed
461:debug:main db46 4.6.21_7  is active
462:debug:main Merging existing variants '' into variants
463:debug:main new fully merged portvariants:
464:debug:main Changing to port directory: /opt/local/var/macports/sources/rsync.macports.org/release/tarballs/ports/databases/db46
465:debug:main OS darwin/12.2.0 (Mac OS X 10.8) arch i386
466:debug:main org.macports.load registered provides 'load', a pre-existing procedure. Target override will not be provided
467:debug:main org.macports.unload registered provides 'unload', a pre-existing procedure. Target override will not be provided
468:debug:main org.macports.distfiles registered provides 'distfiles', a pre-existing procedure. Target override will not be provided
469:debug:main Using group file /opt/local/var/macports/sources/rsync.macports.org/release/tarballs/ports/_resources/port1.0/group/muniversal-1.0.tcl
470:debug:main Reading variant descriptions from /opt/local/var/macports/sources/rsync.macports.org/release/tarballs/ports/_resources/port1.0/variant_descriptions.conf
471:debug:main universal variant already exists, so not adding the default one
472:debug:main No need to upgrade! db46 4.6.21_7 >= db46 4.6.21_7
473:debug:main epoch: in tree: 0 installed: 0
474:debug:main bzip2 1.0.6_0 exists in the ports tree
475:debug:main bzip2 1.0.6_0  is the latest installed
476:debug:main bzip2 1.0.6_0  is active
477:debug:main Merging existing variants '' into variants
478:debug:main new fully merged portvariants:
479:debug:main Changing to port directory: /opt/local/var/macports/sources/rsync.macports.org/release/tarballs/ports/archivers/bzip2
480:debug:main OS darwin/12.2.0 (Mac OS X 10.8) arch i386
481:debug:main org.macports.load registered provides 'load', a pre-existing procedure. Target override will not be provided
482:debug:main org.macports.unload registered provides 'unload', a pre-existing procedure. Target override will not be provided
483:debug:main org.macports.distfiles registered provides 'distfiles', a pre-existing procedure. Target override will not be provided
484:debug:main Reading variant descriptions from /opt/local/var/macports/sources/rsync.macports.org/release/tarballs/ports/_resources/port1.0/variant_descriptions.conf
485:debug:main universal variant already exists, so not adding the default one
486:debug:main No need to upgrade! bzip2 1.0.6_0 >= bzip2 1.0.6_0
487:debug:main epoch: in tree: 0 installed: 0
488:debug:main python_select 0.3_1 exists in the ports tree
489:debug:main python_select 0.3_1  is the latest installed
490:debug:main python_select 0.3_1  is active
491:debug:main Merging existing variants '' into variants
492:debug:main new fully merged portvariants:
493:debug:main Changing to port directory: /opt/local/var/macports/sources/rsync.macports.org/release/tarballs/ports/sysutils/python_select
494:debug:main OS darwin/12.2.0 (Mac OS X 10.8) arch i386
495:debug:main org.macports.load registered provides 'load', a pre-existing procedure. Target override will not be provided
496:debug:main org.macports.unload registered provides 'unload', a pre-existing procedure. Target override will not be provided
497:debug:main org.macports.distfiles registered provides 'distfiles', a pre-existing procedure. Target override will not be provided
498:debug:main Using group file /opt/local/var/macports/sources/rsync.macports.org/release/tarballs/ports/_resources/port1.0/group/select-1.0.tcl
499:debug:main universal_variant is false, so not adding the default universal variant
500:debug:main No need to upgrade! python_select 0.3_1 >= python_select 0.3_1
501:debug:main epoch: in tree: 0 installed: 0
502:debug:main xorg-libpthread-stubs 0.3_0 exists in the ports tree
503:debug:main xorg-libpthread-stubs 0.3_0  is the latest installed
504:debug:main xorg-libpthread-stubs 0.3_0  is active
505:debug:main Merging existing variants '' into variants
506:debug:main new fully merged portvariants:
507:debug:main Changing to port directory: /opt/local/var/macports/sources/rsync.macports.org/release/tarballs/ports/x11/xorg-libpthread-stubs
508:debug:main OS darwin/12.2.0 (Mac OS X 10.8) arch i386
509:debug:main org.macports.load registered provides 'load', a pre-existing procedure. Target override will not be provided
510:debug:main org.macports.unload registered provides 'unload', a pre-existing procedure. Target override will not be provided
511:debug:main org.macports.distfiles registered provides 'distfiles', a pre-existing procedure. Target override will not be provided
512:debug:main only one arch supported, so not adding the default universal variant
513:debug:main No need to upgrade! xorg-libpthread-stubs 0.3_0 >= xorg-libpthread-stubs 0.3_0
514:debug:main epoch: in tree: 0 installed: 0
515:debug:main xorg-kbproto 1.0.6_0 exists in the ports tree
516:debug:main xorg-kbproto 1.0.6_0  is the latest installed
517:debug:main xorg-kbproto 1.0.6_0  is active
518:debug:main Merging existing variants '' into variants
519:debug:main new fully merged portvariants:
520:debug:main Changing to port directory: /opt/local/var/macports/sources/rsync.macports.org/release/tarballs/ports/x11/xorg-kbproto
521:debug:main OS darwin/12.2.0 (Mac OS X 10.8) arch i386
522:debug:main org.macports.load registered provides 'load', a pre-existing procedure. Target override will not be provided
523:debug:main org.macports.unload registered provides 'unload', a pre-existing procedure. Target override will not be provided
524:debug:main org.macports.distfiles registered provides 'distfiles', a pre-existing procedure. Target override will not be provided
525:debug:main only one arch supported, so not adding the default universal variant
526:debug:main No need to upgrade! xorg-kbproto 1.0.6_0 >= xorg-kbproto 1.0.6_0
527:debug:main epoch: in tree: 0 installed: 0
528:debug:main xorg-fixesproto 5.0_0 exists in the ports tree
529:debug:main xorg-fixesproto 5.0_0  is the latest installed
530:debug:main xorg-fixesproto 5.0_0  is active
531:debug:main Merging existing variants '' into variants
532:debug:main new fully merged portvariants:
533:debug:main Changing to port directory: /opt/local/var/macports/sources/rsync.macports.org/release/tarballs/ports/x11/xorg-fixesproto
534:debug:main OS darwin/12.2.0 (Mac OS X 10.8) arch i386
535:debug:main org.macports.load registered provides 'load', a pre-existing procedure. Target override will not be provided
536:debug:main org.macports.unload registered provides 'unload', a pre-existing procedure. Target override will not be provided
537:debug:main org.macports.distfiles registered provides 'distfiles', a pre-existing procedure. Target override will not be provided
538:debug:main only one arch supported, so not adding the default universal variant
539:debug:main No need to upgrade! xorg-fixesproto 5.0_0 >= xorg-fixesproto 5.0_0
540:debug:main epoch: in tree: 0 installed: 0
541:debug:main xorg-libXi 1.6.1_0 exists in the ports tree
542:debug:main xorg-libXi 1.6.1_0  is the latest installed
543:debug:main xorg-libXi 1.6.1_0  is active
544:debug:main Merging existing variants '' into variants
545:debug:main new fully merged portvariants:
546:debug:main Changing to port directory: /opt/local/var/macports/sources/rsync.macports.org/release/tarballs/ports/x11/xorg-libXi
547:debug:main OS darwin/12.2.0 (Mac OS X 10.8) arch i386
548:debug:main org.macports.load registered provides 'load', a pre-existing procedure. Target override will not be provided
549:debug:main org.macports.unload registered provides 'unload', a pre-existing procedure. Target override will not be provided
550:debug:main org.macports.distfiles registered provides 'distfiles', a pre-existing procedure. Target override will not be provided
551:debug:main adding the default universal variant
552:debug:main Reading variant descriptions from /opt/local/var/macports/sources/rsync.macports.org/release/tarballs/ports/_resources/port1.0/variant_descriptions.conf
553:debug:main No need to upgrade! xorg-libXi 1.6.1_0 >= xorg-libXi 1.6.1_0
554:debug:main epoch: in tree: 0 installed: 0
555:debug:main xorg-libXext 1.3.1_0 exists in the ports tree
556:debug:main xorg-libXext 1.3.1_0  is the latest installed
557:debug:main xorg-libXext 1.3.1_0  is active
558:debug:main Merging existing variants '' into variants
559:debug:main new fully merged portvariants:
560:debug:main Changing to port directory: /opt/local/var/macports/sources/rsync.macports.org/release/tarballs/ports/x11/xorg-libXext
561:debug:main OS darwin/12.2.0 (Mac OS X 10.8) arch i386
562:debug:main org.macports.load registered provides 'load', a pre-existing procedure. Target override will not be provided
563:debug:main org.macports.unload registered provides 'unload', a pre-existing procedure. Target override will not be provided
564:debug:main org.macports.distfiles registered provides 'distfiles', a pre-existing procedure. Target override will not be provided
565:debug:main adding the default universal variant
566:debug:main Reading variant descriptions from /opt/local/var/macports/sources/rsync.macports.org/release/tarballs/ports/_resources/port1.0/variant_descriptions.conf
567:debug:main No need to upgrade! xorg-libXext 1.3.1_0 >= xorg-libXext 1.3.1_0
568:debug:main epoch: in tree: 0 installed: 0
569:debug:main xorg-xextproto 7.2.1_0 exists in the ports tree
570:debug:main xorg-xextproto 7.2.1_0  is the latest installed
571:debug:main xorg-xextproto 7.2.1_0  is active
572:debug:main Merging existing variants '' into variants
573:debug:main new fully merged portvariants:
574:debug:main Changing to port directory: /opt/local/var/macports/sources/rsync.macports.org/release/tarballs/ports/x11/xorg-xextproto
575:debug:main OS darwin/12.2.0 (Mac OS X 10.8) arch i386
576:debug:main org.macports.load registered provides 'load', a pre-existing procedure. Target override will not be provided
577:debug:main org.macports.unload registered provides 'unload', a pre-existing procedure. Target override will not be provided
578:debug:main org.macports.distfiles registered provides 'distfiles', a pre-existing procedure. Target override will not be provided
579:debug:main only one arch supported, so not adding the default universal variant
580:debug:main No need to upgrade! xorg-xextproto 7.2.1_0 >= xorg-xextproto 7.2.1_0
581:debug:main epoch: in tree: 0 installed: 0
582:debug:main xorg-inputproto 2.2_0 exists in the ports tree
583:debug:main xorg-inputproto 2.2_0  is the latest installed
584:debug:main xorg-inputproto 2.2_0  is active
585:debug:main Merging existing variants '' into variants
586:debug:main new fully merged portvariants:
587:debug:main Changing to port directory: /opt/local/var/macports/sources/rsync.macports.org/release/tarballs/ports/x11/xorg-inputproto
588:debug:main OS darwin/12.2.0 (Mac OS X 10.8) arch i386
589:debug:main org.macports.load registered provides 'load', a pre-existing procedure. Target override will not be provided
590:debug:main org.macports.unload registered provides 'unload', a pre-existing procedure. Target override will not be provided
591:debug:main org.macports.distfiles registered provides 'distfiles', a pre-existing procedure. Target override will not be provided
592:debug:main only one arch supported, so not adding the default universal variant
593:debug:main No need to upgrade! xorg-inputproto 2.2_0 >= xorg-inputproto 2.2_0
594:debug:main epoch: in tree: 0 installed: 0
595:debug:main xorg-libXmu 1.1.1_0 exists in the ports tree
596:debug:main xorg-libXmu 1.1.1_0  is the latest installed
597:debug:main xorg-libXmu 1.1.1_0  is active
598:debug:main Merging existing variants '' into variants
599:debug:main new fully merged portvariants:
600:debug:main Changing to port directory: /opt/local/var/macports/sources/rsync.macports.org/release/tarballs/ports/x11/xorg-libXmu
601:debug:main OS darwin/12.2.0 (Mac OS X 10.8) arch i386
602:debug:main org.macports.load registered provides 'load', a pre-existing procedure. Target override will not be provided
603:debug:main org.macports.unload registered provides 'unload', a pre-existing procedure. Target override will not be provided
604:debug:main org.macports.distfiles registered provides 'distfiles', a pre-existing procedure. Target override will not be provided
605:debug:main adding the default universal variant
606:debug:main Reading variant descriptions from /opt/local/var/macports/sources/rsync.macports.org/release/tarballs/ports/_resources/port1.0/variant_descriptions.conf
607:debug:main No need to upgrade! xorg-libXmu 1.1.1_0 >= xorg-libXmu 1.1.1_0
608:debug:main epoch: in tree: 0 installed: 0
609:debug:main xorg-libXt 1.1.3_0 exists in the ports tree
610:debug:main xorg-libXt 1.1.3_0  is the latest installed
611:debug:main xorg-libXt 1.1.3_0  is active
612:debug:main Merging existing variants '' into variants
613:debug:main new fully merged portvariants:
614:debug:main Changing to port directory: /opt/local/var/macports/sources/rsync.macports.org/release/tarballs/ports/x11/xorg-libXt
615:debug:main OS darwin/12.2.0 (Mac OS X 10.8) arch i386
616:debug:main org.macports.load registered provides 'load', a pre-existing procedure. Target override will not be provided
617:debug:main org.macports.unload registered provides 'unload', a pre-existing procedure. Target override will not be provided
618:debug:main org.macports.distfiles registered provides 'distfiles', a pre-existing procedure. Target override will not be provided
619:debug:main adding the default universal variant
620:debug:main Reading variant descriptions from /opt/local/var/macports/sources/rsync.macports.org/release/tarballs/ports/_resources/port1.0/variant_descriptions.conf
621:debug:main No need to upgrade! xorg-libXt 1.1.3_0 >= xorg-libXt 1.1.3_0
622:debug:main epoch: in tree: 0 installed: 0
623:debug:main xorg-libsm 1.2.1_0 exists in the ports tree
624:debug:main xorg-libsm 1.2.1_0  is the latest installed
625:debug:main xorg-libsm 1.2.1_0  is active
626:debug:main Merging existing variants '' into variants
627:debug:main new fully merged portvariants:
628:debug:main Changing to port directory: /opt/local/var/macports/sources/rsync.macports.org/release/tarballs/ports/x11/xorg-libsm
629:debug:main OS darwin/12.2.0 (Mac OS X 10.8) arch i386
630:debug:main org.macports.load registered provides 'load', a pre-existing procedure. Target override will not be provided
631:debug:main org.macports.unload registered provides 'unload', a pre-existing procedure. Target override will not be provided
632:debug:main org.macports.distfiles registered provides 'distfiles', a pre-existing procedure. Target override will not be provided
633:debug:main adding the default universal variant
634:debug:main Reading variant descriptions from /opt/local/var/macports/sources/rsync.macports.org/release/tarballs/ports/_resources/port1.0/variant_descriptions.conf
635:debug:main No need to upgrade! xorg-libsm 1.2.1_0 >= xorg-libsm 1.2.1_0
636:debug:main epoch: in tree: 0 installed: 0
637:debug:main xorg-libice 1.0.8_0 exists in the ports tree
638:debug:main xorg-libice 1.0.8_0  is the latest installed
639:debug:main xorg-libice 1.0.8_0  is active
640:debug:main Merging existing variants '' into variants
641:debug:main new fully merged portvariants:
642:debug:main Changing to port directory: /opt/local/var/macports/sources/rsync.macports.org/release/tarballs/ports/x11/xorg-libice
643:debug:main OS darwin/12.2.0 (Mac OS X 10.8) arch i386
644:debug:main org.macports.load registered provides 'load', a pre-existing procedure. Target override will not be provided
645:debug:main org.macports.unload registered provides 'unload', a pre-existing procedure. Target override will not be provided
646:debug:main org.macports.distfiles registered provides 'distfiles', a pre-existing procedure. Target override will not be provided
647:debug:main adding the default universal variant
648:debug:main Reading variant descriptions from /opt/local/var/macports/sources/rsync.macports.org/release/tarballs/ports/_resources/port1.0/variant_descriptions.conf
649:debug:main No need to upgrade! xorg-libice 1.0.8_0 >= xorg-libice 1.0.8_0
650:debug:main epoch: in tree: 0 installed: 0
651:debug:main jpeg 8d_0 exists in the ports tree
652:debug:main jpeg 8d_0  is the latest installed
653:debug:main jpeg 8d_0  is active
654:debug:main Merging existing variants '' into variants
655:debug:main new fully merged portvariants:
656:debug:main Changing to port directory: /opt/local/var/macports/sources/rsync.macports.org/release/tarballs/ports/graphics/jpeg
657:debug:main OS darwin/12.2.0 (Mac OS X 10.8) arch i386
658:debug:main org.macports.load registered provides 'load', a pre-existing procedure. Target override will not be provided
659:debug:main org.macports.unload registered provides 'unload', a pre-existing procedure. Target override will not be provided
660:debug:main org.macports.distfiles registered provides 'distfiles', a pre-existing procedure. Target override will not be provided
661:debug:main adding the default universal variant
662:debug:main Reading variant descriptions from /opt/local/var/macports/sources/rsync.macports.org/release/tarballs/ports/_resources/port1.0/variant_descriptions.conf
663:debug:main No need to upgrade! jpeg 8d_0 >= jpeg 8d_0
664:debug:main epoch: in tree: 0 installed: 0
665:debug:main libpng 1.5.13_0 exists in the ports tree
666:debug:main libpng 1.5.13_0  is the latest installed
667:debug:main libpng 1.5.13_0  is active
668:debug:main Merging existing variants '' into variants
669:debug:main new fully merged portvariants:
670:debug:main Changing to port directory: /opt/local/var/macports/sources/rsync.macports.org/release/tarballs/ports/graphics/libpng
671:debug:main OS darwin/12.2.0 (Mac OS X 10.8) arch i386
672:debug:main org.macports.load registered provides 'load', a pre-existing procedure. Target override will not be provided
673:debug:main org.macports.unload registered provides 'unload', a pre-existing procedure. Target override will not be provided
674:debug:main org.macports.distfiles registered provides 'distfiles', a pre-existing procedure. Target override will not be provided
675:debug:main adding the default universal variant
676:debug:main Reading variant descriptions from /opt/local/var/macports/sources/rsync.macports.org/release/tarballs/ports/_resources/port1.0/variant_descriptions.conf
677:debug:main No need to upgrade! libpng 1.5.13_0 >= libpng 1.5.13_0
678:debug:main epoch: in tree: 0 installed: 0
679:debug:main perl5 5.12.4_0 exists in the ports tree
680:debug:main perl5 5.12.4_0 +perl5_12 is the latest installed
681:debug:main perl5 5.12.4_0 +perl5_12 is active
682:debug:main Merging existing variants '+perl5_12' into variants
683:debug:main new fully merged portvariants: perl5_12 +
684:debug:main Changing to port directory: /opt/local/var/macports/sources/rsync.macports.org/release/tarballs/ports/lang/perl5
685:debug:main OS darwin/12.2.0 (Mac OS X 10.8) arch i386
686:debug:main org.macports.load registered provides 'load', a pre-existing procedure. Target override will not be provided
687:debug:main org.macports.unload registered provides 'unload', a pre-existing procedure. Target override will not be provided
688:debug:main org.macports.distfiles registered provides 'distfiles', a pre-existing procedure. Target override will not be provided
689:debug:main universal_variant is false, so not adding the default universal variant
690:debug:main Executing variant perl5_12 provides perl5_12
691:debug:main No need to upgrade! perl5 5.12.4_0 >= perl5 5.12.4_0
692:debug:main epoch: in tree: 0 installed: 0
693:debug:main perl5.12 5.12.4_1 exists in the ports tree
694:debug:main perl5.12 5.12.4_1  is the latest installed
695:debug:main perl5.12 5.12.4_1  is active
696:debug:main Merging existing variants '' into variants
697:debug:main new fully merged portvariants:
698:debug:main Changing to port directory: /opt/local/var/macports/sources/rsync.macports.org/release/tarballs/ports/lang/perl5.12
699:debug:main OS darwin/12.2.0 (Mac OS X 10.8) arch i386
700:debug:main org.macports.load registered provides 'load', a pre-existing procedure. Target override will not be provided
701:debug:main org.macports.unload registered provides 'unload', a pre-existing procedure. Target override will not be provided
702:debug:main org.macports.distfiles registered provides 'distfiles', a pre-existing procedure. Target override will not be provided
703:debug:main adding the default universal variant
704:debug:main Reading variant descriptions from /opt/local/var/macports/sources/rsync.macports.org/release/tarballs/ports/_resources/port1.0/variant_descriptions.conf
705:debug:main No need to upgrade! perl5.12 5.12.4_1 >= perl5.12 5.12.4_1
706:debug:main epoch: in tree: 0 installed: 0
707:debug:main gdbm 1.10_2 exists in the ports tree
708:debug:main gdbm 1.10_2  is the latest installed
709:debug:main gdbm 1.10_2  is active
710:debug:main Merging existing variants '' into variants
711:debug:main new fully merged portvariants:
712:debug:main Changing to port directory: /opt/local/var/macports/sources/rsync.macports.org/release/tarballs/ports/databases/gdbm
713:debug:main OS darwin/12.2.0 (Mac OS X 10.8) arch i386
714:debug:main org.macports.load registered provides 'load', a pre-existing procedure. Target override will not be provided
715:debug:main org.macports.unload registered provides 'unload', a pre-existing procedure. Target override will not be provided
716:debug:main org.macports.distfiles registered provides 'distfiles', a pre-existing procedure. Target override will not be provided
717:debug:main adding the default universal variant
718:debug:main Reading variant descriptions from /opt/local/var/macports/sources/rsync.macports.org/release/tarballs/ports/_resources/port1.0/variant_descriptions.conf
719:debug:main No need to upgrade! gdbm 1.10_2 >= gdbm 1.10_2
720:debug:main epoch: in tree: 0 installed: 0
721:debug:main Xft2 2.3.1_0 exists in the ports tree
722:debug:main Xft2 2.3.1_0  is the latest installed
723:debug:main Xft2 2.3.1_0  is active
724:debug:main Merging existing variants '' into variants
725:debug:main new fully merged portvariants:
726:debug:main Changing to port directory: /opt/local/var/macports/sources/rsync.macports.org/release/tarballs/ports/x11/Xft2
727:debug:main OS darwin/12.2.0 (Mac OS X 10.8) arch i386
728:debug:main org.macports.load registered provides 'load', a pre-existing procedure. Target override will not be provided
729:debug:main org.macports.unload registered provides 'unload', a pre-existing procedure. Target override will not be provided
730:debug:main org.macports.distfiles registered provides 'distfiles', a pre-existing procedure. Target override will not be provided
731:debug:main adding the default universal variant
732:debug:main Reading variant descriptions from /opt/local/var/macports/sources/rsync.macports.org/release/tarballs/ports/_resources/port1.0/variant_descriptions.conf
733:debug:main No need to upgrade! Xft2 2.3.1_0 >= Xft2 2.3.1_0
734:debug:main epoch: in tree: 0 installed: 0
735:debug:main xrender 0.9.7_0 exists in the ports tree
736:debug:main xrender 0.9.7_0  is the latest installed
737:debug:main xrender 0.9.7_0  is active
738:debug:main Merging existing variants '' into variants
739:debug:main new fully merged portvariants:
740:debug:main Changing to port directory: /opt/local/var/macports/sources/rsync.macports.org/release/tarballs/ports/x11/xrender
741:debug:main OS darwin/12.2.0 (Mac OS X 10.8) arch i386
742:debug:main org.macports.load registered provides 'load', a pre-existing procedure. Target override will not be provided
743:debug:main org.macports.unload registered provides 'unload', a pre-existing procedure. Target override will not be provided
744:debug:main org.macports.distfiles registered provides 'distfiles', a pre-existing procedure. Target override will not be provided
745:debug:main adding the default universal variant
746:debug:main Reading variant descriptions from /opt/local/var/macports/sources/rsync.macports.org/release/tarballs/ports/_resources/port1.0/variant_descriptions.conf
747:debug:main No need to upgrade! xrender 0.9.7_0 >= xrender 0.9.7_0
748:debug:main epoch: in tree: 0 installed: 0
749:debug:main xorg-renderproto 0.11.1_0 exists in the ports tree
750:debug:main xorg-renderproto 0.11.1_0  is the latest installed
751:debug:main xorg-renderproto 0.11.1_0  is active
752:debug:main Merging existing variants '' into variants
753:debug:main new fully merged portvariants:
754:debug:main Changing to port directory: /opt/local/var/macports/sources/rsync.macports.org/release/tarballs/ports/x11/xorg-renderproto
755:debug:main OS darwin/12.2.0 (Mac OS X 10.8) arch i386
756:debug:main org.macports.load registered provides 'load', a pre-existing procedure. Target override will not be provided
757:debug:main org.macports.unload registered provides 'unload', a pre-existing procedure. Target override will not be provided
758:debug:main org.macports.distfiles registered provides 'distfiles', a pre-existing procedure. Target override will not be provided
759:debug:main only one arch supported, so not adding the default universal variant
760:debug:main No need to upgrade! xorg-renderproto 0.11.1_0 >= xorg-renderproto 0.11.1_0
761:debug:main epoch: in tree: 0 installed: 0
762:debug:main freetype 2.4.10_0 exists in the ports tree
763:debug:main freetype 2.4.10_0  is the latest installed
764:debug:main freetype 2.4.10_0  is active
765:debug:main Merging existing variants '' into variants
766:debug:main new fully merged portvariants:
767:debug:main Changing to port directory: /opt/local/var/macports/sources/rsync.macports.org/release/tarballs/ports/print/freetype
768:debug:main OS darwin/12.2.0 (Mac OS X 10.8) arch i386
769:debug:main org.macports.load registered provides 'load', a pre-existing procedure. Target override will not be provided
770:debug:main org.macports.unload registered provides 'unload', a pre-existing procedure. Target override will not be provided
771:debug:main org.macports.distfiles registered provides 'distfiles', a pre-existing procedure. Target override will not be provided
772:debug:main Using group file /opt/local/var/macports/sources/rsync.macports.org/release/tarballs/ports/_resources/port1.0/group/muniversal-1.0.tcl
773:debug:main Reading variant descriptions from /opt/local/var/macports/sources/rsync.macports.org/release/tarballs/ports/_resources/port1.0/variant_descriptions.conf
774:debug:main Using group file /opt/local/var/macports/sources/rsync.macports.org/release/tarballs/ports/_resources/port1.0/group/archcheck-1.0.tcl
775:debug:main universal variant already exists, so not adding the default one
776:debug:main No need to upgrade! freetype 2.4.10_0 >= freetype 2.4.10_0
777:debug:main epoch: in tree: 0 installed: 0
778:debug:main fontconfig 2.10.2_0 exists in the ports tree
779:debug:main fontconfig 2.10.2_0  is the latest installed
780:debug:main fontconfig 2.10.2_0  is active
781:debug:main Merging existing variants '' into variants
782:debug:main new fully merged portvariants:
783:debug:main Changing to port directory: /opt/local/var/macports/sources/rsync.macports.org/release/tarballs/ports/graphics/fontconfig
784:debug:main OS darwin/12.2.0 (Mac OS X 10.8) arch i386
785:debug:main org.macports.load registered provides 'load', a pre-existing procedure. Target override will not be provided
786:debug:main org.macports.unload registered provides 'unload', a pre-existing procedure. Target override will not be provided
787:debug:main org.macports.distfiles registered provides 'distfiles', a pre-existing procedure. Target override will not be provided
788:debug:main Using group file /opt/local/var/macports/sources/rsync.macports.org/release/tarballs/ports/_resources/port1.0/group/muniversal-1.0.tcl
789:debug:main Reading variant descriptions from /opt/local/var/macports/sources/rsync.macports.org/release/tarballs/ports/_resources/port1.0/variant_descriptions.conf
790:debug:main universal variant already exists, so not adding the default one
791:debug:main No need to upgrade! fontconfig 2.10.2_0 >= fontconfig 2.10.2_0
792:debug:main epoch: in tree: 0 installed: 0
793:debug:main xorg-libXcursor 1.1.13_0 exists in the ports tree
794:debug:main xorg-libXcursor 1.1.13_0  is the latest installed
795:debug:main xorg-libXcursor 1.1.13_0  is active
796:debug:main Merging existing variants '' into variants
797:debug:main new fully merged portvariants:
798:debug:main Changing to port directory: /opt/local/var/macports/sources/rsync.macports.org/release/tarballs/ports/x11/xorg-libXcursor
799:debug:main OS darwin/12.2.0 (Mac OS X 10.8) arch i386
800:debug:main org.macports.load registered provides 'load', a pre-existing procedure. Target override will not be provided
801:debug:main org.macports.unload registered provides 'unload', a pre-existing procedure. Target override will not be provided
802:debug:main org.macports.distfiles registered provides 'distfiles', a pre-existing procedure. Target override will not be provided
803:debug:main adding the default universal variant
804:debug:main Reading variant descriptions from /opt/local/var/macports/sources/rsync.macports.org/release/tarballs/ports/_resources/port1.0/variant_descriptions.conf
805:debug:main No need to upgrade! xorg-libXcursor 1.1.13_0 >= xorg-libXcursor 1.1.13_0
806:debug:main epoch: in tree: 0 installed: 0
807:debug:main xorg-libXinerama 1.1.2_0 exists in the ports tree
808:debug:main xorg-libXinerama 1.1.2_0  is the latest installed
809:debug:main xorg-libXinerama 1.1.2_0  is active
810:debug:main Merging existing variants '' into variants
811:debug:main new fully merged portvariants:
812:debug:main Changing to port directory: /opt/local/var/macports/sources/rsync.macports.org/release/tarballs/ports/x11/xorg-libXinerama
813:debug:main OS darwin/12.2.0 (Mac OS X 10.8) arch i386
814:debug:main org.macports.load registered provides 'load', a pre-existing procedure. Target override will not be provided
815:debug:main org.macports.unload registered provides 'unload', a pre-existing procedure. Target override will not be provided
816:debug:main org.macports.distfiles registered provides 'distfiles', a pre-existing procedure. Target override will not be provided
817:debug:main adding the default universal variant
818:debug:main Reading variant descriptions from /opt/local/var/macports/sources/rsync.macports.org/release/tarballs/ports/_resources/port1.0/variant_descriptions.conf
819:debug:main No need to upgrade! xorg-libXinerama 1.1.2_0 >= xorg-libXinerama 1.1.2_0
820:debug:main epoch: in tree: 0 installed: 0
821:debug:main xorg-xineramaproto 1.2.1_0 exists in the ports tree
822:debug:main xorg-xineramaproto 1.2.1_0  is the latest installed
823:debug:main xorg-xineramaproto 1.2.1_0  is active
824:debug:main Merging existing variants '' into variants
825:debug:main new fully merged portvariants:
826:debug:main Changing to port directory: /opt/local/var/macports/sources/rsync.macports.org/release/tarballs/ports/x11/xorg-xineramaproto
827:debug:main OS darwin/12.2.0 (Mac OS X 10.8) arch i386
828:debug:main org.macports.load registered provides 'load', a pre-existing procedure. Target override will not be provided
829:debug:main org.macports.unload registered provides 'unload', a pre-existing procedure. Target override will not be provided
830:debug:main org.macports.distfiles registered provides 'distfiles', a pre-existing procedure. Target override will not be provided
831:debug:main only one arch supported, so not adding the default universal variant
832:debug:main No need to upgrade! xorg-xineramaproto 1.2.1_0 >= xorg-xineramaproto 1.2.1_0
833:debug:main epoch: in tree: 0 installed: 0
834:debug:main xorg-libXrandr 1.3.2_0 exists in the ports tree
835:debug:main xorg-libXrandr 1.3.2_0  is the latest installed
836:debug:main xorg-libXrandr 1.3.2_0  is active
837:debug:main Merging existing variants '' into variants
838:debug:main new fully merged portvariants:
839:debug:main Changing to port directory: /opt/local/var/macports/sources/rsync.macports.org/release/tarballs/ports/x11/xorg-libXrandr
840:debug:main OS darwin/12.2.0 (Mac OS X 10.8) arch i386
841:debug:main org.macports.load registered provides 'load', a pre-existing procedure. Target override will not be provided
842:debug:main org.macports.unload registered provides 'unload', a pre-existing procedure. Target override will not be provided
843:debug:main org.macports.distfiles registered provides 'distfiles', a pre-existing procedure. Target override will not be provided
844:debug:main adding the default universal variant
845:debug:main Reading variant descriptions from /opt/local/var/macports/sources/rsync.macports.org/release/tarballs/ports/_resources/port1.0/variant_descriptions.conf
846:debug:main No need to upgrade! xorg-libXrandr 1.3.2_0 >= xorg-libXrandr 1.3.2_0
847:debug:main epoch: in tree: 0 installed: 0
848:debug:main xorg-randrproto 1.4.0_0 exists in the ports tree
849:debug:main xorg-randrproto 1.4.0_0  is the latest installed
850:debug:main xorg-randrproto 1.4.0_0  is active
851:debug:main Merging existing variants '' into variants
852:debug:main new fully merged portvariants:
853:debug:main Changing to port directory: /opt/local/var/macports/sources/rsync.macports.org/release/tarballs/ports/x11/xorg-randrproto
854:debug:main OS darwin/12.2.0 (Mac OS X 10.8) arch i386
855:debug:main org.macports.load registered provides 'load', a pre-existing procedure. Target override will not be provided
856:debug:main org.macports.unload registered provides 'unload', a pre-existing procedure. Target override will not be provided
857:debug:main org.macports.distfiles registered provides 'distfiles', a pre-existing procedure. Target override will not be provided
858:debug:main only one arch supported, so not adding the default universal variant
859:debug:main No need to upgrade! xorg-randrproto 1.4.0_0 >= xorg-randrproto 1.4.0_0
860:debug:main epoch: in tree: 0 installed: 0
861:debug:main ktoblzcheck 1.40_0 exists in the ports tree
862:debug:main ktoblzcheck 1.40_0  is the latest installed
863:debug:main ktoblzcheck 1.40_0  is active
864:debug:main Merging existing variants '' into variants
865:debug:main new fully merged portvariants:
866:debug:main Changing to port directory: /opt/local/var/macports/sources/rsync.macports.org/release/tarballs/ports/devel/ktoblzcheck
867:debug:main OS darwin/12.2.0 (Mac OS X 10.8) arch i386
868:debug:main org.macports.load registered provides 'load', a pre-existing procedure. Target override will not be provided
869:debug:main org.macports.unload registered provides 'unload', a pre-existing procedure. Target override will not be provided
870:debug:main org.macports.distfiles registered provides 'distfiles', a pre-existing procedure. Target override will not be provided
871:debug:main adding the default universal variant
872:debug:main Reading variant descriptions from /opt/local/var/macports/sources/rsync.macports.org/release/tarballs/ports/_resources/port1.0/variant_descriptions.conf
873:debug:main No need to upgrade! ktoblzcheck 1.40_0 >= ktoblzcheck 1.40_0
874:debug:main epoch: in tree: 0 installed: 0
875:debug:main libglade2 2.6.4_6 exists in the ports tree
876:debug:main libglade2 2.6.4_6  is the latest installed
877:debug:main libglade2 2.6.4_6  is active
878:debug:main Merging existing variants '' into variants
879:debug:main new fully merged portvariants:
880:debug:main Changing to port directory: /opt/local/var/macports/sources/rsync.macports.org/release/tarballs/ports/gnome/libglade2
881:debug:main OS darwin/12.2.0 (Mac OS X 10.8) arch i386
882:debug:main org.macports.load registered provides 'load', a pre-existing procedure. Target override will not be provided
883:debug:main org.macports.unload registered provides 'unload', a pre-existing procedure. Target override will not be provided
884:debug:main org.macports.distfiles registered provides 'distfiles', a pre-existing procedure. Target override will not be provided
885:debug:main Reading variant descriptions from /opt/local/var/macports/sources/rsync.macports.org/release/tarballs/ports/_resources/port1.0/variant_descriptions.conf
886:debug:main adding the default universal variant
887:debug:main No need to upgrade! libglade2 2.6.4_6 >= libglade2 2.6.4_6
888:debug:main epoch: in tree: 0 installed: 0
889:debug:main libffi 3.0.11_1 exists in the ports tree
890:debug:main libffi 3.0.11_1  is the latest installed
891:debug:main libffi 3.0.11_1  is active
892:debug:main Merging existing variants '' into variants
893:debug:main new fully merged portvariants:
894:debug:main Changing to port directory: /opt/local/var/macports/sources/rsync.macports.org/release/tarballs/ports/devel/libffi
895:debug:main OS darwin/12.2.0 (Mac OS X 10.8) arch i386
896:debug:main org.macports.load registered provides 'load', a pre-existing procedure. Target override will not be provided
897:debug:main org.macports.unload registered provides 'unload', a pre-existing procedure. Target override will not be provided
898:debug:main org.macports.distfiles registered provides 'distfiles', a pre-existing procedure. Target override will not be provided
899:debug:main Using group file /opt/local/var/macports/sources/rsync.macports.org/release/tarballs/ports/_resources/port1.0/group/muniversal-1.0.tcl
900:debug:main Reading variant descriptions from /opt/local/var/macports/sources/rsync.macports.org/release/tarballs/ports/_resources/port1.0/variant_descriptions.conf
901:debug:main universal variant already exists, so not adding the default one
902:debug:main No need to upgrade! libffi 3.0.11_1 >= libffi 3.0.11_1
903:debug:main epoch: in tree: 0 installed: 0
904:debug:main gtk2 2.24.13_0 exists in the ports tree
905:debug:main gtk2 2.24.13_0 +x11 is the latest installed
906:debug:main gtk2 2.24.13_0 +x11 is active
907:debug:main Merging existing variants '+x11' into variants
908:debug:main new fully merged portvariants: x11 +
909:debug:main Changing to port directory: /opt/local/var/macports/sources/rsync.macports.org/release/tarballs/ports/gnome/gtk2
910:debug:main OS darwin/12.2.0 (Mac OS X 10.8) arch i386
911:debug:main org.macports.load registered provides 'load', a pre-existing procedure. Target override will not be provided
912:debug:main org.macports.unload registered provides 'unload', a pre-existing procedure. Target override will not be provided
913:debug:main org.macports.distfiles registered provides 'distfiles', a pre-existing procedure. Target override will not be provided
914:debug:main Using group file /opt/local/var/macports/sources/rsync.macports.org/release/tarballs/ports/_resources/port1.0/group/muniversal-1.0.tcl
915:debug:main Reading variant descriptions from /opt/local/var/macports/sources/rsync.macports.org/release/tarballs/ports/_resources/port1.0/variant_descriptions.conf
916:debug:main Using group file /opt/local/var/macports/sources/rsync.macports.org/release/tarballs/ports/_resources/port1.0/group/xcodeversion-1.0.tcl
917:debug:main universal variant already exists, so not adding the default one
918:debug:main Executing variant x11 provides x11
919:debug:main No need to upgrade! gtk2 2.24.13_0 >= gtk2 2.24.13_0
920:debug:main epoch: in tree: 2 installed: 2
921:debug:main atk 2.2.0_2 exists in the ports tree
922:debug:main atk 2.2.0_2  is the latest installed
923:debug:main atk 2.2.0_2  is active
924:debug:main Merging existing variants '' into variants
925:debug:main new fully merged portvariants:
926:debug:main Changing to port directory: /opt/local/var/macports/sources/rsync.macports.org/release/tarballs/ports/devel/atk
927:debug:main OS darwin/12.2.0 (Mac OS X 10.8) arch i386
928:debug:main org.macports.load registered provides 'load', a pre-existing procedure. Target override will not be provided
929:debug:main org.macports.unload registered provides 'unload', a pre-existing procedure. Target override will not be provided
930:debug:main org.macports.distfiles registered provides 'distfiles', a pre-existing procedure. Target override will not be provided
931:debug:main adding the default universal variant
932:debug:main Reading variant descriptions from /opt/local/var/macports/sources/rsync.macports.org/release/tarballs/ports/_resources/port1.0/variant_descriptions.conf
933:debug:main No need to upgrade! atk 2.2.0_2 >= atk 2.2.0_2
934:debug:main epoch: in tree: 0 installed: 0
935:debug:main glib2 2.34.3_0 exists in the ports tree
936:debug:main glib2 2.34.3_0  is the latest installed
937:debug:main glib2 2.34.3_0  is active
938:debug:main Merging existing variants '' into variants
939:debug:main new fully merged portvariants:
940:debug:main Changing to port directory: /opt/local/var/macports/sources/rsync.macports.org/release/tarballs/ports/devel/glib2
941:debug:main OS darwin/12.2.0 (Mac OS X 10.8) arch i386
942:debug:main org.macports.load registered provides 'load', a pre-existing procedure. Target override will not be provided
943:debug:main org.macports.unload registered provides 'unload', a pre-existing procedure. Target override will not be provided
944:debug:main org.macports.distfiles registered provides 'distfiles', a pre-existing procedure. Target override will not be provided
945:debug:main Using group file /opt/local/var/macports/sources/rsync.macports.org/release/tarballs/ports/_resources/port1.0/group/archcheck-1.0.tcl
946:debug:main Using group file /opt/local/var/macports/sources/rsync.macports.org/release/tarballs/ports/_resources/port1.0/group/conflicts_build-1.0.tcl
947:debug:main adding the default universal variant
948:debug:main Reading variant descriptions from /opt/local/var/macports/sources/rsync.macports.org/release/tarballs/ports/_resources/port1.0/variant_descriptions.conf
949:debug:main No need to upgrade! glib2 2.34.3_0 >= glib2 2.34.3_0
950:debug:main epoch: in tree: 0 installed: 0
951:debug:main gobject-introspection 1.34.1.1_0 exists in the ports tree
952:debug:main gobject-introspection 1.34.1.1_0  is the latest installed
953:debug:main gobject-introspection 1.34.1.1_0  is active
954:debug:main Merging existing variants '' into variants
955:debug:main new fully merged portvariants:
956:debug:main Changing to port directory: /opt/local/var/macports/sources/rsync.macports.org/release/tarballs/ports/gnome/gobject-introspection
957:debug:main OS darwin/12.2.0 (Mac OS X 10.8) arch i386
958:debug:main org.macports.load registered provides 'load', a pre-existing procedure. Target override will not be provided
959:debug:main org.macports.unload registered provides 'unload', a pre-existing procedure. Target override will not be provided
960:debug:main org.macports.distfiles registered provides 'distfiles', a pre-existing procedure. Target override will not be provided
961:debug:main adding the default universal variant
962:debug:main Reading variant descriptions from /opt/local/var/macports/sources/rsync.macports.org/release/tarballs/ports/_resources/port1.0/variant_descriptions.conf
963:debug:main No need to upgrade! gobject-introspection 1.34.1.1_0 >= gobject-introspection 1.34.1.1_0
964:debug:main epoch: in tree: 0 installed: 0
965:debug:main cairo 1.12.8_2 exists in the ports tree
966:debug:main cairo 1.12.8_2 +x11 is the latest installed
967:debug:main cairo 1.12.8_2 +x11 is active
968:debug:main Merging existing variants '+x11' into variants
969:debug:main new fully merged portvariants: x11 +
970:debug:main Changing to port directory: /opt/local/var/macports/sources/rsync.macports.org/release/tarballs/ports/graphics/cairo
971:debug:main OS darwin/12.2.0 (Mac OS X 10.8) arch i386
972:debug:main org.macports.load registered provides 'load', a pre-existing procedure. Target override will not be provided
973:debug:main org.macports.unload registered provides 'unload', a pre-existing procedure. Target override will not be provided
974:debug:main org.macports.distfiles registered provides 'distfiles', a pre-existing procedure. Target override will not be provided
975:debug:main Using group file /opt/local/var/macports/sources/rsync.macports.org/release/tarballs/ports/_resources/port1.0/group/muniversal-1.0.tcl
976:debug:main Reading variant descriptions from /opt/local/var/macports/sources/rsync.macports.org/release/tarballs/ports/_resources/port1.0/variant_descriptions.conf
977:debug:main Using group file /opt/local/var/macports/sources/rsync.macports.org/release/tarballs/ports/_resources/port1.0/group/xcodeversion-1.0.tcl
978:debug:main universal variant already exists, so not adding the default one
979:debug:main Executing variant x11 provides x11
980:debug:main No need to upgrade! cairo 1.12.8_2 >= cairo 1.12.8_2
981:debug:main epoch: in tree: 0 installed: 0
982:debug:main libpixman 0.28.0_0 exists in the ports tree
983:debug:main libpixman 0.28.0_0  is the latest installed
984:debug:main libpixman 0.28.0_0  is active
985:debug:main Merging existing variants '' into variants
986:debug:main new fully merged portvariants:
987:debug:main Changing to port directory: /opt/local/var/macports/sources/rsync.macports.org/release/tarballs/ports/graphics/libpixman
988:debug:main OS darwin/12.2.0 (Mac OS X 10.8) arch i386
989:debug:main org.macports.load registered provides 'load', a pre-existing procedure. Target override will not be provided
990:debug:main org.macports.unload registered provides 'unload', a pre-existing procedure. Target override will not be provided
991:debug:main org.macports.distfiles registered provides 'distfiles', a pre-existing procedure. Target override will not be provided
992:debug:main Using group file /opt/local/var/macports/sources/rsync.macports.org/release/tarballs/ports/_resources/port1.0/group/muniversal-1.0.tcl
993:debug:main Reading variant descriptions from /opt/local/var/macports/sources/rsync.macports.org/release/tarballs/ports/_resources/port1.0/variant_descriptions.conf
994:debug:main universal variant already exists, so not adding the default one
995:debug:main No need to upgrade! libpixman 0.28.0_0 >= libpixman 0.28.0_0
996:debug:main epoch: in tree: 0 installed: 0
997:debug:main xorg-xcb-util 0.3.9_0 exists in the ports tree
998:debug:main xorg-xcb-util 0.3.9_0  is the latest installed
999:debug:main xorg-xcb-util 0.3.9_0  is active
1000:debug:main Merging existing variants '' into variants
1001:debug:main new fully merged portvariants:
1002:debug:main Changing to port directory: /opt/local/var/macports/sources/rsync.macports.org/release/tarballs/ports/x11/xorg-xcb-util
1003:debug:main OS darwin/12.2.0 (Mac OS X 10.8) arch i386
1004:debug:main org.macports.load registered provides 'load', a pre-existing procedure. Target override will not be provided
1005:debug:main org.macports.unload registered provides 'unload', a pre-existing procedure. Target override will not be provided
1006:debug:main org.macports.distfiles registered provides 'distfiles', a pre-existing procedure. Target override will not be provided
1007:debug:main adding the default universal variant
1008:debug:main Reading variant descriptions from /opt/local/var/macports/sources/rsync.macports.org/release/tarballs/ports/_resources/port1.0/variant_descriptions.conf
1009:debug:main No need to upgrade! xorg-xcb-util 0.3.9_0 >= xorg-xcb-util 0.3.9_0
1010:debug:main epoch: in tree: 1 installed: 1
1011:debug:main pango 1.30.1_3 exists in the ports tree
1012:debug:main pango 1.30.1_3 +x11 is the latest installed
1013:debug:main pango 1.30.1_3 +x11 is active
1014:debug:main Merging existing variants '+x11' into variants
1015:debug:main new fully merged portvariants: x11 +
1016:debug:main Changing to port directory: /opt/local/var/macports/sources/rsync.macports.org/release/tarballs/ports/x11/pango
1017:debug:main OS darwin/12.2.0 (Mac OS X 10.8) arch i386
1018:debug:main org.macports.load registered provides 'load', a pre-existing procedure. Target override will not be provided
1019:debug:main org.macports.unload registered provides 'unload', a pre-existing procedure. Target override will not be provided
1020:debug:main org.macports.distfiles registered provides 'distfiles', a pre-existing procedure. Target override will not be provided
1021:debug:main Reading variant descriptions from /opt/local/var/macports/sources/rsync.macports.org/release/tarballs/ports/_resources/port1.0/variant_descriptions.conf
1022:debug:main adding the default universal variant
1023:debug:main Executing variant x11 provides x11
1024:debug:main No need to upgrade! pango 1.30.1_3 >= pango 1.30.1_3
1025:debug:main epoch: in tree: 2 installed: 2
1026:debug:main gdk-pixbuf2 2.26.5_0 exists in the ports tree
1027:debug:main gdk-pixbuf2 2.26.5_0  is the latest installed
1028:debug:main gdk-pixbuf2 2.26.5_0  is active
1029:debug:main Merging existing variants '' into variants
1030:debug:main new fully merged portvariants:
1031:debug:main Changing to port directory: /opt/local/var/macports/sources/rsync.macports.org/release/tarballs/ports/graphics/gdk-pixbuf2
1032:debug:main OS darwin/12.2.0 (Mac OS X 10.8) arch i386
1033:debug:main org.macports.load registered provides 'load', a pre-existing procedure. Target override will not be provided
1034:debug:main org.macports.unload registered provides 'unload', a pre-existing procedure. Target override will not be provided
1035:debug:main org.macports.distfiles registered provides 'distfiles', a pre-existing procedure. Target override will not be provided
1036:debug:main adding the default universal variant
1037:debug:main Reading variant descriptions from /opt/local/var/macports/sources/rsync.macports.org/release/tarballs/ports/_resources/port1.0/variant_descriptions.conf
1038:debug:main No need to upgrade! gdk-pixbuf2 2.26.5_0 >= gdk-pixbuf2 2.26.5_0
1039:debug:main epoch: in tree: 0 installed: 0
1040:debug:main jasper 1.900.1_9 exists in the ports tree
1041:debug:main jasper 1.900.1_9  is the latest installed
1042:debug:main jasper 1.900.1_9  is active
1043:debug:main Merging existing variants '' into variants
1044:debug:main new fully merged portvariants:
1045:debug:main Changing to port directory: /opt/local/var/macports/sources/rsync.macports.org/release/tarballs/ports/graphics/jasper
1046:debug:main OS darwin/12.2.0 (Mac OS X 10.8) arch i386
1047:debug:main org.macports.load registered provides 'load', a pre-existing procedure. Target override will not be provided
1048:debug:main org.macports.unload registered provides 'unload', a pre-existing procedure. Target override will not be provided
1049:debug:main org.macports.distfiles registered provides 'distfiles', a pre-existing procedure. Target override will not be provided
1050:debug:main adding the default universal variant
1051:debug:main Reading variant descriptions from /opt/local/var/macports/sources/rsync.macports.org/release/tarballs/ports/_resources/port1.0/variant_descriptions.conf
1052:debug:main No need to upgrade! jasper 1.900.1_9 >= jasper 1.900.1_9
1053:debug:main epoch: in tree: 0 installed: 0
1054:debug:main tiff 3.9.7_0 exists in the ports tree
1055:debug:main tiff 3.9.7_0  is the latest installed
1056:debug:main tiff 3.9.7_0  is active
1057:debug:main Merging existing variants '' into variants
1058:debug:main new fully merged portvariants:
1059:debug:main Changing to port directory: /opt/local/var/macports/sources/rsync.macports.org/release/tarballs/ports/graphics/tiff
1060:debug:main OS darwin/12.2.0 (Mac OS X 10.8) arch i386
1061:debug:main org.macports.load registered provides 'load', a pre-existing procedure. Target override will not be provided
1062:debug:main org.macports.unload registered provides 'unload', a pre-existing procedure. Target override will not be provided
1063:debug:main org.macports.distfiles registered provides 'distfiles', a pre-existing procedure. Target override will not be provided
1064:debug:main Using group file /opt/local/var/macports/sources/rsync.macports.org/release/tarballs/ports/_resources/port1.0/group/xcodeversion-1.0.tcl
1065:debug:main adding the default universal variant
1066:debug:main Reading variant descriptions from /opt/local/var/macports/sources/rsync.macports.org/release/tarballs/ports/_resources/port1.0/variant_descriptions.conf
1067:debug:main No need to upgrade! tiff 3.9.7_0 >= tiff 3.9.7_0
1068:debug:main epoch: in tree: 0 installed: 0
1069:debug:main xorg-libXdamage 1.1.3_0 exists in the ports tree
1070:debug:main xorg-libXdamage 1.1.3_0  is the latest installed
1071:debug:main xorg-libXdamage 1.1.3_0  is active
1072:debug:main Merging existing variants '' into variants
1073:debug:main new fully merged portvariants:
1074:debug:main Changing to port directory: /opt/local/var/macports/sources/rsync.macports.org/release/tarballs/ports/x11/xorg-libXdamage
1075:debug:main OS darwin/12.2.0 (Mac OS X 10.8) arch i386
1076:debug:main org.macports.load registered provides 'load', a pre-existing procedure. Target override will not be provided
1077:debug:main org.macports.unload registered provides 'unload', a pre-existing procedure. Target override will not be provided
1078:debug:main org.macports.distfiles registered provides 'distfiles', a pre-existing procedure. Target override will not be provided
1079:debug:main adding the default universal variant
1080:debug:main Reading variant descriptions from /opt/local/var/macports/sources/rsync.macports.org/release/tarballs/ports/_resources/port1.0/variant_descriptions.conf
1081:debug:main No need to upgrade! xorg-libXdamage 1.1.3_0 >= xorg-libXdamage 1.1.3_0
1082:debug:main epoch: in tree: 0 installed: 0
1083:debug:main xorg-damageproto 1.2.1_0 exists in the ports tree
1084:debug:main xorg-damageproto 1.2.1_0  is the latest installed
1085:debug:main xorg-damageproto 1.2.1_0  is active
1086:debug:main Merging existing variants '' into variants
1087:debug:main new fully merged portvariants:
1088:debug:main Changing to port directory: /opt/local/var/macports/sources/rsync.macports.org/release/tarballs/ports/x11/xorg-damageproto
1089:debug:main OS darwin/12.2.0 (Mac OS X 10.8) arch i386
1090:debug:main org.macports.load registered provides 'load', a pre-existing procedure. Target override will not be provided
1091:debug:main org.macports.unload registered provides 'unload', a pre-existing procedure. Target override will not be provided
1092:debug:main org.macports.distfiles registered provides 'distfiles', a pre-existing procedure. Target override will not be provided
1093:debug:main only one arch supported, so not adding the default universal variant
1094:debug:main No need to upgrade! xorg-damageproto 1.2.1_0 >= xorg-damageproto 1.2.1_0
1095:debug:main epoch: in tree: 0 installed: 0
1096:debug:main xorg-libXcomposite 0.4.3_0 exists in the ports tree
1097:debug:main xorg-libXcomposite 0.4.3_0  is the latest installed
1098:debug:main xorg-libXcomposite 0.4.3_0  is active
1099:debug:main Merging existing variants '' into variants
1100:debug:main new fully merged portvariants:
1101:debug:main Changing to port directory: /opt/local/var/macports/sources/rsync.macports.org/release/tarballs/ports/x11/xorg-libXcomposite
1102:debug:main OS darwin/12.2.0 (Mac OS X 10.8) arch i386
1103:debug:main org.macports.load registered provides 'load', a pre-existing procedure. Target override will not be provided
1104:debug:main org.macports.unload registered provides 'unload', a pre-existing procedure. Target override will not be provided
1105:debug:main org.macports.distfiles registered provides 'distfiles', a pre-existing procedure. Target override will not be provided
1106:debug:main adding the default universal variant
1107:debug:main Reading variant descriptions from /opt/local/var/macports/sources/rsync.macports.org/release/tarballs/ports/_resources/port1.0/variant_descriptions.conf
1108:debug:main No need to upgrade! xorg-libXcomposite 0.4.3_0 >= xorg-libXcomposite 0.4.3_0
1109:debug:main epoch: in tree: 0 installed: 0
1110:debug:main xorg-compositeproto 0.4.2_0 exists in the ports tree
1111:debug:main xorg-compositeproto 0.4.2_0  is the latest installed
1112:debug:main xorg-compositeproto 0.4.2_0  is active
1113:debug:main Merging existing variants '' into variants
1114:debug:main new fully merged portvariants:
1115:debug:main Changing to port directory: /opt/local/var/macports/sources/rsync.macports.org/release/tarballs/ports/x11/xorg-compositeproto
1116:debug:main OS darwin/12.2.0 (Mac OS X 10.8) arch i386
1117:debug:main org.macports.load registered provides 'load', a pre-existing procedure. Target override will not be provided
1118:debug:main org.macports.unload registered provides 'unload', a pre-existing procedure. Target override will not be provided
1119:debug:main org.macports.distfiles registered provides 'distfiles', a pre-existing procedure. Target override will not be provided
1120:debug:main only one arch supported, so not adding the default universal variant
1121:debug:main No need to upgrade! xorg-compositeproto 0.4.2_0 >= xorg-compositeproto 0.4.2_0
1122:debug:main epoch: in tree: 0 installed: 0
1123:debug:main shared-mime-info 1.0_0 exists in the ports tree
1124:debug:main shared-mime-info 1.0_0  is the latest installed
1125:debug:main shared-mime-info 1.0_0  is active
1126:debug:main Merging existing variants '' into variants
1127:debug:main new fully merged portvariants:
1128:debug:main Changing to port directory: /opt/local/var/macports/sources/rsync.macports.org/release/tarballs/ports/devel/shared-mime-info
1129:debug:main OS darwin/12.2.0 (Mac OS X 10.8) arch i386
1130:debug:main org.macports.load registered provides 'load', a pre-existing procedure. Target override will not be provided
1131:debug:main org.macports.unload registered provides 'unload', a pre-existing procedure. Target override will not be provided
1132:debug:main org.macports.distfiles registered provides 'distfiles', a pre-existing procedure. Target override will not be provided
1133:debug:main adding the default universal variant
1134:debug:main Reading variant descriptions from /opt/local/var/macports/sources/rsync.macports.org/release/tarballs/ports/_resources/port1.0/variant_descriptions.conf
1135:debug:main No need to upgrade! shared-mime-info 1.0_0 >= shared-mime-info 1.0_0
1136:debug:main epoch: in tree: 0 installed: 0
1137:debug:main hicolor-icon-theme 0.12_0 exists in the ports tree
1138:debug:main hicolor-icon-theme 0.12_0  is the latest installed
1139:debug:main hicolor-icon-theme 0.12_0  is active
1140:debug:main Merging existing variants '' into variants
1141:debug:main new fully merged portvariants:
1142:debug:main Changing to port directory: /opt/local/var/macports/sources/rsync.macports.org/release/tarballs/ports/gnome/hicolor-icon-theme
1143:debug:main OS darwin/12.2.0 (Mac OS X 10.8) arch i386
1144:debug:main org.macports.load registered provides 'load', a pre-existing procedure. Target override will not be provided
1145:debug:main org.macports.unload registered provides 'unload', a pre-existing procedure. Target override will not be provided
1146:debug:main org.macports.distfiles registered provides 'distfiles', a pre-existing procedure. Target override will not be provided
1147:debug:main only one arch supported, so not adding the default universal variant
1148:debug:main No need to upgrade! hicolor-icon-theme 0.12_0 >= hicolor-icon-theme 0.12_0
1149:debug:main epoch: in tree: 0 installed: 0
1150:debug:main libofx 0.9.5_0 exists in the ports tree
1151:debug:main libofx 0.9.5_0  is the latest installed
1152:debug:main libofx 0.9.5_0  is active
1153:debug:main Merging existing variants '' into variants
1154:debug:main new fully merged portvariants:
1155:debug:main Changing to port directory: /opt/local/var/macports/sources/rsync.macports.org/release/tarballs/ports/devel/libofx
1156:debug:main OS darwin/12.2.0 (Mac OS X 10.8) arch i386
1157:debug:main org.macports.load registered provides 'load', a pre-existing procedure. Target override will not be provided
1158:debug:main org.macports.unload registered provides 'unload', a pre-existing procedure. Target override will not be provided
1159:debug:main org.macports.distfiles registered provides 'distfiles', a pre-existing procedure. Target override will not be provided
1160:debug:main adding the default universal variant
1161:debug:main Reading variant descriptions from /opt/local/var/macports/sources/rsync.macports.org/release/tarballs/ports/_resources/port1.0/variant_descriptions.conf
1162:debug:main No need to upgrade! libofx 0.9.5_0 >= libofx 0.9.5_0
1163:debug:main epoch: in tree: 0 installed: 0
1164:debug:main opensp 1.5.2_1 exists in the ports tree
1165:debug:main opensp 1.5.2_1  is the latest installed
1166:debug:main opensp 1.5.2_1  is active
1167:debug:main Merging existing variants '' into variants
1168:debug:main new fully merged portvariants:
1169:debug:main Changing to port directory: /opt/local/var/macports/sources/rsync.macports.org/release/tarballs/ports/textproc/opensp
1170:debug:main OS darwin/12.2.0 (Mac OS X 10.8) arch i386
1171:debug:main org.macports.load registered provides 'load', a pre-existing procedure. Target override will not be provided
1172:debug:main org.macports.unload registered provides 'unload', a pre-existing procedure. Target override will not be provided
1173:debug:main org.macports.distfiles registered provides 'distfiles', a pre-existing procedure. Target override will not be provided
1174:debug:main adding the default universal variant
1175:debug:main Reading variant descriptions from /opt/local/var/macports/sources/rsync.macports.org/release/tarballs/ports/_resources/port1.0/variant_descriptions.conf
1176:debug:main No need to upgrade! opensp 1.5.2_1 >= opensp 1.5.2_1
1177:debug:main epoch: in tree: 0 installed: 0
1178:debug:main gmp 5.0.5_0 exists in the ports tree
1179:debug:main gmp 5.0.5_0  is the latest installed
1180:debug:main gmp 5.0.5_0  is active
1181:debug:main Merging existing variants '' into variants
1182:debug:main new fully merged portvariants:
1183:debug:main Changing to port directory: /opt/local/var/macports/sources/rsync.macports.org/release/tarballs/ports/devel/gmp
1184:debug:main OS darwin/12.2.0 (Mac OS X 10.8) arch i386
1185:debug:main org.macports.load registered provides 'load', a pre-existing procedure. Target override will not be provided
1186:debug:main org.macports.unload registered provides 'unload', a pre-existing procedure. Target override will not be provided
1187:debug:main org.macports.distfiles registered provides 'distfiles', a pre-existing procedure. Target override will not be provided
1188:debug:main Using group file /opt/local/var/macports/sources/rsync.macports.org/release/tarballs/ports/_resources/port1.0/group/muniversal-1.0.tcl
1189:debug:main Reading variant descriptions from /opt/local/var/macports/sources/rsync.macports.org/release/tarballs/ports/_resources/port1.0/variant_descriptions.conf
1190:debug:main universal variant already exists, so not adding the default one
1191:debug:main No need to upgrade! gmp 5.0.5_0 >= gmp 5.0.5_0
1192:debug:main epoch: in tree: 0 installed: 0
1193:debug:main kdelibs3 3.5.10_13 exists in the ports tree
1194:debug:main kdelibs3 3.5.10_13  is the latest installed
1195:debug:main kdelibs3 3.5.10_13  is active
1196:debug:main Merging existing variants '' into variants
1197:debug:main new fully merged portvariants:
1198:debug:main Changing to port directory: /opt/local/var/macports/sources/rsync.macports.org/release/tarballs/ports/kde/kdelibs3
1199:debug:main OS darwin/12.2.0 (Mac OS X 10.8) arch i386
1200:debug:main org.macports.load registered provides 'load', a pre-existing procedure. Target override will not be provided
1201:debug:main org.macports.unload registered provides 'unload', a pre-existing procedure. Target override will not be provided
1202:debug:main org.macports.distfiles registered provides 'distfiles', a pre-existing procedure. Target override will not be provided
1203:debug:main universal_variant is false, so not adding the default universal variant
1204:debug:main No need to upgrade! kdelibs3 3.5.10_13 >= kdelibs3 3.5.10_13
1205:debug:main Found Dependency: path: /usr/lib filename: libpoll.dylib regex: ^libpoll\.dylib$
1206:debug:main epoch: in tree: 0 installed: 0
1207:debug:main libxslt 1.1.27_0 exists in the ports tree
1208:debug:main libxslt 1.1.27_0  is the latest installed
1209:debug:main libxslt 1.1.27_0  is active
1210:debug:main Merging existing variants '' into variants
1211:debug:main new fully merged portvariants:
1212:debug:main Changing to port directory: /opt/local/var/macports/sources/rsync.macports.org/release/tarballs/ports/textproc/libxslt
1213:debug:main OS darwin/12.2.0 (Mac OS X 10.8) arch i386
1214:debug:main org.macports.load registered provides 'load', a pre-existing procedure. Target override will not be provided
1215:debug:main org.macports.unload registered provides 'unload', a pre-existing procedure. Target override will not be provided
1216:debug:main org.macports.distfiles registered provides 'distfiles', a pre-existing procedure. Target override will not be provided
1217:debug:main adding the default universal variant
1218:debug:main Reading variant descriptions from /opt/local/var/macports/sources/rsync.macports.org/release/tarballs/ports/_resources/port1.0/variant_descriptions.conf
1219:debug:main No need to upgrade! libxslt 1.1.27_0 >= libxslt 1.1.27_0
1220:debug:main epoch: in tree: 0 installed: 0
1221:debug:main aspell 0.60.6_4 exists in the ports tree
1222:debug:main aspell 0.60.6_4 +nonls is the latest installed
1223:debug:main aspell 0.60.6_4 +nonls is active
1224:debug:main Merging existing variants '+nonls' into variants
1225:debug:main new fully merged portvariants: nonls +
1226:debug:main Changing to port directory: /opt/local/var/macports/sources/rsync.macports.org/release/tarballs/ports/textproc/aspell
1227:debug:main OS darwin/12.2.0 (Mac OS X 10.8) arch i386
1228:debug:main org.macports.load registered provides 'load', a pre-existing procedure. Target override will not be provided
1229:debug:main org.macports.unload registered provides 'unload', a pre-existing procedure. Target override will not be provided
1230:debug:main org.macports.distfiles registered provides 'distfiles', a pre-existing procedure. Target override will not be provided
1231:debug:main Reading variant descriptions from /opt/local/var/macports/sources/rsync.macports.org/release/tarballs/ports/_resources/port1.0/variant_descriptions.conf
1232:debug:main adding the default universal variant
1233:debug:main Executing variant nonls provides nonls
1234:debug:main No need to upgrade! aspell 0.60.6_4 >= aspell 0.60.6_4
1235:debug:main epoch: in tree: 0 installed: 0
1236:debug:main texinfo 4.13_2 exists in the ports tree
1237:debug:main texinfo 4.13_2  is the latest installed
1238:debug:main texinfo 4.13_2  is active
1239:debug:main Merging existing variants '' into variants
1240:debug:main new fully merged portvariants:
1241:debug:main Changing to port directory: /opt/local/var/macports/sources/rsync.macports.org/release/tarballs/ports/textproc/texinfo
1242:debug:main OS darwin/12.2.0 (Mac OS X 10.8) arch i386
1243:debug:main org.macports.load registered provides 'load', a pre-existing procedure. Target override will not be provided
1244:debug:main org.macports.unload registered provides 'unload', a pre-existing procedure. Target override will not be provided
1245:debug:main org.macports.distfiles registered provides 'distfiles', a pre-existing procedure. Target override will not be provided
1246:debug:main adding the default universal variant
1247:debug:main Reading variant descriptions from /opt/local/var/macports/sources/rsync.macports.org/release/tarballs/ports/_resources/port1.0/variant_descriptions.conf
1248:debug:main No need to upgrade! texinfo 4.13_2 >= texinfo 4.13_2
1249:debug:main epoch: in tree: 0 installed: 0
1250:debug:main flex 2.5.37_1 exists in the ports tree
1251:debug:main flex 2.5.37_1  is the latest installed
1252:debug:main flex 2.5.37_1  is active
1253:debug:main Merging existing variants '' into variants
1254:debug:main new fully merged portvariants:
1255:debug:main Changing to port directory: /opt/local/var/macports/sources/rsync.macports.org/release/tarballs/ports/devel/flex
1256:debug:main OS darwin/12.2.0 (Mac OS X 10.8) arch i386
1257:debug:main org.macports.load registered provides 'load', a pre-existing procedure. Target override will not be provided
1258:debug:main org.macports.unload registered provides 'unload', a pre-existing procedure. Target override will not be provided
1259:debug:main org.macports.distfiles registered provides 'distfiles', a pre-existing procedure. Target override will not be provided
1260:debug:main adding the default universal variant
1261:debug:main Reading variant descriptions from /opt/local/var/macports/sources/rsync.macports.org/release/tarballs/ports/_resources/port1.0/variant_descriptions.conf
1262:debug:main No need to upgrade! flex 2.5.37_1 >= flex 2.5.37_1
1263:debug:main epoch: in tree: 0 installed: 0
1264:debug:main m4 1.4.16_0 exists in the ports tree
1265:debug:main m4 1.4.16_0  is the latest installed
1266:debug:main m4 1.4.16_0  is active
1267:debug:main Merging existing variants '' into variants
1268:debug:main new fully merged portvariants:
1269:debug:main Changing to port directory: /opt/local/var/macports/sources/rsync.macports.org/release/tarballs/ports/devel/m4
1270:debug:main OS darwin/12.2.0 (Mac OS X 10.8) arch i386
1271:debug:main org.macports.load registered provides 'load', a pre-existing procedure. Target override will not be provided
1272:debug:main org.macports.unload registered provides 'unload', a pre-existing procedure. Target override will not be provided
1273:debug:main org.macports.distfiles registered provides 'distfiles', a pre-existing procedure. Target override will not be provided
1274:debug:main adding the default universal variant
1275:debug:main Reading variant descriptions from /opt/local/var/macports/sources/rsync.macports.org/release/tarballs/ports/_resources/port1.0/variant_descriptions.conf
1276:debug:main No need to upgrade! m4 1.4.16_0 >= m4 1.4.16_0
1277:debug:main epoch: in tree: 0 installed: 0
1278:debug:main libart_lgpl 2.3.21_0 exists in the ports tree
1279:debug:main libart_lgpl 2.3.21_0  is the latest installed
1280:debug:main libart_lgpl 2.3.21_0  is active
1281:debug:main Merging existing variants '' into variants
1282:debug:main new fully merged portvariants:
1283:debug:main Changing to port directory: /opt/local/var/macports/sources/rsync.macports.org/release/tarballs/ports/graphics/libart_lgpl
1284:debug:main OS darwin/12.2.0 (Mac OS X 10.8) arch i386
1285:debug:main org.macports.load registered provides 'load', a pre-existing procedure. Target override will not be provided
1286:debug:main org.macports.unload registered provides 'unload', a pre-existing procedure. Target override will not be provided
1287:debug:main org.macports.distfiles registered provides 'distfiles', a pre-existing procedure. Target override will not be provided
1288:debug:main adding the default universal variant
1289:debug:main Reading variant descriptions from /opt/local/var/macports/sources/rsync.macports.org/release/tarballs/ports/_resources/port1.0/variant_descriptions.conf
1290:debug:main No need to upgrade! libart_lgpl 2.3.21_0 >= libart_lgpl 2.3.21_0
1291:debug:main epoch: in tree: 0 installed: 0
1292:debug:main libidn 1.25_0 exists in the ports tree
1293:debug:main libidn 1.25_0  is the latest installed
1294:debug:main libidn 1.25_0  is active
1295:debug:main Merging existing variants '' into variants
1296:debug:main new fully merged portvariants:
1297:debug:main Changing to port directory: /opt/local/var/macports/sources/rsync.macports.org/release/tarballs/ports/mail/libidn
1298:debug:main OS darwin/12.2.0 (Mac OS X 10.8) arch i386
1299:debug:main org.macports.load registered provides 'load', a pre-existing procedure. Target override will not be provided
1300:debug:main org.macports.unload registered provides 'unload', a pre-existing procedure. Target override will not be provided
1301:debug:main org.macports.distfiles registered provides 'distfiles', a pre-existing procedure. Target override will not be provided
1302:debug:main Using group file /opt/local/var/macports/sources/rsync.macports.org/release/tarballs/ports/_resources/port1.0/group/conflicts_build-1.0.tcl
1303:debug:main adding the default universal variant
1304:debug:main Reading variant descriptions from /opt/local/var/macports/sources/rsync.macports.org/release/tarballs/ports/_resources/port1.0/variant_descriptions.conf
1305:debug:main No need to upgrade! libidn 1.25_0 >= libidn 1.25_0
1306:debug:main epoch: in tree: 0 installed: 0
1307:debug:main pcre 8.31_0 exists in the ports tree
1308:debug:main pcre 8.31_0  is the latest installed
1309:debug:main pcre 8.31_0  is active
1310:debug:main Merging existing variants '' into variants
1311:debug:main new fully merged portvariants:
1312:debug:main Changing to port directory: /opt/local/var/macports/sources/rsync.macports.org/release/tarballs/ports/devel/pcre
1313:debug:main OS darwin/12.2.0 (Mac OS X 10.8) arch i386
1314:debug:main org.macports.load registered provides 'load', a pre-existing procedure. Target override will not be provided
1315:debug:main org.macports.unload registered provides 'unload', a pre-existing procedure. Target override will not be provided
1316:debug:main org.macports.distfiles registered provides 'distfiles', a pre-existing procedure. Target override will not be provided
1317:debug:main adding the default universal variant
1318:debug:main Reading variant descriptions from /opt/local/var/macports/sources/rsync.macports.org/release/tarballs/ports/_resources/port1.0/variant_descriptions.conf
1319:debug:main No need to upgrade! pcre 8.31_0 >= pcre 8.31_0
1320:debug:main epoch: in tree: 0 installed: 0
1321:debug:main openexr 1.7.0_0 exists in the ports tree
1322:debug:main openexr 1.7.0_0  is the latest installed
1323:debug:main openexr 1.7.0_0  is active
1324:debug:main Merging existing variants '' into variants
1325:debug:main new fully merged portvariants:
1326:debug:main Changing to port directory: /opt/local/var/macports/sources/rsync.macports.org/release/tarballs/ports/graphics/openexr
1327:debug:main OS darwin/12.2.0 (Mac OS X 10.8) arch i386
1328:debug:main org.macports.load registered provides 'load', a pre-existing procedure. Target override will not be provided
1329:debug:main org.macports.unload registered provides 'unload', a pre-existing procedure. Target override will not be provided
1330:debug:main org.macports.distfiles registered provides 'distfiles', a pre-existing procedure. Target override will not be provided
1331:debug:main adding the default universal variant
1332:debug:main Reading variant descriptions from /opt/local/var/macports/sources/rsync.macports.org/release/tarballs/ports/_resources/port1.0/variant_descriptions.conf
1333:debug:main No need to upgrade! openexr 1.7.0_0 >= openexr 1.7.0_0
1334:debug:main epoch: in tree: 0 installed: 0
1335:debug:main ilmbase 1.0.2_0 exists in the ports tree
1336:debug:main ilmbase 1.0.2_0  is the latest installed
1337:debug:main ilmbase 1.0.2_0  is active
1338:debug:main Merging existing variants '' into variants
1339:debug:main new fully merged portvariants:
1340:debug:main Changing to port directory: /opt/local/var/macports/sources/rsync.macports.org/release/tarballs/ports/graphics/ilmbase
1341:debug:main OS darwin/12.2.0 (Mac OS X 10.8) arch i386
1342:debug:main org.macports.load registered provides 'load', a pre-existing procedure. Target override will not be provided
1343:debug:main org.macports.unload registered provides 'unload', a pre-existing procedure. Target override will not be provided
1344:debug:main org.macports.distfiles registered provides 'distfiles', a pre-existing procedure. Target override will not be provided
1345:debug:main adding the default universal variant
1346:debug:main Reading variant descriptions from /opt/local/var/macports/sources/rsync.macports.org/release/tarballs/ports/_resources/port1.0/variant_descriptions.conf
1347:debug:main No need to upgrade! ilmbase 1.0.2_0 >= ilmbase 1.0.2_0
1348:debug:main epoch: in tree: 0 installed: 0
1349:debug:main dejavu-fonts 2.33_0 exists in the ports tree
1350:debug:main dejavu-fonts 2.33_0  is the latest installed
1351:debug:main dejavu-fonts 2.33_0  is active
1352:debug:main Merging existing variants '' into variants
1353:debug:main new fully merged portvariants:
1354:debug:main Changing to port directory: /opt/local/var/macports/sources/rsync.macports.org/release/tarballs/ports/x11/dejavu-fonts
1355:debug:main OS darwin/12.2.0 (Mac OS X 10.8) arch i386
1356:debug:main org.macports.load registered provides 'load', a pre-existing procedure. Target override will not be provided
1357:debug:main org.macports.unload registered provides 'unload', a pre-existing procedure. Target override will not be provided
1358:debug:main org.macports.distfiles registered provides 'distfiles', a pre-existing procedure. Target override will not be provided
1359:debug:main universal_variant is false, so not adding the default universal variant
1360:debug:main No need to upgrade! dejavu-fonts 2.33_0 >= dejavu-fonts 2.33_0
1361:msg:main --->  Computing dependencies for kmymoney:info:main .:debug:main kmymoney has no conflicts
1362:debug:main Searching for dependency: libtool
1363:debug:main Found Dependency: receipt exists for libtool
1364:debug:main Searching for dependency: makeicns
1365:debug:main Found Dependency: receipt exists for makeicns
1366:debug:main Searching for dependency: aqbanking
1367:debug:main Found Dependency: receipt exists for aqbanking
1368:debug:main Searching for dependency: kdelibs3
1369:debug:main Found Dependency: receipt exists for kdelibs3
1370:msg:main
1371:debug:main Executing org.macports.main (kmymoney)
1372:debug:main changing euid/egid - current euid: 0 - current egid: 0
1373:debug:main egid changed to: 501
1374:debug:main euid changed to: 503
1375:debug:main Skipping completed org.macports.archivefetch (kmymoney)
1376:debug:main Privilege de-escalation not attempted as not running as root.
1377:debug:main Skipping completed org.macports.fetch (kmymoney)
1378:debug:main Privilege de-escalation not attempted as not running as root.
1379:debug:main Skipping completed org.macports.checksum (kmymoney)
1380:debug:main Privilege de-escalation not attempted as not running as root.
1381:debug:main Skipping completed org.macports.extract (kmymoney)
1382:debug:main Privilege de-escalation not attempted as not running as root.
1383:debug:main Skipping completed org.macports.patch (kmymoney)
1384:debug:main Privilege de-escalation not attempted as not running as root.
1385:debug:main Skipping completed org.macports.configure (kmymoney)
1386:debug:main Privilege de-escalation not attempted as not running as root.
1387:debug:build build phase started at Tue Nov 27 20:17:38 EST 2012
1388:notice:build --->  Building kmymoney
1389:debug:build Executing org.macports.build (kmymoney)
1390:debug:build Environment: CPATH='/opt/local/include' CC_PRINT_OPTIONS_FILE='/opt/local/var/macports/build/_opt_local_var_macports_sources_rsync.macports.org_release_tarballs_ports_kde_kmymoney/kmymoney/work/.CC_PRINT_OPTIONS' LIBRARY_PATH='/opt/local/lib' CC_PRINT_OPTIONS='YES' MACOSX_DEPLOYMENT_TARGET='10.8' HOME='/opt/local/var/macports/build/_opt_local_var_macports_sources_rsync.macports.org_release_tarballs_ports_kde_kmymoney/kmymoney/work/kmymoney2-1.0.5'
1391:debug:build Assembled command: 'cd "/opt/local/var/macports/build/_opt_local_var_macports_sources_rsync.macports.org_release_tarballs_ports_kde_kmymoney/kmymoney/work/kmymoney2-1.0.5" && /usr/bin/make -j4 -w all'
1392:debug:build Executing command line:  cd "/opt/local/var/macports/build/_opt_local_var_macports_sources_rsync.macports.org_release_tarballs_ports_kde_kmymoney/kmymoney/work/kmymoney2-1.0.5" && /usr/bin/make -j4 -w all
1393:info:build make: Entering directory `/opt/local/var/macports/build/_opt_local_var_macports_sources_rsync.macports.org_release_tarballs_ports_kde_kmymoney/kmymoney/work/kmymoney2-1.0.5'
1394:info:build /usr/bin/make  all-recursive
1395:info:build make[1]: Entering directory `/opt/local/var/macports/build/_opt_local_var_macports_sources_rsync.macports.org_release_tarballs_ports_kde_kmymoney/kmymoney/work/kmymoney2-1.0.5'
1396:info:build Making all in libkgpgfile
1397:info:build make[2]: Entering directory `/opt/local/var/macports/build/_opt_local_var_macports_sources_rsync.macports.org_release_tarballs_ports_kde_kmymoney/kmymoney/work/kmymoney2-1.0.5/libkgpgfile'
1398:info:build make[2]: Nothing to be done for `all'.
1399:info:build make[2]: Leaving directory `/opt/local/var/macports/build/_opt_local_var_macports_sources_rsync.macports.org_release_tarballs_ports_kde_kmymoney/kmymoney/work/kmymoney2-1.0.5/libkgpgfile'
1400:info:build Making all in libkdchart
1401:info:build make[2]: Entering directory `/opt/local/var/macports/build/_opt_local_var_macports_sources_rsync.macports.org_release_tarballs_ports_kde_kmymoney/kmymoney/work/kmymoney2-1.0.5/libkdchart'
1402:info:build make[2]: Nothing to be done for `all'.
1403:info:build make[2]: Leaving directory `/opt/local/var/macports/build/_opt_local_var_macports_sources_rsync.macports.org_release_tarballs_ports_kde_kmymoney/kmymoney/work/kmymoney2-1.0.5/libkdchart'
1404:info:build Making all in kmymoney2
1405:info:build make[2]: Entering directory `/opt/local/var/macports/build/_opt_local_var_macports_sources_rsync.macports.org_release_tarballs_ports_kde_kmymoney/kmymoney/work/kmymoney2-1.0.5/kmymoney2'
1406:info:build /usr/bin/make  all-recursive
1407:info:build make[3]: Entering directory `/opt/local/var/macports/build/_opt_local_var_macports_sources_rsync.macports.org_release_tarballs_ports_kde_kmymoney/kmymoney/work/kmymoney2-1.0.5/kmymoney2'
1408:info:build Making all in mymoney
1409:info:build make[4]: Entering directory `/opt/local/var/macports/build/_opt_local_var_macports_sources_rsync.macports.org_release_tarballs_ports_kde_kmymoney/kmymoney/work/kmymoney2-1.0.5/kmymoney2/mymoney'
1410:info:build Making all in storage
1411:info:build make[5]: Entering directory `/opt/local/var/macports/build/_opt_local_var_macports_sources_rsync.macports.org_release_tarballs_ports_kde_kmymoney/kmymoney/work/kmymoney2-1.0.5/kmymoney2/mymoney/storage'
1412:info:build make[5]: Nothing to be done for `all'.
1413:info:build make[5]: Leaving directory `/opt/local/var/macports/build/_opt_local_var_macports_sources_rsync.macports.org_release_tarballs_ports_kde_kmymoney/kmymoney/work/kmymoney2-1.0.5/kmymoney2/mymoney/storage'
1414:info:build make[5]: Entering directory `/opt/local/var/macports/build/_opt_local_var_macports_sources_rsync.macports.org_release_tarballs_ports_kde_kmymoney/kmymoney/work/kmymoney2-1.0.5/kmymoney2/mymoney'
1415:info:build make[5]: Nothing to be done for `all-am'.
1416:info:build make[5]: Leaving directory `/opt/local/var/macports/build/_opt_local_var_macports_sources_rsync.macports.org_release_tarballs_ports_kde_kmymoney/kmymoney/work/kmymoney2-1.0.5/kmymoney2/mymoney'
1417:info:build make[4]: Leaving directory `/opt/local/var/macports/build/_opt_local_var_macports_sources_rsync.macports.org_release_tarballs_ports_kde_kmymoney/kmymoney/work/kmymoney2-1.0.5/kmymoney2/mymoney'
1418:info:build Making all in widgets
1419:info:build make[4]: Entering directory `/opt/local/var/macports/build/_opt_local_var_macports_sources_rsync.macports.org_release_tarballs_ports_kde_kmymoney/kmymoney/work/kmymoney2-1.0.5/kmymoney2/widgets'
1420:info:build /usr/bin/make -C .. kmymoneysettings.h
1421:info:build /usr/bin/make -C ../dialogs kcurrencycalculatordecl.h
1422:info:build make[5]: Entering directory `/opt/local/var/macports/build/_opt_local_var_macports_sources_rsync.macports.org_release_tarballs_ports_kde_kmymoney/kmymoney/work/kmymoney2-1.0.5/kmymoney2'
1423:info:build make[5]: `kmymoneysettings.h' is up to date.
1424:info:build make[5]: Leaving directory `/opt/local/var/macports/build/_opt_local_var_macports_sources_rsync.macports.org_release_tarballs_ports_kde_kmymoney/kmymoney/work/kmymoney2-1.0.5/kmymoney2'
1425:info:build make[5]: Entering directory `/opt/local/var/macports/build/_opt_local_var_macports_sources_rsync.macports.org_release_tarballs_ports_kde_kmymoney/kmymoney/work/kmymoney2-1.0.5/kmymoney2/dialogs'
1426:info:build make[5]: `kcurrencycalculatordecl.h' is up to date.
1427:info:build make[5]: Leaving directory `/opt/local/var/macports/build/_opt_local_var_macports_sources_rsync.macports.org_release_tarballs_ports_kde_kmymoney/kmymoney/work/kmymoney2-1.0.5/kmymoney2/dialogs'
1428:info:build /usr/bin/make  all-am
1429:info:build make[5]: Entering directory `/opt/local/var/macports/build/_opt_local_var_macports_sources_rsync.macports.org_release_tarballs_ports_kde_kmymoney/kmymoney/work/kmymoney2-1.0.5/kmymoney2/widgets'
1430:info:build make[5]: Nothing to be done for `all-am'.
1431:info:build make[5]: Leaving directory `/opt/local/var/macports/build/_opt_local_var_macports_sources_rsync.macports.org_release_tarballs_ports_kde_kmymoney/kmymoney/work/kmymoney2-1.0.5/kmymoney2/widgets'
1432:info:build make[4]: Leaving directory `/opt/local/var/macports/build/_opt_local_var_macports_sources_rsync.macports.org_release_tarballs_ports_kde_kmymoney/kmymoney/work/kmymoney2-1.0.5/kmymoney2/widgets'
1433:info:build Making all in dialogs
1434:info:build make[4]: Entering directory `/opt/local/var/macports/build/_opt_local_var_macports_sources_rsync.macports.org_release_tarballs_ports_kde_kmymoney/kmymoney/work/kmymoney2-1.0.5/kmymoney2/dialogs'
1435:info:build Making all in settings
1436:info:build make[5]: Entering directory `/opt/local/var/macports/build/_opt_local_var_macports_sources_rsync.macports.org_release_tarballs_ports_kde_kmymoney/kmymoney/work/kmymoney2-1.0.5/kmymoney2/dialogs/settings'
1437:info:build make[5]: Nothing to be done for `all'.
1438:info:build make[5]: Leaving directory `/opt/local/var/macports/build/_opt_local_var_macports_sources_rsync.macports.org_release_tarballs_ports_kde_kmymoney/kmymoney/work/kmymoney2-1.0.5/kmymoney2/dialogs/settings'
1439:info:build make[5]: Entering directory `/opt/local/var/macports/build/_opt_local_var_macports_sources_rsync.macports.org_release_tarballs_ports_kde_kmymoney/kmymoney/work/kmymoney2-1.0.5/kmymoney2/dialogs'
1440:info:build make[5]: Nothing to be done for `all-am'.
1441:info:build make[5]: Leaving directory `/opt/local/var/macports/build/_opt_local_var_macports_sources_rsync.macports.org_release_tarballs_ports_kde_kmymoney/kmymoney/work/kmymoney2-1.0.5/kmymoney2/dialogs'
1442:info:build make[4]: Leaving directory `/opt/local/var/macports/build/_opt_local_var_macports_sources_rsync.macports.org_release_tarballs_ports_kde_kmymoney/kmymoney/work/kmymoney2-1.0.5/kmymoney2/dialogs'
1443:info:build Making all in wizards
1444:info:build make[4]: Entering directory `/opt/local/var/macports/build/_opt_local_var_macports_sources_rsync.macports.org_release_tarballs_ports_kde_kmymoney/kmymoney/work/kmymoney2-1.0.5/kmymoney2/wizards'
1445:info:build Making all in wizardpages
1446:info:build make[5]: Entering directory `/opt/local/var/macports/build/_opt_local_var_macports_sources_rsync.macports.org_release_tarballs_ports_kde_kmymoney/kmymoney/work/kmymoney2-1.0.5/kmymoney2/wizards/wizardpages'
1447:info:build make[6]: Entering directory `/opt/local/var/macports/build/_opt_local_var_macports_sources_rsync.macports.org_release_tarballs_ports_kde_kmymoney/kmymoney/work/kmymoney2-1.0.5/kmymoney2/wizards/wizardpages'
1448:info:build make[6]: Nothing to be done for `all-am'.
1449:info:build make[6]: Leaving directory `/opt/local/var/macports/build/_opt_local_var_macports_sources_rsync.macports.org_release_tarballs_ports_kde_kmymoney/kmymoney/work/kmymoney2-1.0.5/kmymoney2/wizards/wizardpages'
1450:info:build make[5]: Leaving directory `/opt/local/var/macports/build/_opt_local_var_macports_sources_rsync.macports.org_release_tarballs_ports_kde_kmymoney/kmymoney/work/kmymoney2-1.0.5/kmymoney2/wizards/wizardpages'
1451:info:build Making all in newuserwizard
1452:info:build make[5]: Entering directory `/opt/local/var/macports/build/_opt_local_var_macports_sources_rsync.macports.org_release_tarballs_ports_kde_kmymoney/kmymoney/work/kmymoney2-1.0.5/kmymoney2/wizards/newuserwizard'
1453:info:build make[6]: Entering directory `/opt/local/var/macports/build/_opt_local_var_macports_sources_rsync.macports.org_release_tarballs_ports_kde_kmymoney/kmymoney/work/kmymoney2-1.0.5/kmymoney2/wizards/newuserwizard'
1454:info:build make[6]: Nothing to be done for `all-am'.
1455:info:build make[6]: Leaving directory `/opt/local/var/macports/build/_opt_local_var_macports_sources_rsync.macports.org_release_tarballs_ports_kde_kmymoney/kmymoney/work/kmymoney2-1.0.5/kmymoney2/wizards/newuserwizard'
1456:info:build make[5]: Leaving directory `/opt/local/var/macports/build/_opt_local_var_macports_sources_rsync.macports.org_release_tarballs_ports_kde_kmymoney/kmymoney/work/kmymoney2-1.0.5/kmymoney2/wizards/newuserwizard'
1457:info:build Making all in newaccountwizard
1458:info:build make[5]: Entering directory `/opt/local/var/macports/build/_opt_local_var_macports_sources_rsync.macports.org_release_tarballs_ports_kde_kmymoney/kmymoney/work/kmymoney2-1.0.5/kmymoney2/wizards/newaccountwizard'
1459:info:build make[6]: Entering directory `/opt/local/var/macports/build/_opt_local_var_macports_sources_rsync.macports.org_release_tarballs_ports_kde_kmymoney/kmymoney/work/kmymoney2-1.0.5/kmymoney2/wizards/newaccountwizard'
1460:info:build make[6]: Nothing to be done for `all-am'.
1461:info:build make[6]: Leaving directory `/opt/local/var/macports/build/_opt_local_var_macports_sources_rsync.macports.org_release_tarballs_ports_kde_kmymoney/kmymoney/work/kmymoney2-1.0.5/kmymoney2/wizards/newaccountwizard'
1462:info:build make[5]: Leaving directory `/opt/local/var/macports/build/_opt_local_var_macports_sources_rsync.macports.org_release_tarballs_ports_kde_kmymoney/kmymoney/work/kmymoney2-1.0.5/kmymoney2/wizards/newaccountwizard'
1463:info:build make[5]: Entering directory `/opt/local/var/macports/build/_opt_local_var_macports_sources_rsync.macports.org_release_tarballs_ports_kde_kmymoney/kmymoney/work/kmymoney2-1.0.5/kmymoney2/wizards'
1464:info:build make[5]: Nothing to be done for `all-am'.
1465:info:build make[5]: Leaving directory `/opt/local/var/macports/build/_opt_local_var_macports_sources_rsync.macports.org_release_tarballs_ports_kde_kmymoney/kmymoney/work/kmymoney2-1.0.5/kmymoney2/wizards'
1466:info:build make[4]: Leaving directory `/opt/local/var/macports/build/_opt_local_var_macports_sources_rsync.macports.org_release_tarballs_ports_kde_kmymoney/kmymoney/work/kmymoney2-1.0.5/kmymoney2/wizards'
1467:info:build Making all in views
1468:info:build make[4]: Entering directory `/opt/local/var/macports/build/_opt_local_var_macports_sources_rsync.macports.org_release_tarballs_ports_kde_kmymoney/kmymoney/work/kmymoney2-1.0.5/kmymoney2/views'
1469:info:build make[4]: Nothing to be done for `all'.
1470:info:build make[4]: Leaving directory `/opt/local/var/macports/build/_opt_local_var_macports_sources_rsync.macports.org_release_tarballs_ports_kde_kmymoney/kmymoney/work/kmymoney2-1.0.5/kmymoney2/views'
1471:info:build Making all in converter
1472:info:build make[4]: Entering directory `/opt/local/var/macports/build/_opt_local_var_macports_sources_rsync.macports.org_release_tarballs_ports_kde_kmymoney/kmymoney/work/kmymoney2-1.0.5/kmymoney2/converter'
1473:info:build make[4]: Nothing to be done for `all'.
1474:info:build make[4]: Leaving directory `/opt/local/var/macports/build/_opt_local_var_macports_sources_rsync.macports.org_release_tarballs_ports_kde_kmymoney/kmymoney/work/kmymoney2-1.0.5/kmymoney2/converter'
1475:info:build Making all in pics
1476:info:build make[4]: Entering directory `/opt/local/var/macports/build/_opt_local_var_macports_sources_rsync.macports.org_release_tarballs_ports_kde_kmymoney/kmymoney/work/kmymoney2-1.0.5/kmymoney2/pics'
1477:info:build make[4]: Nothing to be done for `all'.
1478:info:build make[4]: Leaving directory `/opt/local/var/macports/build/_opt_local_var_macports_sources_rsync.macports.org_release_tarballs_ports_kde_kmymoney/kmymoney/work/kmymoney2-1.0.5/kmymoney2/pics'
1479:info:build Making all in icons
1480:info:build make[4]: Entering directory `/opt/local/var/macports/build/_opt_local_var_macports_sources_rsync.macports.org_release_tarballs_ports_kde_kmymoney/kmymoney/work/kmymoney2-1.0.5/kmymoney2/icons'
1481:info:build Making all in hicolor
1482:info:build make[5]: Entering directory `/opt/local/var/macports/build/_opt_local_var_macports_sources_rsync.macports.org_release_tarballs_ports_kde_kmymoney/kmymoney/work/kmymoney2-1.0.5/kmymoney2/icons/hicolor'
1483:info:build Making all in 16x16
1484:info:build make[6]: Entering directory `/opt/local/var/macports/build/_opt_local_var_macports_sources_rsync.macports.org_release_tarballs_ports_kde_kmymoney/kmymoney/work/kmymoney2-1.0.5/kmymoney2/icons/hicolor/16x16'
1485:info:build Making all in actions
1486:info:build make[7]: Entering directory `/opt/local/var/macports/build/_opt_local_var_macports_sources_rsync.macports.org_release_tarballs_ports_kde_kmymoney/kmymoney/work/kmymoney2-1.0.5/kmymoney2/icons/hicolor/16x16/actions'
1487:info:build make[7]: Nothing to be done for `all'.
1488:info:build make[7]: Leaving directory `/opt/local/var/macports/build/_opt_local_var_macports_sources_rsync.macports.org_release_tarballs_ports_kde_kmymoney/kmymoney/work/kmymoney2-1.0.5/kmymoney2/icons/hicolor/16x16/actions'
1489:info:build make[7]: Entering directory `/opt/local/var/macports/build/_opt_local_var_macports_sources_rsync.macports.org_release_tarballs_ports_kde_kmymoney/kmymoney/work/kmymoney2-1.0.5/kmymoney2/icons/hicolor/16x16'
1490:info:build make[7]: Nothing to be done for `all-am'.
1491:info:build make[7]: Leaving directory `/opt/local/var/macports/build/_opt_local_var_macports_sources_rsync.macports.org_release_tarballs_ports_kde_kmymoney/kmymoney/work/kmymoney2-1.0.5/kmymoney2/icons/hicolor/16x16'
1492:info:build make[6]: Leaving directory `/opt/local/var/macports/build/_opt_local_var_macports_sources_rsync.macports.org_release_tarballs_ports_kde_kmymoney/kmymoney/work/kmymoney2-1.0.5/kmymoney2/icons/hicolor/16x16'
1493:info:build Making all in 22x22
1494:info:build make[6]: Entering directory `/opt/local/var/macports/build/_opt_local_var_macports_sources_rsync.macports.org_release_tarballs_ports_kde_kmymoney/kmymoney/work/kmymoney2-1.0.5/kmymoney2/icons/hicolor/22x22'
1495:info:build Making all in actions
1496:info:build make[7]: Entering directory `/opt/local/var/macports/build/_opt_local_var_macports_sources_rsync.macports.org_release_tarballs_ports_kde_kmymoney/kmymoney/work/kmymoney2-1.0.5/kmymoney2/icons/hicolor/22x22/actions'
1497:info:build make[7]: Nothing to be done for `all'.
1498:info:build make[7]: Leaving directory `/opt/local/var/macports/build/_opt_local_var_macports_sources_rsync.macports.org_release_tarballs_ports_kde_kmymoney/kmymoney/work/kmymoney2-1.0.5/kmymoney2/icons/hicolor/22x22/actions'
1499:info:build make[7]: Entering directory `/opt/local/var/macports/build/_opt_local_var_macports_sources_rsync.macports.org_release_tarballs_ports_kde_kmymoney/kmymoney/work/kmymoney2-1.0.5/kmymoney2/icons/hicolor/22x22'
1500:info:build make[7]: Nothing to be done for `all-am'.
1501:info:build make[7]: Leaving directory `/opt/local/var/macports/build/_opt_local_var_macports_sources_rsync.macports.org_release_tarballs_ports_kde_kmymoney/kmymoney/work/kmymoney2-1.0.5/kmymoney2/icons/hicolor/22x22'
1502:info:build make[6]: Leaving directory `/opt/local/var/macports/build/_opt_local_var_macports_sources_rsync.macports.org_release_tarballs_ports_kde_kmymoney/kmymoney/work/kmymoney2-1.0.5/kmymoney2/icons/hicolor/22x22'
1503:info:build Making all in 32x32
1504:info:build make[6]: Entering directory `/opt/local/var/macports/build/_opt_local_var_macports_sources_rsync.macports.org_release_tarballs_ports_kde_kmymoney/kmymoney/work/kmymoney2-1.0.5/kmymoney2/icons/hicolor/32x32'
1505:info:build Making all in apps
1506:info:build make[7]: Entering directory `/opt/local/var/macports/build/_opt_local_var_macports_sources_rsync.macports.org_release_tarballs_ports_kde_kmymoney/kmymoney/work/kmymoney2-1.0.5/kmymoney2/icons/hicolor/32x32/apps'
1507:info:build make[7]: Nothing to be done for `all'.
1508:info:build make[7]: Leaving directory `/opt/local/var/macports/build/_opt_local_var_macports_sources_rsync.macports.org_release_tarballs_ports_kde_kmymoney/kmymoney/work/kmymoney2-1.0.5/kmymoney2/icons/hicolor/32x32/apps'
1509:info:build make[7]: Entering directory `/opt/local/var/macports/build/_opt_local_var_macports_sources_rsync.macports.org_release_tarballs_ports_kde_kmymoney/kmymoney/work/kmymoney2-1.0.5/kmymoney2/icons/hicolor/32x32'
1510:info:build make[7]: Nothing to be done for `all-am'.
1511:info:build make[7]: Leaving directory `/opt/local/var/macports/build/_opt_local_var_macports_sources_rsync.macports.org_release_tarballs_ports_kde_kmymoney/kmymoney/work/kmymoney2-1.0.5/kmymoney2/icons/hicolor/32x32'
1512:info:build make[6]: Leaving directory `/opt/local/var/macports/build/_opt_local_var_macports_sources_rsync.macports.org_release_tarballs_ports_kde_kmymoney/kmymoney/work/kmymoney2-1.0.5/kmymoney2/icons/hicolor/32x32'
1513:info:build Making all in 48x48
1514:info:build make[6]: Entering directory `/opt/local/var/macports/build/_opt_local_var_macports_sources_rsync.macports.org_release_tarballs_ports_kde_kmymoney/kmymoney/work/kmymoney2-1.0.5/kmymoney2/icons/hicolor/48x48'
1515:info:build Making all in apps
1516:info:build make[7]: Entering directory `/opt/local/var/macports/build/_opt_local_var_macports_sources_rsync.macports.org_release_tarballs_ports_kde_kmymoney/kmymoney/work/kmymoney2-1.0.5/kmymoney2/icons/hicolor/48x48/apps'
1517:info:build make[7]: Nothing to be done for `all'.
1518:info:build make[7]: Leaving directory `/opt/local/var/macports/build/_opt_local_var_macports_sources_rsync.macports.org_release_tarballs_ports_kde_kmymoney/kmymoney/work/kmymoney2-1.0.5/kmymoney2/icons/hicolor/48x48/apps'
1519:info:build make[7]: Entering directory `/opt/local/var/macports/build/_opt_local_var_macports_sources_rsync.macports.org_release_tarballs_ports_kde_kmymoney/kmymoney/work/kmymoney2-1.0.5/kmymoney2/icons/hicolor/48x48'
1520:info:build make[7]: Nothing to be done for `all-am'.
1521:info:build make[7]: Leaving directory `/opt/local/var/macports/build/_opt_local_var_macports_sources_rsync.macports.org_release_tarballs_ports_kde_kmymoney/kmymoney/work/kmymoney2-1.0.5/kmymoney2/icons/hicolor/48x48'
1522:info:build make[6]: Leaving directory `/opt/local/var/macports/build/_opt_local_var_macports_sources_rsync.macports.org_release_tarballs_ports_kde_kmymoney/kmymoney/work/kmymoney2-1.0.5/kmymoney2/icons/hicolor/48x48'
1523:info:build Making all in 64x64
1524:info:build make[6]: Entering directory `/opt/local/var/macports/build/_opt_local_var_macports_sources_rsync.macports.org_release_tarballs_ports_kde_kmymoney/kmymoney/work/kmymoney2-1.0.5/kmymoney2/icons/hicolor/64x64'
1525:info:build Making all in apps
1526:info:build make[7]: Entering directory `/opt/local/var/macports/build/_opt_local_var_macports_sources_rsync.macports.org_release_tarballs_ports_kde_kmymoney/kmymoney/work/kmymoney2-1.0.5/kmymoney2/icons/hicolor/64x64/apps'
1527:info:build make[7]: Nothing to be done for `all'.
1528:info:build make[7]: Leaving directory `/opt/local/var/macports/build/_opt_local_var_macports_sources_rsync.macports.org_release_tarballs_ports_kde_kmymoney/kmymoney/work/kmymoney2-1.0.5/kmymoney2/icons/hicolor/64x64/apps'
1529:info:build make[7]: Entering directory `/opt/local/var/macports/build/_opt_local_var_macports_sources_rsync.macports.org_release_tarballs_ports_kde_kmymoney/kmymoney/work/kmymoney2-1.0.5/kmymoney2/icons/hicolor/64x64'
1530:info:build make[7]: Nothing to be done for `all-am'.
1531:info:build make[7]: Leaving directory `/opt/local/var/macports/build/_opt_local_var_macports_sources_rsync.macports.org_release_tarballs_ports_kde_kmymoney/kmymoney/work/kmymoney2-1.0.5/kmymoney2/icons/hicolor/64x64'
1532:info:build make[6]: Leaving directory `/opt/local/var/macports/build/_opt_local_var_macports_sources_rsync.macports.org_release_tarballs_ports_kde_kmymoney/kmymoney/work/kmymoney2-1.0.5/kmymoney2/icons/hicolor/64x64'
1533:info:build make[6]: Entering directory `/opt/local/var/macports/build/_opt_local_var_macports_sources_rsync.macports.org_release_tarballs_ports_kde_kmymoney/kmymoney/work/kmymoney2-1.0.5/kmymoney2/icons/hicolor'
1534:info:build make[6]: Nothing to be done for `all-am'.
1535:info:build make[6]: Leaving directory `/opt/local/var/macports/build/_opt_local_var_macports_sources_rsync.macports.org_release_tarballs_ports_kde_kmymoney/kmymoney/work/kmymoney2-1.0.5/kmymoney2/icons/hicolor'
1536:info:build make[5]: Leaving directory `/opt/local/var/macports/build/_opt_local_var_macports_sources_rsync.macports.org_release_tarballs_ports_kde_kmymoney/kmymoney/work/kmymoney2-1.0.5/kmymoney2/icons/hicolor'
1537:info:build Making all in oxygen
1538:info:build make[5]: Entering directory `/opt/local/var/macports/build/_opt_local_var_macports_sources_rsync.macports.org_release_tarballs_ports_kde_kmymoney/kmymoney/work/kmymoney2-1.0.5/kmymoney2/icons/oxygen'
1539:info:build Making all in 16x16
1540:info:build make[6]: Entering directory `/opt/local/var/macports/build/_opt_local_var_macports_sources_rsync.macports.org_release_tarballs_ports_kde_kmymoney/kmymoney/work/kmymoney2-1.0.5/kmymoney2/icons/oxygen/16x16'
1541:info:build Making all in actions
1542:info:build make[7]: Entering directory `/opt/local/var/macports/build/_opt_local_var_macports_sources_rsync.macports.org_release_tarballs_ports_kde_kmymoney/kmymoney/work/kmymoney2-1.0.5/kmymoney2/icons/oxygen/16x16/actions'
1543:info:build make[7]: Nothing to be done for `all'.
1544:info:build make[7]: Leaving directory `/opt/local/var/macports/build/_opt_local_var_macports_sources_rsync.macports.org_release_tarballs_ports_kde_kmymoney/kmymoney/work/kmymoney2-1.0.5/kmymoney2/icons/oxygen/16x16/actions'
1545:info:build make[7]: Entering directory `/opt/local/var/macports/build/_opt_local_var_macports_sources_rsync.macports.org_release_tarballs_ports_kde_kmymoney/kmymoney/work/kmymoney2-1.0.5/kmymoney2/icons/oxygen/16x16'
1546:info:build make[7]: Nothing to be done for `all-am'.
1547:info:build make[7]: Leaving directory `/opt/local/var/macports/build/_opt_local_var_macports_sources_rsync.macports.org_release_tarballs_ports_kde_kmymoney/kmymoney/work/kmymoney2-1.0.5/kmymoney2/icons/oxygen/16x16'
1548:info:build make[6]: Leaving directory `/opt/local/var/macports/build/_opt_local_var_macports_sources_rsync.macports.org_release_tarballs_ports_kde_kmymoney/kmymoney/work/kmymoney2-1.0.5/kmymoney2/icons/oxygen/16x16'
1549:info:build Making all in 48x48
1550:info:build make[6]: Entering directory `/opt/local/var/macports/build/_opt_local_var_macports_sources_rsync.macports.org_release_tarballs_ports_kde_kmymoney/kmymoney/work/kmymoney2-1.0.5/kmymoney2/icons/oxygen/48x48'
1551:info:build Making all in apps
1552:info:build make[7]: Entering directory `/opt/local/var/macports/build/_opt_local_var_macports_sources_rsync.macports.org_release_tarballs_ports_kde_kmymoney/kmymoney/work/kmymoney2-1.0.5/kmymoney2/icons/oxygen/48x48/apps'
1553:info:build make[7]: Nothing to be done for `all'.
1554:info:build make[7]: Leaving directory `/opt/local/var/macports/build/_opt_local_var_macports_sources_rsync.macports.org_release_tarballs_ports_kde_kmymoney/kmymoney/work/kmymoney2-1.0.5/kmymoney2/icons/oxygen/48x48/apps'
1555:info:build make[7]: Entering directory `/opt/local/var/macports/build/_opt_local_var_macports_sources_rsync.macports.org_release_tarballs_ports_kde_kmymoney/kmymoney/work/kmymoney2-1.0.5/kmymoney2/icons/oxygen/48x48'
1556:info:build make[7]: Nothing to be done for `all-am'.
1557:info:build make[7]: Leaving directory `/opt/local/var/macports/build/_opt_local_var_macports_sources_rsync.macports.org_release_tarballs_ports_kde_kmymoney/kmymoney/work/kmymoney2-1.0.5/kmymoney2/icons/oxygen/48x48'
1558:info:build make[6]: Leaving directory `/opt/local/var/macports/build/_opt_local_var_macports_sources_rsync.macports.org_release_tarballs_ports_kde_kmymoney/kmymoney/work/kmymoney2-1.0.5/kmymoney2/icons/oxygen/48x48'
1559:info:build Making all in 32x32
1560:info:build make[6]: Entering directory `/opt/local/var/macports/build/_opt_local_var_macports_sources_rsync.macports.org_release_tarballs_ports_kde_kmymoney/kmymoney/work/kmymoney2-1.0.5/kmymoney2/icons/oxygen/32x32'
1561:info:build Making all in apps
1562:info:build make[7]: Entering directory `/opt/local/var/macports/build/_opt_local_var_macports_sources_rsync.macports.org_release_tarballs_ports_kde_kmymoney/kmymoney/work/kmymoney2-1.0.5/kmymoney2/icons/oxygen/32x32/apps'
1563:info:build make[7]: Nothing to be done for `all'.
1564:info:build make[7]: Leaving directory `/opt/local/var/macports/build/_opt_local_var_macports_sources_rsync.macports.org_release_tarballs_ports_kde_kmymoney/kmymoney/work/kmymoney2-1.0.5/kmymoney2/icons/oxygen/32x32/apps'
1565:info:build make[7]: Entering directory `/opt/local/var/macports/build/_opt_local_var_macports_sources_rsync.macports.org_release_tarballs_ports_kde_kmymoney/kmymoney/work/kmymoney2-1.0.5/kmymoney2/icons/oxygen/32x32'
1566:info:build make[7]: Nothing to be done for `all-am'.
1567:info:build make[7]: Leaving directory `/opt/local/var/macports/build/_opt_local_var_macports_sources_rsync.macports.org_release_tarballs_ports_kde_kmymoney/kmymoney/work/kmymoney2-1.0.5/kmymoney2/icons/oxygen/32x32'
1568:info:build make[6]: Leaving directory `/opt/local/var/macports/build/_opt_local_var_macports_sources_rsync.macports.org_release_tarballs_ports_kde_kmymoney/kmymoney/work/kmymoney2-1.0.5/kmymoney2/icons/oxygen/32x32'
1569:info:build Making all in 128x128
1570:info:build make[6]: Entering directory `/opt/local/var/macports/build/_opt_local_var_macports_sources_rsync.macports.org_release_tarballs_ports_kde_kmymoney/kmymoney/work/kmymoney2-1.0.5/kmymoney2/icons/oxygen/128x128'
1571:info:build Making all in apps
1572:info:build make[7]: Entering directory `/opt/local/var/macports/build/_opt_local_var_macports_sources_rsync.macports.org_release_tarballs_ports_kde_kmymoney/kmymoney/work/kmymoney2-1.0.5/kmymoney2/icons/oxygen/128x128/apps'
1573:info:build make[7]: Nothing to be done for `all'.
1574:info:build make[7]: Leaving directory `/opt/local/var/macports/build/_opt_local_var_macports_sources_rsync.macports.org_release_tarballs_ports_kde_kmymoney/kmymoney/work/kmymoney2-1.0.5/kmymoney2/icons/oxygen/128x128/apps'
1575:info:build make[7]: Entering directory `/opt/local/var/macports/build/_opt_local_var_macports_sources_rsync.macports.org_release_tarballs_ports_kde_kmymoney/kmymoney/work/kmymoney2-1.0.5/kmymoney2/icons/oxygen/128x128'
1576:info:build make[7]: Nothing to be done for `all-am'.
1577:info:build make[7]: Leaving directory `/opt/local/var/macports/build/_opt_local_var_macports_sources_rsync.macports.org_release_tarballs_ports_kde_kmymoney/kmymoney/work/kmymoney2-1.0.5/kmymoney2/icons/oxygen/128x128'
1578:info:build make[6]: Leaving directory `/opt/local/var/macports/build/_opt_local_var_macports_sources_rsync.macports.org_release_tarballs_ports_kde_kmymoney/kmymoney/work/kmymoney2-1.0.5/kmymoney2/icons/oxygen/128x128'
1579:info:build Making all in scalable
1580:info:build make[6]: Entering directory `/opt/local/var/macports/build/_opt_local_var_macports_sources_rsync.macports.org_release_tarballs_ports_kde_kmymoney/kmymoney/work/kmymoney2-1.0.5/kmymoney2/icons/oxygen/scalable'
1581:info:build make[6]: Nothing to be done for `all'.
1582:info:build make[6]: Leaving directory `/opt/local/var/macports/build/_opt_local_var_macports_sources_rsync.macports.org_release_tarballs_ports_kde_kmymoney/kmymoney/work/kmymoney2-1.0.5/kmymoney2/icons/oxygen/scalable'
1583:info:build Making all in 64x64
1584:info:build make[6]: Entering directory `/opt/local/var/macports/build/_opt_local_var_macports_sources_rsync.macports.org_release_tarballs_ports_kde_kmymoney/kmymoney/work/kmymoney2-1.0.5/kmymoney2/icons/oxygen/64x64'
1585:info:build Making all in apps
1586:info:build make[7]: Entering directory `/opt/local/var/macports/build/_opt_local_var_macports_sources_rsync.macports.org_release_tarballs_ports_kde_kmymoney/kmymoney/work/kmymoney2-1.0.5/kmymoney2/icons/oxygen/64x64/apps'
1587:info:build make[7]: Nothing to be done for `all'.
1588:info:build make[7]: Leaving directory `/opt/local/var/macports/build/_opt_local_var_macports_sources_rsync.macports.org_release_tarballs_ports_kde_kmymoney/kmymoney/work/kmymoney2-1.0.5/kmymoney2/icons/oxygen/64x64/apps'
1589:info:build make[7]: Entering directory `/opt/local/var/macports/build/_opt_local_var_macports_sources_rsync.macports.org_release_tarballs_ports_kde_kmymoney/kmymoney/work/kmymoney2-1.0.5/kmymoney2/icons/oxygen/64x64'
1590:info:build make[7]: Nothing to be done for `all-am'.
1591:info:build make[7]: Leaving directory `/opt/local/var/macports/build/_opt_local_var_macports_sources_rsync.macports.org_release_tarballs_ports_kde_kmymoney/kmymoney/work/kmymoney2-1.0.5/kmymoney2/icons/oxygen/64x64'
1592:info:build make[6]: Leaving directory `/opt/local/var/macports/build/_opt_local_var_macports_sources_rsync.macports.org_release_tarballs_ports_kde_kmymoney/kmymoney/work/kmymoney2-1.0.5/kmymoney2/icons/oxygen/64x64'
1593:info:build Making all in 22x22
1594:info:build make[6]: Entering directory `/opt/local/var/macports/build/_opt_local_var_macports_sources_rsync.macports.org_release_tarballs_ports_kde_kmymoney/kmymoney/work/kmymoney2-1.0.5/kmymoney2/icons/oxygen/22x22'
1595:info:build Making all in actions
1596:info:build make[7]: Entering directory `/opt/local/var/macports/build/_opt_local_var_macports_sources_rsync.macports.org_release_tarballs_ports_kde_kmymoney/kmymoney/work/kmymoney2-1.0.5/kmymoney2/icons/oxygen/22x22/actions'
1597:info:build make[7]: Nothing to be done for `all'.
1598:info:build make[7]: Leaving directory `/opt/local/var/macports/build/_opt_local_var_macports_sources_rsync.macports.org_release_tarballs_ports_kde_kmymoney/kmymoney/work/kmymoney2-1.0.5/kmymoney2/icons/oxygen/22x22/actions'
1599:info:build make[7]: Entering directory `/opt/local/var/macports/build/_opt_local_var_macports_sources_rsync.macports.org_release_tarballs_ports_kde_kmymoney/kmymoney/work/kmymoney2-1.0.5/kmymoney2/icons/oxygen/22x22'
1600:info:build make[7]: Nothing to be done for `all-am'.
1601:info:build make[7]: Leaving directory `/opt/local/var/macports/build/_opt_local_var_macports_sources_rsync.macports.org_release_tarballs_ports_kde_kmymoney/kmymoney/work/kmymoney2-1.0.5/kmymoney2/icons/oxygen/22x22'
1602:info:build make[6]: Leaving directory `/opt/local/var/macports/build/_opt_local_var_macports_sources_rsync.macports.org_release_tarballs_ports_kde_kmymoney/kmymoney/work/kmymoney2-1.0.5/kmymoney2/icons/oxygen/22x22'
1603:info:build make[6]: Entering directory `/opt/local/var/macports/build/_opt_local_var_macports_sources_rsync.macports.org_release_tarballs_ports_kde_kmymoney/kmymoney/work/kmymoney2-1.0.5/kmymoney2/icons/oxygen'
1604:info:build make[6]: Nothing to be done for `all-am'.
1605:info:build make[6]: Leaving directory `/opt/local/var/macports/build/_opt_local_var_macports_sources_rsync.macports.org_release_tarballs_ports_kde_kmymoney/kmymoney/work/kmymoney2-1.0.5/kmymoney2/icons/oxygen'
1606:info:build make[5]: Leaving directory `/opt/local/var/macports/build/_opt_local_var_macports_sources_rsync.macports.org_release_tarballs_ports_kde_kmymoney/kmymoney/work/kmymoney2-1.0.5/kmymoney2/icons/oxygen'
1607:info:build Making all in Tango
1608:info:build make[5]: Entering directory `/opt/local/var/macports/build/_opt_local_var_macports_sources_rsync.macports.org_release_tarballs_ports_kde_kmymoney/kmymoney/work/kmymoney2-1.0.5/kmymoney2/icons/Tango'
1609:info:build Making all in 16x16
1610:info:build make[6]: Entering directory `/opt/local/var/macports/build/_opt_local_var_macports_sources_rsync.macports.org_release_tarballs_ports_kde_kmymoney/kmymoney/work/kmymoney2-1.0.5/kmymoney2/icons/Tango/16x16'
1611:info:build Making all in actions
1612:info:build make[7]: Entering directory `/opt/local/var/macports/build/_opt_local_var_macports_sources_rsync.macports.org_release_tarballs_ports_kde_kmymoney/kmymoney/work/kmymoney2-1.0.5/kmymoney2/icons/Tango/16x16/actions'
1613:info:build make[7]: Nothing to be done for `all'.
1614:info:build make[7]: Leaving directory `/opt/local/var/macports/build/_opt_local_var_macports_sources_rsync.macports.org_release_tarballs_ports_kde_kmymoney/kmymoney/work/kmymoney2-1.0.5/kmymoney2/icons/Tango/16x16/actions'
1615:info:build make[7]: Entering directory `/opt/local/var/macports/build/_opt_local_var_macports_sources_rsync.macports.org_release_tarballs_ports_kde_kmymoney/kmymoney/work/kmymoney2-1.0.5/kmymoney2/icons/Tango/16x16'
1616:info:build make[7]: Nothing to be done for `all-am'.
1617:info:build make[7]: Leaving directory `/opt/local/var/macports/build/_opt_local_var_macports_sources_rsync.macports.org_release_tarballs_ports_kde_kmymoney/kmymoney/work/kmymoney2-1.0.5/kmymoney2/icons/Tango/16x16'
1618:info:build make[6]: Leaving directory `/opt/local/var/macports/build/_opt_local_var_macports_sources_rsync.macports.org_release_tarballs_ports_kde_kmymoney/kmymoney/work/kmymoney2-1.0.5/kmymoney2/icons/Tango/16x16'
1619:info:build Making all in 48x48
1620:info:build make[6]: Entering directory `/opt/local/var/macports/build/_opt_local_var_macports_sources_rsync.macports.org_release_tarballs_ports_kde_kmymoney/kmymoney/work/kmymoney2-1.0.5/kmymoney2/icons/Tango/48x48'
1621:info:build Making all in apps
1622:info:build make[7]: Entering directory `/opt/local/var/macports/build/_opt_local_var_macports_sources_rsync.macports.org_release_tarballs_ports_kde_kmymoney/kmymoney/work/kmymoney2-1.0.5/kmymoney2/icons/Tango/48x48/apps'
1623:info:build make[7]: Nothing to be done for `all'.
1624:info:build make[7]: Leaving directory `/opt/local/var/macports/build/_opt_local_var_macports_sources_rsync.macports.org_release_tarballs_ports_kde_kmymoney/kmymoney/work/kmymoney2-1.0.5/kmymoney2/icons/Tango/48x48/apps'
1625:info:build make[7]: Entering directory `/opt/local/var/macports/build/_opt_local_var_macports_sources_rsync.macports.org_release_tarballs_ports_kde_kmymoney/kmymoney/work/kmymoney2-1.0.5/kmymoney2/icons/Tango/48x48'
1626:info:build make[7]: Nothing to be done for `all-am'.
1627:info:build make[7]: Leaving directory `/opt/local/var/macports/build/_opt_local_var_macports_sources_rsync.macports.org_release_tarballs_ports_kde_kmymoney/kmymoney/work/kmymoney2-1.0.5/kmymoney2/icons/Tango/48x48'
1628:info:build make[6]: Leaving directory `/opt/local/var/macports/build/_opt_local_var_macports_sources_rsync.macports.org_release_tarballs_ports_kde_kmymoney/kmymoney/work/kmymoney2-1.0.5/kmymoney2/icons/Tango/48x48'
1629:info:build Making all in 32x32
1630:info:build make[6]: Entering directory `/opt/local/var/macports/build/_opt_local_var_macports_sources_rsync.macports.org_release_tarballs_ports_kde_kmymoney/kmymoney/work/kmymoney2-1.0.5/kmymoney2/icons/Tango/32x32'
1631:info:build Making all in apps
1632:info:build make[7]: Entering directory `/opt/local/var/macports/build/_opt_local_var_macports_sources_rsync.macports.org_release_tarballs_ports_kde_kmymoney/kmymoney/work/kmymoney2-1.0.5/kmymoney2/icons/Tango/32x32/apps'
1633:info:build make[7]: Nothing to be done for `all'.
1634:info:build make[7]: Leaving directory `/opt/local/var/macports/build/_opt_local_var_macports_sources_rsync.macports.org_release_tarballs_ports_kde_kmymoney/kmymoney/work/kmymoney2-1.0.5/kmymoney2/icons/Tango/32x32/apps'
1635:info:build make[7]: Entering directory `/opt/local/var/macports/build/_opt_local_var_macports_sources_rsync.macports.org_release_tarballs_ports_kde_kmymoney/kmymoney/work/kmymoney2-1.0.5/kmymoney2/icons/Tango/32x32'
1636:info:build make[7]: Nothing to be done for `all-am'.
1637:info:build make[7]: Leaving directory `/opt/local/var/macports/build/_opt_local_var_macports_sources_rsync.macports.org_release_tarballs_ports_kde_kmymoney/kmymoney/work/kmymoney2-1.0.5/kmymoney2/icons/Tango/32x32'
1638:info:build make[6]: Leaving directory `/opt/local/var/macports/build/_opt_local_var_macports_sources_rsync.macports.org_release_tarballs_ports_kde_kmymoney/kmymoney/work/kmymoney2-1.0.5/kmymoney2/icons/Tango/32x32'
1639:info:build Making all in 128x128
1640:info:build make[6]: Entering directory `/opt/local/var/macports/build/_opt_local_var_macports_sources_rsync.macports.org_release_tarballs_ports_kde_kmymoney/kmymoney/work/kmymoney2-1.0.5/kmymoney2/icons/Tango/128x128'
1641:info:build Making all in apps
1642:info:build make[7]: Entering directory `/opt/local/var/macports/build/_opt_local_var_macports_sources_rsync.macports.org_release_tarballs_ports_kde_kmymoney/kmymoney/work/kmymoney2-1.0.5/kmymoney2/icons/Tango/128x128/apps'
1643:info:build make[7]: Nothing to be done for `all'.
1644:info:build make[7]: Leaving directory `/opt/local/var/macports/build/_opt_local_var_macports_sources_rsync.macports.org_release_tarballs_ports_kde_kmymoney/kmymoney/work/kmymoney2-1.0.5/kmymoney2/icons/Tango/128x128/apps'
1645:info:build make[7]: Entering directory `/opt/local/var/macports/build/_opt_local_var_macports_sources_rsync.macports.org_release_tarballs_ports_kde_kmymoney/kmymoney/work/kmymoney2-1.0.5/kmymoney2/icons/Tango/128x128'
1646:info:build make[7]: Nothing to be done for `all-am'.
1647:info:build make[7]: Leaving directory `/opt/local/var/macports/build/_opt_local_var_macports_sources_rsync.macports.org_release_tarballs_ports_kde_kmymoney/kmymoney/work/kmymoney2-1.0.5/kmymoney2/icons/Tango/128x128'
1648:info:build make[6]: Leaving directory `/opt/local/var/macports/build/_opt_local_var_macports_sources_rsync.macports.org_release_tarballs_ports_kde_kmymoney/kmymoney/work/kmymoney2-1.0.5/kmymoney2/icons/Tango/128x128'
1649:info:build Making all in scalable
1650:info:build make[6]: Entering directory `/opt/local/var/macports/build/_opt_local_var_macports_sources_rsync.macports.org_release_tarballs_ports_kde_kmymoney/kmymoney/work/kmymoney2-1.0.5/kmymoney2/icons/Tango/scalable'
1651:info:build make[6]: Nothing to be done for `all'.
1652:info:build make[6]: Leaving directory `/opt/local/var/macports/build/_opt_local_var_macports_sources_rsync.macports.org_release_tarballs_ports_kde_kmymoney/kmymoney/work/kmymoney2-1.0.5/kmymoney2/icons/Tango/scalable'
1653:info:build Making all in 64x64
1654:info:build make[6]: Entering directory `/opt/local/var/macports/build/_opt_local_var_macports_sources_rsync.macports.org_release_tarballs_ports_kde_kmymoney/kmymoney/work/kmymoney2-1.0.5/kmymoney2/icons/Tango/64x64'
1655:info:build Making all in apps
1656:info:build make[7]: Entering directory `/opt/local/var/macports/build/_opt_local_var_macports_sources_rsync.macports.org_release_tarballs_ports_kde_kmymoney/kmymoney/work/kmymoney2-1.0.5/kmymoney2/icons/Tango/64x64/apps'
1657:info:build make[7]: Nothing to be done for `all'.
1658:info:build make[7]: Leaving directory `/opt/local/var/macports/build/_opt_local_var_macports_sources_rsync.macports.org_release_tarballs_ports_kde_kmymoney/kmymoney/work/kmymoney2-1.0.5/kmymoney2/icons/Tango/64x64/apps'
1659:info:build make[7]: Entering directory `/opt/local/var/macports/build/_opt_local_var_macports_sources_rsync.macports.org_release_tarballs_ports_kde_kmymoney/kmymoney/work/kmymoney2-1.0.5/kmymoney2/icons/Tango/64x64'
1660:info:build make[7]: Nothing to be done for `all-am'.
1661:info:build make[7]: Leaving directory `/opt/local/var/macports/build/_opt_local_var_macports_sources_rsync.macports.org_release_tarballs_ports_kde_kmymoney/kmymoney/work/kmymoney2-1.0.5/kmymoney2/icons/Tango/64x64'
1662:info:build make[6]: Leaving directory `/opt/local/var/macports/build/_opt_local_var_macports_sources_rsync.macports.org_release_tarballs_ports_kde_kmymoney/kmymoney/work/kmymoney2-1.0.5/kmymoney2/icons/Tango/64x64'
1663:info:build Making all in 22x22
1664:info:build make[6]: Entering directory `/opt/local/var/macports/build/_opt_local_var_macports_sources_rsync.macports.org_release_tarballs_ports_kde_kmymoney/kmymoney/work/kmymoney2-1.0.5/kmymoney2/icons/Tango/22x22'
1665:info:build Making all in actions
1666:info:build make[7]: Entering directory `/opt/local/var/macports/build/_opt_local_var_macports_sources_rsync.macports.org_release_tarballs_ports_kde_kmymoney/kmymoney/work/kmymoney2-1.0.5/kmymoney2/icons/Tango/22x22/actions'
1667:info:build make[7]: Nothing to be done for `all'.
1668:info:build make[7]: Leaving directory `/opt/local/var/macports/build/_opt_local_var_macports_sources_rsync.macports.org_release_tarballs_ports_kde_kmymoney/kmymoney/work/kmymoney2-1.0.5/kmymoney2/icons/Tango/22x22/actions'
1669:info:build make[7]: Entering directory `/opt/local/var/macports/build/_opt_local_var_macports_sources_rsync.macports.org_release_tarballs_ports_kde_kmymoney/kmymoney/work/kmymoney2-1.0.5/kmymoney2/icons/Tango/22x22'
1670:info:build make[7]: Nothing to be done for `all-am'.
1671:info:build make[7]: Leaving directory `/opt/local/var/macports/build/_opt_local_var_macports_sources_rsync.macports.org_release_tarballs_ports_kde_kmymoney/kmymoney/work/kmymoney2-1.0.5/kmymoney2/icons/Tango/22x22'
1672:info:build make[6]: Leaving directory `/opt/local/var/macports/build/_opt_local_var_macports_sources_rsync.macports.org_release_tarballs_ports_kde_kmymoney/kmymoney/work/kmymoney2-1.0.5/kmymoney2/icons/Tango/22x22'
1673:info:build make[6]: Entering directory `/opt/local/var/macports/build/_opt_local_var_macports_sources_rsync.macports.org_release_tarballs_ports_kde_kmymoney/kmymoney/work/kmymoney2-1.0.5/kmymoney2/icons/Tango'
1674:info:build make[6]: Nothing to be done for `all-am'.
1675:info:build make[6]: Leaving directory `/opt/local/var/macports/build/_opt_local_var_macports_sources_rsync.macports.org_release_tarballs_ports_kde_kmymoney/kmymoney/work/kmymoney2-1.0.5/kmymoney2/icons/Tango'
1676:info:build make[5]: Leaving directory `/opt/local/var/macports/build/_opt_local_var_macports_sources_rsync.macports.org_release_tarballs_ports_kde_kmymoney/kmymoney/work/kmymoney2-1.0.5/kmymoney2/icons/Tango'
1677:info:build make[5]: Entering directory `/opt/local/var/macports/build/_opt_local_var_macports_sources_rsync.macports.org_release_tarballs_ports_kde_kmymoney/kmymoney/work/kmymoney2-1.0.5/kmymoney2/icons'
1678:info:build make[5]: Nothing to be done for `all-am'.
1679:info:build make[5]: Leaving directory `/opt/local/var/macports/build/_opt_local_var_macports_sources_rsync.macports.org_release_tarballs_ports_kde_kmymoney/kmymoney/work/kmymoney2-1.0.5/kmymoney2/icons'
1680:info:build make[4]: Leaving directory `/opt/local/var/macports/build/_opt_local_var_macports_sources_rsync.macports.org_release_tarballs_ports_kde_kmymoney/kmymoney/work/kmymoney2-1.0.5/kmymoney2/icons'
1681:info:build Making all in html
1682:info:build make[4]: Entering directory `/opt/local/var/macports/build/_opt_local_var_macports_sources_rsync.macports.org_release_tarballs_ports_kde_kmymoney/kmymoney/work/kmymoney2-1.0.5/kmymoney2/html'
1683:info:build Making all in images
1684:info:build make[5]: Entering directory `/opt/local/var/macports/build/_opt_local_var_macports_sources_rsync.macports.org_release_tarballs_ports_kde_kmymoney/kmymoney/work/kmymoney2-1.0.5/kmymoney2/html/images'
1685:info:build make[5]: Nothing to be done for `all'.
1686:info:build make[5]: Leaving directory `/opt/local/var/macports/build/_opt_local_var_macports_sources_rsync.macports.org_release_tarballs_ports_kde_kmymoney/kmymoney/work/kmymoney2-1.0.5/kmymoney2/html/images'
1687:info:build make[5]: Entering directory `/opt/local/var/macports/build/_opt_local_var_macports_sources_rsync.macports.org_release_tarballs_ports_kde_kmymoney/kmymoney/work/kmymoney2-1.0.5/kmymoney2/html'
1688:info:build make[5]: Nothing to be done for `all-am'.
1689:info:build make[5]: Leaving directory `/opt/local/var/macports/build/_opt_local_var_macports_sources_rsync.macports.org_release_tarballs_ports_kde_kmymoney/kmymoney/work/kmymoney2-1.0.5/kmymoney2/html'
1690:info:build make[4]: Leaving directory `/opt/local/var/macports/build/_opt_local_var_macports_sources_rsync.macports.org_release_tarballs_ports_kde_kmymoney/kmymoney/work/kmymoney2-1.0.5/kmymoney2/html'
1691:info:build Making all in templates
1692:info:build make[4]: Entering directory `/opt/local/var/macports/build/_opt_local_var_macports_sources_rsync.macports.org_release_tarballs_ports_kde_kmymoney/kmymoney/work/kmymoney2-1.0.5/kmymoney2/templates'
1693:info:build Making all in C
1694:info:build make[5]: Entering directory `/opt/local/var/macports/build/_opt_local_var_macports_sources_rsync.macports.org_release_tarballs_ports_kde_kmymoney/kmymoney/work/kmymoney2-1.0.5/kmymoney2/templates/C'
1695:info:build make[5]: Nothing to be done for `all'.
1696:info:build make[5]: Leaving directory `/opt/local/var/macports/build/_opt_local_var_macports_sources_rsync.macports.org_release_tarballs_ports_kde_kmymoney/kmymoney/work/kmymoney2-1.0.5/kmymoney2/templates/C'
1697:info:build Making all in de_AT
1698:info:build make[5]: Entering directory `/opt/local/var/macports/build/_opt_local_var_macports_sources_rsync.macports.org_release_tarballs_ports_kde_kmymoney/kmymoney/work/kmymoney2-1.0.5/kmymoney2/templates/de_AT'
1699:info:build make[5]: Nothing to be done for `all'.
1700:info:build make[5]: Leaving directory `/opt/local/var/macports/build/_opt_local_var_macports_sources_rsync.macports.org_release_tarballs_ports_kde_kmymoney/kmymoney/work/kmymoney2-1.0.5/kmymoney2/templates/de_AT'
1701:info:build Making all in de_CH
1702:info:build make[5]: Entering directory `/opt/local/var/macports/build/_opt_local_var_macports_sources_rsync.macports.org_release_tarballs_ports_kde_kmymoney/kmymoney/work/kmymoney2-1.0.5/kmymoney2/templates/de_CH'
1703:info:build make[5]: Nothing to be done for `all'.
1704:info:build make[5]: Leaving directory `/opt/local/var/macports/build/_opt_local_var_macports_sources_rsync.macports.org_release_tarballs_ports_kde_kmymoney/kmymoney/work/kmymoney2-1.0.5/kmymoney2/templates/de_CH'
1705:info:build Making all in de_DE
1706:info:build make[5]: Entering directory `/opt/local/var/macports/build/_opt_local_var_macports_sources_rsync.macports.org_release_tarballs_ports_kde_kmymoney/kmymoney/work/kmymoney2-1.0.5/kmymoney2/templates/de_DE'
1707:info:build make[5]: Nothing to be done for `all'.
1708:info:build make[5]: Leaving directory `/opt/local/var/macports/build/_opt_local_var_macports_sources_rsync.macports.org_release_tarballs_ports_kde_kmymoney/kmymoney/work/kmymoney2-1.0.5/kmymoney2/templates/de_DE'
1709:info:build Making all in dk
1710:info:build make[5]: Entering directory `/opt/local/var/macports/build/_opt_local_var_macports_sources_rsync.macports.org_release_tarballs_ports_kde_kmymoney/kmymoney/work/kmymoney2-1.0.5/kmymoney2/templates/dk'
1711:info:build make[5]: Nothing to be done for `all'.
1712:info:build make[5]: Leaving directory `/opt/local/var/macports/build/_opt_local_var_macports_sources_rsync.macports.org_release_tarballs_ports_kde_kmymoney/kmymoney/work/kmymoney2-1.0.5/kmymoney2/templates/dk'
1713:info:build Making all in el_GR
1714:info:build make[5]: Entering directory `/opt/local/var/macports/build/_opt_local_var_macports_sources_rsync.macports.org_release_tarballs_ports_kde_kmymoney/kmymoney/work/kmymoney2-1.0.5/kmymoney2/templates/el_GR'
1715:info:build make[5]: Nothing to be done for `all'.
1716:info:build make[5]: Leaving directory `/opt/local/var/macports/build/_opt_local_var_macports_sources_rsync.macports.org_release_tarballs_ports_kde_kmymoney/kmymoney/work/kmymoney2-1.0.5/kmymoney2/templates/el_GR'
1717:info:build Making all in en_GB
1718:info:build make[5]: Entering directory `/opt/local/var/macports/build/_opt_local_var_macports_sources_rsync.macports.org_release_tarballs_ports_kde_kmymoney/kmymoney/work/kmymoney2-1.0.5/kmymoney2/templates/en_GB'
1719:info:build make[5]: Nothing to be done for `all'.
1720:info:build make[5]: Leaving directory `/opt/local/var/macports/build/_opt_local_var_macports_sources_rsync.macports.org_release_tarballs_ports_kde_kmymoney/kmymoney/work/kmymoney2-1.0.5/kmymoney2/templates/en_GB'
1721:info:build Making all in en_US
1722:info:build make[5]: Entering directory `/opt/local/var/macports/build/_opt_local_var_macports_sources_rsync.macports.org_release_tarballs_ports_kde_kmymoney/kmymoney/work/kmymoney2-1.0.5/kmymoney2/templates/en_US'
1723:info:build make[5]: Nothing to be done for `all'.
1724:info:build make[5]: Leaving directory `/opt/local/var/macports/build/_opt_local_var_macports_sources_rsync.macports.org_release_tarballs_ports_kde_kmymoney/kmymoney/work/kmymoney2-1.0.5/kmymoney2/templates/en_US'
1725:info:build Making all in es_AR
1726:info:build make[5]: Entering directory `/opt/local/var/macports/build/_opt_local_var_macports_sources_rsync.macports.org_release_tarballs_ports_kde_kmymoney/kmymoney/work/kmymoney2-1.0.5/kmymoney2/templates/es_AR'
1727:info:build make[5]: Nothing to be done for `all'.
1728:info:build make[5]: Leaving directory `/opt/local/var/macports/build/_opt_local_var_macports_sources_rsync.macports.org_release_tarballs_ports_kde_kmymoney/kmymoney/work/kmymoney2-1.0.5/kmymoney2/templates/es_AR'
1729:info:build Making all in es_ES
1730:info:build make[5]: Entering directory `/opt/local/var/macports/build/_opt_local_var_macports_sources_rsync.macports.org_release_tarballs_ports_kde_kmymoney/kmymoney/work/kmymoney2-1.0.5/kmymoney2/templates/es_ES'
1731:info:build make[5]: Nothing to be done for `all'.
1732:info:build make[5]: Leaving directory `/opt/local/var/macports/build/_opt_local_var_macports_sources_rsync.macports.org_release_tarballs_ports_kde_kmymoney/kmymoney/work/kmymoney2-1.0.5/kmymoney2/templates/es_ES'
1733:info:build Making all in es_MX
1734:info:build make[5]: Entering directory `/opt/local/var/macports/build/_opt_local_var_macports_sources_rsync.macports.org_release_tarballs_ports_kde_kmymoney/kmymoney/work/kmymoney2-1.0.5/kmymoney2/templates/es_MX'
1735:info:build make[5]: Nothing to be done for `all'.
1736:info:build make[5]: Leaving directory `/opt/local/var/macports/build/_opt_local_var_macports_sources_rsync.macports.org_release_tarballs_ports_kde_kmymoney/kmymoney/work/kmymoney2-1.0.5/kmymoney2/templates/es_MX'
1737:info:build Making all in fr_CA
1738:info:build make[5]: Entering directory `/opt/local/var/macports/build/_opt_local_var_macports_sources_rsync.macports.org_release_tarballs_ports_kde_kmymoney/kmymoney/work/kmymoney2-1.0.5/kmymoney2/templates/fr_CA'
1739:info:build make[5]: Nothing to be done for `all'.
1740:info:build make[5]: Leaving directory `/opt/local/var/macports/build/_opt_local_var_macports_sources_rsync.macports.org_release_tarballs_ports_kde_kmymoney/kmymoney/work/kmymoney2-1.0.5/kmymoney2/templates/fr_CA'
1741:info:build Making all in fr_CH
1742:info:build make[5]: Entering directory `/opt/local/var/macports/build/_opt_local_var_macports_sources_rsync.macports.org_release_tarballs_ports_kde_kmymoney/kmymoney/work/kmymoney2-1.0.5/kmymoney2/templates/fr_CH'
1743:info:build make[5]: Nothing to be done for `all'.
1744:info:build make[5]: Leaving directory `/opt/local/var/macports/build/_opt_local_var_macports_sources_rsync.macports.org_release_tarballs_ports_kde_kmymoney/kmymoney/work/kmymoney2-1.0.5/kmymoney2/templates/fr_CH'
1745:info:build Making all in fr_FR
1746:info:build make[5]: Entering directory `/opt/local/var/macports/build/_opt_local_var_macports_sources_rsync.macports.org_release_tarballs_ports_kde_kmymoney/kmymoney/work/kmymoney2-1.0.5/kmymoney2/templates/fr_FR'
1747:info:build make[5]: Nothing to be done for `all'.
1748:info:build make[5]: Leaving directory `/opt/local/var/macports/build/_opt_local_var_macports_sources_rsync.macports.org_release_tarballs_ports_kde_kmymoney/kmymoney/work/kmymoney2-1.0.5/kmymoney2/templates/fr_FR'
1749:info:build Making all in gl_ES
1750:info:build make[5]: Entering directory `/opt/local/var/macports/build/_opt_local_var_macports_sources_rsync.macports.org_release_tarballs_ports_kde_kmymoney/kmymoney/work/kmymoney2-1.0.5/kmymoney2/templates/gl_ES'
1751:info:build make[5]: Nothing to be done for `all'.
1752:info:build make[5]: Leaving directory `/opt/local/var/macports/build/_opt_local_var_macports_sources_rsync.macports.org_release_tarballs_ports_kde_kmymoney/kmymoney/work/kmymoney2-1.0.5/kmymoney2/templates/gl_ES'
1753:info:build Making all in hu_HU
1754:info:build make[5]: Entering directory `/opt/local/var/macports/build/_opt_local_var_macports_sources_rsync.macports.org_release_tarballs_ports_kde_kmymoney/kmymoney/work/kmymoney2-1.0.5/kmymoney2/templates/hu_HU'
1755:info:build make[5]: Nothing to be done for `all'.
1756:info:build make[5]: Leaving directory `/opt/local/var/macports/build/_opt_local_var_macports_sources_rsync.macports.org_release_tarballs_ports_kde_kmymoney/kmymoney/work/kmymoney2-1.0.5/kmymoney2/templates/hu_HU'
1757:info:build Making all in it
1758:info:build make[5]: Entering directory `/opt/local/var/macports/build/_opt_local_var_macports_sources_rsync.macports.org_release_tarballs_ports_kde_kmymoney/kmymoney/work/kmymoney2-1.0.5/kmymoney2/templates/it'
1759:info:build make[5]: Nothing to be done for `all'.
1760:info:build make[5]: Leaving directory `/opt/local/var/macports/build/_opt_local_var_macports_sources_rsync.macports.org_release_tarballs_ports_kde_kmymoney/kmymoney/work/kmymoney2-1.0.5/kmymoney2/templates/it'
1761:info:build Making all in jp
1762:info:build make[5]: Entering directory `/opt/local/var/macports/build/_opt_local_var_macports_sources_rsync.macports.org_release_tarballs_ports_kde_kmymoney/kmymoney/work/kmymoney2-1.0.5/kmymoney2/templates/jp'
1763:info:build make[5]: Nothing to be done for `all'.
1764:info:build make[5]: Leaving directory `/opt/local/var/macports/build/_opt_local_var_macports_sources_rsync.macports.org_release_tarballs_ports_kde_kmymoney/kmymoney/work/kmymoney2-1.0.5/kmymoney2/templates/jp'
1765:info:build Making all in nl_NL
1766:info:build make[5]: Entering directory `/opt/local/var/macports/build/_opt_local_var_macports_sources_rsync.macports.org_release_tarballs_ports_kde_kmymoney/kmymoney/work/kmymoney2-1.0.5/kmymoney2/templates/nl_NL'
1767:info:build make[5]: Nothing to be done for `all'.
1768:info:build make[5]: Leaving directory `/opt/local/var/macports/build/_opt_local_var_macports_sources_rsync.macports.org_release_tarballs_ports_kde_kmymoney/kmymoney/work/kmymoney2-1.0.5/kmymoney2/templates/nl_NL'
1769:info:build Making all in pt_BR
1770:info:build make[5]: Entering directory `/opt/local/var/macports/build/_opt_local_var_macports_sources_rsync.macports.org_release_tarballs_ports_kde_kmymoney/kmymoney/work/kmymoney2-1.0.5/kmymoney2/templates/pt_BR'
1771:info:build make[5]: Nothing to be done for `all'.
1772:info:build make[5]: Leaving directory `/opt/local/var/macports/build/_opt_local_var_macports_sources_rsync.macports.org_release_tarballs_ports_kde_kmymoney/kmymoney/work/kmymoney2-1.0.5/kmymoney2/templates/pt_BR'
1773:info:build Making all in pt_PT
1774:info:build make[5]: Entering directory `/opt/local/var/macports/build/_opt_local_var_macports_sources_rsync.macports.org_release_tarballs_ports_kde_kmymoney/kmymoney/work/kmymoney2-1.0.5/kmymoney2/templates/pt_PT'
1775:info:build make[5]: Nothing to be done for `all'.
1776:info:build make[5]: Leaving directory `/opt/local/var/macports/build/_opt_local_var_macports_sources_rsync.macports.org_release_tarballs_ports_kde_kmymoney/kmymoney/work/kmymoney2-1.0.5/kmymoney2/templates/pt_PT'
1777:info:build Making all in ro_RO
1778:info:build make[5]: Entering directory `/opt/local/var/macports/build/_opt_local_var_macports_sources_rsync.macports.org_release_tarballs_ports_kde_kmymoney/kmymoney/work/kmymoney2-1.0.5/kmymoney2/templates/ro_RO'
1779:info:build make[5]: Nothing to be done for `all'.
1780:info:build make[5]: Leaving directory `/opt/local/var/macports/build/_opt_local_var_macports_sources_rsync.macports.org_release_tarballs_ports_kde_kmymoney/kmymoney/work/kmymoney2-1.0.5/kmymoney2/templates/ro_RO'
1781:info:build Making all in ru_RU
1782:info:build make[5]: Entering directory `/opt/local/var/macports/build/_opt_local_var_macports_sources_rsync.macports.org_release_tarballs_ports_kde_kmymoney/kmymoney/work/kmymoney2-1.0.5/kmymoney2/templates/ru_RU'
1783:info:build make[5]: Nothing to be done for `all'.
1784:info:build make[5]: Leaving directory `/opt/local/var/macports/build/_opt_local_var_macports_sources_rsync.macports.org_release_tarballs_ports_kde_kmymoney/kmymoney/work/kmymoney2-1.0.5/kmymoney2/templates/ru_RU'
1785:info:build Making all in sk
1786:info:build make[5]: Entering directory `/opt/local/var/macports/build/_opt_local_var_macports_sources_rsync.macports.org_release_tarballs_ports_kde_kmymoney/kmymoney/work/kmymoney2-1.0.5/kmymoney2/templates/sk'
1787:info:build make[5]: Nothing to be done for `all'.
1788:info:build make[5]: Leaving directory `/opt/local/var/macports/build/_opt_local_var_macports_sources_rsync.macports.org_release_tarballs_ports_kde_kmymoney/kmymoney/work/kmymoney2-1.0.5/kmymoney2/templates/sk'
1789:info:build Making all in tr_TR
1790:info:build make[5]: Entering directory `/opt/local/var/macports/build/_opt_local_var_macports_sources_rsync.macports.org_release_tarballs_ports_kde_kmymoney/kmymoney/work/kmymoney2-1.0.5/kmymoney2/templates/tr_TR'
1791:info:build make[5]: Nothing to be done for `all'.
1792:info:build make[5]: Leaving directory `/opt/local/var/macports/build/_opt_local_var_macports_sources_rsync.macports.org_release_tarballs_ports_kde_kmymoney/kmymoney/work/kmymoney2-1.0.5/kmymoney2/templates/tr_TR'
1793:info:build Making all in zh_CN
1794:info:build make[5]: Entering directory `/opt/local/var/macports/build/_opt_local_var_macports_sources_rsync.macports.org_release_tarballs_ports_kde_kmymoney/kmymoney/work/kmymoney2-1.0.5/kmymoney2/templates/zh_CN'
1795:info:build make[5]: Nothing to be done for `all'.
1796:info:build make[5]: Leaving directory `/opt/local/var/macports/build/_opt_local_var_macports_sources_rsync.macports.org_release_tarballs_ports_kde_kmymoney/kmymoney/work/kmymoney2-1.0.5/kmymoney2/templates/zh_CN'
1797:info:build Making all in zh_HK
1798:info:build make[5]: Entering directory `/opt/local/var/macports/build/_opt_local_var_macports_sources_rsync.macports.org_release_tarballs_ports_kde_kmymoney/kmymoney/work/kmymoney2-1.0.5/kmymoney2/templates/zh_HK'
1799:info:build make[5]: Nothing to be done for `all'.
1800:info:build make[5]: Leaving directory `/opt/local/var/macports/build/_opt_local_var_macports_sources_rsync.macports.org_release_tarballs_ports_kde_kmymoney/kmymoney/work/kmymoney2-1.0.5/kmymoney2/templates/zh_HK'
1801:info:build Making all in zh_TW
1802:info:build make[5]: Entering directory `/opt/local/var/macports/build/_opt_local_var_macports_sources_rsync.macports.org_release_tarballs_ports_kde_kmymoney/kmymoney/work/kmymoney2-1.0.5/kmymoney2/templates/zh_TW'
1803:info:build make[5]: Nothing to be done for `all'.
1804:info:build make[5]: Leaving directory `/opt/local/var/macports/build/_opt_local_var_macports_sources_rsync.macports.org_release_tarballs_ports_kde_kmymoney/kmymoney/work/kmymoney2-1.0.5/kmymoney2/templates/zh_TW'
1805:info:build make[5]: Entering directory `/opt/local/var/macports/build/_opt_local_var_macports_sources_rsync.macports.org_release_tarballs_ports_kde_kmymoney/kmymoney/work/kmymoney2-1.0.5/kmymoney2/templates'
1806:info:build make[5]: Nothing to be done for `all-am'.
1807:info:build make[5]: Leaving directory `/opt/local/var/macports/build/_opt_local_var_macports_sources_rsync.macports.org_release_tarballs_ports_kde_kmymoney/kmymoney/work/kmymoney2-1.0.5/kmymoney2/templates'
1808:info:build make[4]: Leaving directory `/opt/local/var/macports/build/_opt_local_var_macports_sources_rsync.macports.org_release_tarballs_ports_kde_kmymoney/kmymoney/work/kmymoney2-1.0.5/kmymoney2/templates'
1809:info:build Making all in plugins
1810:info:build make[4]: Entering directory `/opt/local/var/macports/build/_opt_local_var_macports_sources_rsync.macports.org_release_tarballs_ports_kde_kmymoney/kmymoney/work/kmymoney2-1.0.5/kmymoney2/plugins'
1811:info:build /bin/sh ../../libtool --silent --tag=CXX   --mode=compile /usr/bin/clang++ -DHAVE_CONFIG_H -I. -I../.. -I/opt/local/include -I/opt/local/lib/qt3/include    -I../.. -I.  -DQT_THREAD_SUPPORT -I/opt/local/include -L/opt/local/lib -DKMM_DEBUG=0  -Wno-long-long -Wundef -Wall -W -Wpointer-arith -O2 -pipe -O2 -arch x86_64 -Wno-non-virtual-dtor -fno-exceptions -fno-check-new -fno-common -DQT_MAC -no-cpp-precomp -fexceptions  -MT viewinterface.lo -MD -MP -MF .deps/viewinterface.Tpo -c -o viewinterface.lo viewinterface.cpp
1812:info:build clang: warning: argument unused during compilation: '-L/opt/local/lib'
1813:info:build clang: warning: argument unused during compilation: '-fno-check-new'
1814:info:build In file included from viewinterface.cpp:27:
1815:info:build In file included from ./viewinterface.h:28:
1816:info:build In file included from /opt/local/lib/qt3/include/qobject.h:45:
1817:info:build In file included from /opt/local/lib/qt3/include/qevent.h:45:
1818:info:build In file included from /opt/local/lib/qt3/include/qmime.h:43:
1819:info:build In file included from /opt/local/lib/qt3/include/qmap.h:45:
1820:info:build /opt/local/lib/qt3/include/qpair.h:66:8: error: field has incomplete type 'MyMoneyTransaction'
1821:info:build     T1 first;
1822:info:build        ^
1823:info:build ./viewinterface.moc:166:31: note: in instantiation of template class 'QPair<MyMoneyTransaction, MyMoneySplit>' requested here
1824:info:build     static_QUType_ptr.set(o+5,&t4);
1825:info:build                               ^
1826:info:build ../../kmymoney/mymoneyaccount.h:43:7: note: forward declaration of 'MyMoneyTransaction'
1827:info:build class MyMoneyTransaction;
1828:info:build       ^
1829:info:build In file included from viewinterface.cpp:27:
1830:info:build In file included from ./viewinterface.h:28:
1831:info:build In file included from /opt/local/lib/qt3/include/qobject.h:45:
1832:info:build In file included from /opt/local/lib/qt3/include/qevent.h:45:
1833:info:build In file included from /opt/local/lib/qt3/include/qmime.h:43:
1834:info:build In file included from /opt/local/lib/qt3/include/qmap.h:45:
1835:info:build /opt/local/lib/qt3/include/qpair.h:67:8: error: field has incomplete type 'MyMoneySplit'
1836:info:build     T2 second;
1837:info:build        ^
1838:info:build ../../kmymoney/mymoneyaccount.h:45:7: note: forward declaration of 'MyMoneySplit'
1839:info:build class MyMoneySplit;
1840:info:build       ^
1841:info:build 2 errors generated.
1842:info:build make[4]: *** [viewinterface.lo] Error 1
1843:info:build make[4]: Leaving directory `/opt/local/var/macports/build/_opt_local_var_macports_sources_rsync.macports.org_release_tarballs_ports_kde_kmymoney/kmymoney/work/kmymoney2-1.0.5/kmymoney2/plugins'
1844:info:build make[3]: *** [all-recursive] Error 1
1845:info:build make[3]: Leaving directory `/opt/local/var/macports/build/_opt_local_var_macports_sources_rsync.macports.org_release_tarballs_ports_kde_kmymoney/kmymoney/work/kmymoney2-1.0.5/kmymoney2'
1846:info:build make[2]: *** [all] Error 2
1847:info:build make[2]: Leaving directory `/opt/local/var/macports/build/_opt_local_var_macports_sources_rsync.macports.org_release_tarballs_ports_kde_kmymoney/kmymoney/work/kmymoney2-1.0.5/kmymoney2'
1848:info:build make[1]: *** [all-recursive] Error 1
1849:info:build make[1]: Leaving directory `/opt/local/var/macports/build/_opt_local_var_macports_sources_rsync.macports.org_release_tarballs_ports_kde_kmymoney/kmymoney/work/kmymoney2-1.0.5'
1850:info:build make: *** [all] Error 2
1851:info:build make: Leaving directory `/opt/local/var/macports/build/_opt_local_var_macports_sources_rsync.macports.org_release_tarballs_ports_kde_kmymoney/kmymoney/work/kmymoney2-1.0.5'
1852:info:build Command failed:  cd "/opt/local/var/macports/build/_opt_local_var_macports_sources_rsync.macports.org_release_tarballs_ports_kde_kmymoney/kmymoney/work/kmymoney2-1.0.5" && /usr/bin/make -j4 -w all
1853:info:build Exit code: 2
1854:error:build org.macports.build for port kmymoney returned: command execution failed
1855:debug:build Error code: CHILDSTATUS 24433 2
1856:debug:build Backtrace: command execution failed
1857    while executing
1858"system -nice 0 $fullcmdstring"
1859    ("eval" body line 1)
1860    invoked from within
1861"eval system $notty $nice \$fullcmdstring"
1862    invoked from within
1863"command_exec build"
1864    (procedure "portbuild::build_main" line 8)
1865    invoked from within
1866"$procedure $targetname"
1867:info:build Warning: targets not executed for kmymoney: org.macports.activate org.macports.build org.macports.destroot org.macports.install
1868:notice:build Please see the log file for port kmymoney for details:
1869    /opt/local/var/macports/logs/_opt_local_var_macports_sources_rsync.macports.org_release_tarballs_ports_kde_kmymoney/kmymoney/main.log