Ticket #37554: doxygen.log

File doxygen.log, 27.9 KB (added by ci42, 8 years ago)
Line 
1--->  Computing dependencies for doxygen:info:clean .:debug:clean doxygen has no conflicts
2DEBUG: Searching for dependency: perl5
3DEBUG: Found Dependency: receipt exists for perl5
4DEBUG: Searching for dependency: flex
5DEBUG: Found Dependency: receipt exists for flex
6DEBUG: Searching for dependency: bison
7DEBUG: Found Dependency: receipt exists for bison
8DEBUG: Searching for dependency: libpng
9DEBUG: Found Dependency: receipt exists for libpng
10DEBUG: Searching for dependency: graphviz
11DEBUG: Found Dependency: receipt exists for graphviz
12DEBUG: Searching for dependency: libiconv
13DEBUG: Found Dependency: receipt exists for libiconv
14
15DEBUG: Executing org.macports.main (doxygen)
16DEBUG: changing euid/egid - current euid: 0 - current egid: 0
17DEBUG: egid changed to: 501
18DEBUG: euid changed to: 502
19DEBUG: archivefetch phase started at Sun Jan  6 23:20:37 CET 2013
20--->  Fetching archive for doxygen
21DEBUG: Executing org.macports.archivefetch (doxygen)
22DEBUG: euid/egid changed to: 0/0
23DEBUG: chowned /opt/local/var/macports/incoming to macports
24DEBUG: euid/egid changed to: 502/501
25--->  doxygen-1.8.3_2.darwin_11.x86_64.tbz2 doesn't seem to exist in /opt/local/var/macports/incoming/verified
26--->  Attempting to fetch doxygen-1.8.3_2.darwin_11.x86_64.tbz2 from http://mse.uk.packages.macports.org/sites/packages.macports.org/doxygen
27DEBUG: Fetching archive failed:: The requested URL returned error: 404
28--->  Attempting to fetch doxygen-1.8.3_2.darwin_11.x86_64.tbz2 from http://lil.fr.packages.macports.org/doxygen
29DEBUG: Fetching archive failed:: The requested URL returned error: 404
30--->  Attempting to fetch doxygen-1.8.3_2.darwin_11.x86_64.tbz2 from http://packages.macports.org/doxygen
31DEBUG: Fetching archive failed:: The requested URL returned error: 404
32--->  Attempting to fetch doxygen-1.8.3_2.darwin_11.x86_64.tbz2 from http://jog.id.packages.macports.org/macports/packages/doxygen
33DEBUG: Fetching archive failed:: The requested URL returned error: 404
34DEBUG: Privilege de-escalation not attempted as not running as root.
35DEBUG: fetch phase started at Sun Jan  6 23:20:39 CET 2013
36--->  Fetching distfiles for doxygen
37DEBUG: Executing org.macports.fetch (doxygen)
38--->  doxygen-1.8.3.src.tar.gz doesn't seem to exist in /opt/local/var/macports/distfiles/doxygen
39--->  Attempting to fetch doxygen-1.8.3.src.tar.gz from http://fco.it.distfiles.macports.org/mirrors/macports-distfiles/doxygen
40DEBUG: Privilege de-escalation not attempted as not running as root.
41DEBUG: checksum phase started at Sun Jan  6 23:20:47 CET 2013
42--->  Verifying checksum(s) for doxygen
43DEBUG: Executing org.macports.checksum (doxygen)
44--->  Checksumming doxygen-1.8.3.src.tar.gz
45DEBUG: Correct (md5) checksum for doxygen-1.8.3.src.tar.gz
46DEBUG: Correct (sha1) checksum for doxygen-1.8.3.src.tar.gz
47DEBUG: Correct (rmd160) checksum for doxygen-1.8.3.src.tar.gz
48DEBUG: Privilege de-escalation not attempted as not running as root.
49DEBUG: extract phase started at Sun Jan  6 23:20:47 CET 2013
50--->  Extracting doxygen
51DEBUG: Executing org.macports.extract (doxygen)
52--->  Extracting doxygen-1.8.3.src.tar.gz
53DEBUG: setting option extract.args to '/opt/local/var/macports/distfiles/doxygen/doxygen-1.8.3.src.tar.gz'
54DEBUG: Environment: CPATH='/opt/local/include' CC_PRINT_OPTIONS_FILE='/opt/local/var/macports/build/_Users_ci_devel_repos_macports_trunk_dports_textproc_doxygen/doxygen/work/.CC_PRINT_OPTIONS' LIBRARY_PATH='/opt/local/lib' CC_PRINT_OPTIONS='YES' MACOSX_DEPLOYMENT_TARGET='10.7'
55DEBUG: Assembled command: 'cd "/opt/local/var/macports/build/_Users_ci_devel_repos_macports_trunk_dports_textproc_doxygen/doxygen/work" && /usr/bin/gzip -dc '/opt/local/var/macports/distfiles/doxygen/doxygen-1.8.3.src.tar.gz' | /usr/bin/gnutar --no-same-owner -xf -'
56DEBUG: Executing command line:  cd "/opt/local/var/macports/build/_Users_ci_devel_repos_macports_trunk_dports_textproc_doxygen/doxygen/work" && /usr/bin/gzip -dc '/opt/local/var/macports/distfiles/doxygen/doxygen-1.8.3.src.tar.gz' | /usr/bin/gnutar --no-same-owner -xf -
57DEBUG: euid/egid changed to: 0/0
58DEBUG: chowned /opt/local/var/macports/build/_Users_ci_devel_repos_macports_trunk_dports_textproc_doxygen/doxygen/work to macports
59DEBUG: euid/egid changed to: 502/501
60DEBUG: Executing proc-post-org.macports.extract-extract-0
61DEBUG: Privilege de-escalation not attempted as not running as root.
62DEBUG: patch phase started at Sun Jan  6 23:20:48 CET 2013
63DEBUG: Executing org.macports.patch (doxygen)
64DEBUG: Executing proc-post-org.macports.patch-patch-0
65DEBUG: Executing reinplace: /usr/bin/sed {/^TMAKE_CC[[:space:]]/s%=.*%= /usr/bin/clang -I/opt/local/include -arch x86_64%} < /opt/local/var/macports/build/_Users_ci_devel_repos_macports_trunk_dports_textproc_doxygen/doxygen/work/doxygen-1.8.3/tmake/lib/macosx-c++/tmake.conf >@ file11
66DEBUG: euid/egid changed to: 0/0
67DEBUG: chowned /opt/local/var/macports/build/_Users_ci_devel_repos_macports_trunk_dports_textproc_doxygen/doxygen/work/doxygen-1.8.3/tmake/lib/macosx-c++/tmake.conf to macports
68DEBUG: euid/egid changed to: 502/501
69DEBUG: euid/egid changed to: 0/0
70DEBUG: setting attributes on /opt/local/var/macports/build/_Users_ci_devel_repos_macports_trunk_dports_textproc_doxygen/doxygen/work/doxygen-1.8.3/tmake/lib/macosx-c++/tmake.conf
71DEBUG: euid/egid changed to: 502/501
72DEBUG: Executing reinplace: /usr/bin/sed {/^TMAKE_CXX[[:space:]]/s%=.*%= /usr/bin/clang++ -I/opt/local/include -arch x86_64%} < /opt/local/var/macports/build/_Users_ci_devel_repos_macports_trunk_dports_textproc_doxygen/doxygen/work/doxygen-1.8.3/tmake/lib/macosx-c++/tmake.conf >@ file11
73DEBUG: euid/egid changed to: 0/0
74DEBUG: chowned /opt/local/var/macports/build/_Users_ci_devel_repos_macports_trunk_dports_textproc_doxygen/doxygen/work/doxygen-1.8.3/tmake/lib/macosx-c++/tmake.conf to macports
75DEBUG: euid/egid changed to: 502/501
76DEBUG: euid/egid changed to: 0/0
77DEBUG: setting attributes on /opt/local/var/macports/build/_Users_ci_devel_repos_macports_trunk_dports_textproc_doxygen/doxygen/work/doxygen-1.8.3/tmake/lib/macosx-c++/tmake.conf
78DEBUG: euid/egid changed to: 502/501
79DEBUG: Executing reinplace: /usr/bin/sed {/^TMAKE_LINK[[:space:]]/s%=.*%= /usr/bin/clang++ -L/opt/local/lib -arch x86_64%} < /opt/local/var/macports/build/_Users_ci_devel_repos_macports_trunk_dports_textproc_doxygen/doxygen/work/doxygen-1.8.3/tmake/lib/macosx-c++/tmake.conf >@ file11
80DEBUG: euid/egid changed to: 0/0
81DEBUG: chowned /opt/local/var/macports/build/_Users_ci_devel_repos_macports_trunk_dports_textproc_doxygen/doxygen/work/doxygen-1.8.3/tmake/lib/macosx-c++/tmake.conf to macports
82DEBUG: euid/egid changed to: 502/501
83DEBUG: euid/egid changed to: 0/0
84DEBUG: setting attributes on /opt/local/var/macports/build/_Users_ci_devel_repos_macports_trunk_dports_textproc_doxygen/doxygen/work/doxygen-1.8.3/tmake/lib/macosx-c++/tmake.conf
85DEBUG: euid/egid changed to: 502/501
86DEBUG: Executing reinplace: /usr/bin/sed {/^TMAKE_LINK_SHLIB[[:space:]]/s%=.*%= /usr/bin/clang++ -arch x86_64%} < /opt/local/var/macports/build/_Users_ci_devel_repos_macports_trunk_dports_textproc_doxygen/doxygen/work/doxygen-1.8.3/tmake/lib/macosx-c++/tmake.conf >@ file11
87DEBUG: euid/egid changed to: 0/0
88DEBUG: chowned /opt/local/var/macports/build/_Users_ci_devel_repos_macports_trunk_dports_textproc_doxygen/doxygen/work/doxygen-1.8.3/tmake/lib/macosx-c++/tmake.conf to macports
89DEBUG: euid/egid changed to: 502/501
90DEBUG: euid/egid changed to: 0/0
91DEBUG: setting attributes on /opt/local/var/macports/build/_Users_ci_devel_repos_macports_trunk_dports_textproc_doxygen/doxygen/work/doxygen-1.8.3/tmake/lib/macosx-c++/tmake.conf
92DEBUG: euid/egid changed to: 502/501
93DEBUG: Executing reinplace: /usr/bin/sed {s|$(DESTDIR)/|$(DESTDIR)|g} < /opt/local/var/macports/build/_Users_ci_devel_repos_macports_trunk_dports_textproc_doxygen/doxygen/work/doxygen-1.8.3/Makefile.in >@ file11
94DEBUG: euid/egid changed to: 0/0
95DEBUG: chowned /opt/local/var/macports/build/_Users_ci_devel_repos_macports_trunk_dports_textproc_doxygen/doxygen/work/doxygen-1.8.3/Makefile.in to macports
96DEBUG: euid/egid changed to: 502/501
97DEBUG: euid/egid changed to: 0/0
98DEBUG: setting attributes on /opt/local/var/macports/build/_Users_ci_devel_repos_macports_trunk_dports_textproc_doxygen/doxygen/work/doxygen-1.8.3/Makefile.in
99DEBUG: euid/egid changed to: 502/501
100DEBUG: Executing reinplace: /usr/bin/sed s|-lmd5|../lib/libmd5.a| < /opt/local/var/macports/build/_Users_ci_devel_repos_macports_trunk_dports_textproc_doxygen/doxygen/work/doxygen-1.8.3/src/doxygen.pro.in >@ file11
101DEBUG: euid/egid changed to: 0/0
102DEBUG: chowned /opt/local/var/macports/build/_Users_ci_devel_repos_macports_trunk_dports_textproc_doxygen/doxygen/work/doxygen-1.8.3/src/doxygen.pro.in to macports
103DEBUG: euid/egid changed to: 502/501
104DEBUG: euid/egid changed to: 0/0
105DEBUG: setting attributes on /opt/local/var/macports/build/_Users_ci_devel_repos_macports_trunk_dports_textproc_doxygen/doxygen/work/doxygen-1.8.3/src/doxygen.pro.in
106DEBUG: euid/egid changed to: 502/501
107DEBUG: Executing reinplace: /usr/bin/sed {s,-n "`$j/$i --version 2>/dev/null | grep utils`",-x "$j/$i",g} < /opt/local/var/macports/build/_Users_ci_devel_repos_macports_trunk_dports_textproc_doxygen/doxygen/work/doxygen-1.8.3/configure >@ file11
108DEBUG: euid/egid changed to: 0/0
109DEBUG: chowned /opt/local/var/macports/build/_Users_ci_devel_repos_macports_trunk_dports_textproc_doxygen/doxygen/work/doxygen-1.8.3/configure to macports
110DEBUG: euid/egid changed to: 502/501
111DEBUG: euid/egid changed to: 0/0
112DEBUG: setting attributes on /opt/local/var/macports/build/_Users_ci_devel_repos_macports_trunk_dports_textproc_doxygen/doxygen/work/doxygen-1.8.3/configure
113DEBUG: euid/egid changed to: 502/501
114DEBUG: Executing reinplace: /usr/bin/sed s|-Wno-invalid-source-encoding||g < /opt/local/var/macports/build/_Users_ci_devel_repos_macports_trunk_dports_textproc_doxygen/doxygen/work/doxygen-1.8.3/libmd5/Makefile.libmd5 >@ file11
115DEBUG: euid/egid changed to: 0/0
116DEBUG: chowned /opt/local/var/macports/build/_Users_ci_devel_repos_macports_trunk_dports_textproc_doxygen/doxygen/work/doxygen-1.8.3/libmd5/Makefile.libmd5 to macports
117DEBUG: euid/egid changed to: 502/501
118DEBUG: euid/egid changed to: 0/0
119DEBUG: setting attributes on /opt/local/var/macports/build/_Users_ci_devel_repos_macports_trunk_dports_textproc_doxygen/doxygen/work/doxygen-1.8.3/libmd5/Makefile.libmd5
120DEBUG: euid/egid changed to: 502/501
121DEBUG: Executing reinplace: /usr/bin/sed s|-Wno-invalid-source-encoding||g < /opt/local/var/macports/build/_Users_ci_devel_repos_macports_trunk_dports_textproc_doxygen/doxygen/work/doxygen-1.8.3/src/Makefile.libdoxycfg >@ file11
122DEBUG: euid/egid changed to: 0/0
123DEBUG: chowned /opt/local/var/macports/build/_Users_ci_devel_repos_macports_trunk_dports_textproc_doxygen/doxygen/work/doxygen-1.8.3/src/Makefile.libdoxycfg to macports
124DEBUG: euid/egid changed to: 502/501
125DEBUG: euid/egid changed to: 0/0
126DEBUG: setting attributes on /opt/local/var/macports/build/_Users_ci_devel_repos_macports_trunk_dports_textproc_doxygen/doxygen/work/doxygen-1.8.3/src/Makefile.libdoxycfg
127DEBUG: euid/egid changed to: 502/501
128DEBUG: Executing reinplace: /usr/bin/sed s|-Wno-invalid-source-encoding||g < /opt/local/var/macports/build/_Users_ci_devel_repos_macports_trunk_dports_textproc_doxygen/doxygen/work/doxygen-1.8.3/tmake/lib/macosx-c++/tmake.conf >@ file11
129DEBUG: euid/egid changed to: 0/0
130DEBUG: chowned /opt/local/var/macports/build/_Users_ci_devel_repos_macports_trunk_dports_textproc_doxygen/doxygen/work/doxygen-1.8.3/tmake/lib/macosx-c++/tmake.conf to macports
131DEBUG: euid/egid changed to: 502/501
132DEBUG: euid/egid changed to: 0/0
133DEBUG: setting attributes on /opt/local/var/macports/build/_Users_ci_devel_repos_macports_trunk_dports_textproc_doxygen/doxygen/work/doxygen-1.8.3/tmake/lib/macosx-c++/tmake.conf
134DEBUG: euid/egid changed to: 502/501
135DEBUG: Executing reinplace: /usr/bin/sed s|-Wno-invalid-source-encoding||g < /opt/local/var/macports/build/_Users_ci_devel_repos_macports_trunk_dports_textproc_doxygen/doxygen/work/doxygen-1.8.3/tmake/lib/macosx-intel-c++/tmake.conf >@ file11
136DEBUG: euid/egid changed to: 0/0
137DEBUG: chowned /opt/local/var/macports/build/_Users_ci_devel_repos_macports_trunk_dports_textproc_doxygen/doxygen/work/doxygen-1.8.3/tmake/lib/macosx-intel-c++/tmake.conf to macports
138DEBUG: euid/egid changed to: 502/501
139DEBUG: euid/egid changed to: 0/0
140DEBUG: setting attributes on /opt/local/var/macports/build/_Users_ci_devel_repos_macports_trunk_dports_textproc_doxygen/doxygen/work/doxygen-1.8.3/tmake/lib/macosx-intel-c++/tmake.conf
141DEBUG: euid/egid changed to: 502/501
142DEBUG: Executing reinplace: /usr/bin/sed s|-Wno-invalid-source-encoding||g < /opt/local/var/macports/build/_Users_ci_devel_repos_macports_trunk_dports_textproc_doxygen/doxygen/work/doxygen-1.8.3/tmake/lib/macosx-uni-c++/tmake.conf >@ file11
143DEBUG: euid/egid changed to: 0/0
144DEBUG: chowned /opt/local/var/macports/build/_Users_ci_devel_repos_macports_trunk_dports_textproc_doxygen/doxygen/work/doxygen-1.8.3/tmake/lib/macosx-uni-c++/tmake.conf to macports
145DEBUG: euid/egid changed to: 502/501
146DEBUG: euid/egid changed to: 0/0
147DEBUG: setting attributes on /opt/local/var/macports/build/_Users_ci_devel_repos_macports_trunk_dports_textproc_doxygen/doxygen/work/doxygen-1.8.3/tmake/lib/macosx-uni-c++/tmake.conf
148DEBUG: euid/egid changed to: 502/501
149DEBUG: Privilege de-escalation not attempted as not running as root.
150DEBUG: configure phase started at Sun Jan  6 23:20:48 CET 2013
151--->  Configuring doxygen
152DEBUG: Using compiler 'Mac OS X clang'
153DEBUG: Executing org.macports.configure (doxygen)
154DEBUG: Environment: CPATH='/opt/local/include' CFLAGS='-pipe -O2 -arch x86_64' CPPFLAGS='-I/opt/local/include' CXXFLAGS='-pipe -O2 -arch x86_64' LIBRARY_PATH='/opt/local/lib' MACOSX_DEPLOYMENT_TARGET='10.7' CXX='/usr/bin/clang++' CC_PRINT_OPTIONS_FILE='/opt/local/var/macports/build/_Users_ci_devel_repos_macports_trunk_dports_textproc_doxygen/doxygen/work/.CC_PRINT_OPTIONS' F90FLAGS='-pipe -O2 -m64' LDFLAGS='-L/opt/local/lib -arch x86_64' OBJC='/usr/bin/clang' FCFLAGS='-pipe -O2 -m64' INSTALL='/usr/bin/install -c' OBJCFLAGS='-pipe -O2 -arch x86_64' FFLAGS='-pipe -O2 -m64' CC_PRINT_OPTIONS='YES' CC='/usr/bin/clang'
155DEBUG: Assembled command: 'cd "/opt/local/var/macports/build/_Users_ci_devel_repos_macports_trunk_dports_textproc_doxygen/doxygen/work/doxygen-1.8.3" && ./configure --prefix /opt/local --docdir /opt/local/share/doc --dot /opt/local/bin/dot --platform macosx-c++'
156DEBUG: Executing command line:  cd "/opt/local/var/macports/build/_Users_ci_devel_repos_macports_trunk_dports_textproc_doxygen/doxygen/work/doxygen-1.8.3" && ./configure --prefix /opt/local --docdir /opt/local/share/doc --dot /opt/local/bin/dot --platform macosx-c++
157-n   Checking for platform macosx-c++...
158supported
159-n   Checking for GNU make tool...
160using /usr/bin/make
161-n   Checking for GNU install tool...
162using /opt/local/bin/ginstall
163-n   Checking for dot (part of GraphViz)...
164using /opt/local/bin/dot
165-n   Checking for perl...
166using /opt/local/bin/perl
167-n   Checking for flex...
168using /opt/local/bin/flex
169-n   Checking for bison...
170using /opt/local/bin/bison
171  Creating VERSION file.
172  Created doxygen.spec file, for rpm generation.
173  Created Makefile from Makefile.in...
174  Created qtools/Makefile from qtools/Makefile.in...
175  Created src/Makefile from src/Makefile.in...
176  Created examples/Makefile from examples/Makefile.in...
177  Created doc/Makefile from doc/Makefile.in...
178  Created addon/doxywizard/Makefile from addon/doxywizard/Makefile.in...
179  Created addon/doxmlparser/src/Makefile from addon/doxmlparser/src/Makefile.in...
180  Created addon/doxmlparser/test/Makefile from addon/doxmlparser/test/Makefile.in...
181  Created addon/doxmlparser/examples/metrics/Makefile from addon/doxmlparser/examples/metrics/Makefile.in...
182  Created libmd5/Makefile from libmd5/Makefile.in...
183  Created addon/doxyapp/Makefile from addon/doxyapp/Makefile.in...
184  Created addon/doxysearch/Makefile from addon/doxysearch/Makefile.in...
185  Created qtools/qtools.pro from qtools/qtools.pro.in...
186  Created src/libdoxygen.pro from src/libdoxygen.pro.in...
187  Created src/libdoxycfg.pro from src/libdoxycfg.pro.in...
188  Created src/doxygen.pro from src/doxygen.pro.in...
189  Created addon/doxywizard/doxywizard.pro from addon/doxywizard/doxywizard.pro.in...
190  Created addon/doxmlparser/src/doxmlparser.pro from addon/doxmlparser/src/doxmlparser.pro.in...
191  Created addon/doxmlparser/test/xmlparse.pro from addon/doxmlparser/test/xmlparse.pro.in...
192  Created addon/doxmlparser/examples/metrics/metrics.pro from addon/doxmlparser/examples/metrics/metrics.pro.in...
193  Created libmd5/libmd5.pro from libmd5/libmd5.pro.in...
194  Created addon/doxyapp/doxyapp.pro from addon/doxyapp/doxyapp.pro.in...
195  Created addon/doxysearch/doxysearch.pro from addon/doxysearch/doxysearch.pro.in...
196  Created addon/doxysearch/doxyindexer.pro from addon/doxysearch/doxyindexer.pro.in...
197-n   Generating src/lang_cfg.h...
198
199DEBUG: Privilege de-escalation not attempted as not running as root.
200DEBUG: build phase started at Sun Jan  6 23:20:48 CET 2013
201--->  Building doxygen
202DEBUG: Executing org.macports.build (doxygen)
203DEBUG: Environment: CPATH='/opt/local/include' CC_PRINT_OPTIONS_FILE='/opt/local/var/macports/build/_Users_ci_devel_repos_macports_trunk_dports_textproc_doxygen/doxygen/work/.CC_PRINT_OPTIONS' LIBRARY_PATH='/opt/local/lib' CC_PRINT_OPTIONS='YES' MACOSX_DEPLOYMENT_TARGET='10.7'
204DEBUG: Assembled command: 'cd "/opt/local/var/macports/build/_Users_ci_devel_repos_macports_trunk_dports_textproc_doxygen/doxygen/work/doxygen-1.8.3" && /usr/bin/make -j8 -w all'
205DEBUG: Executing command line:  cd "/opt/local/var/macports/build/_Users_ci_devel_repos_macports_trunk_dports_textproc_doxygen/doxygen/work/doxygen-1.8.3" && /usr/bin/make -j8 -w all
206make: Entering directory `/opt/local/var/macports/build/_Users_ci_devel_repos_macports_trunk_dports_textproc_doxygen/doxygen/work/doxygen-1.8.3'
207echo "char versionString[]=\"1.8.3\";" > src/version.cpp
208/usr/bin/make -C qtools
209make[1]: Entering directory `/opt/local/var/macports/build/_Users_ci_devel_repos_macports_trunk_dports_textproc_doxygen/doxygen/work/doxygen-1.8.3/qtools'
210env TMAKEPATH=/opt/local/var/macports/build/_Users_ci_devel_repos_macports_trunk_dports_textproc_doxygen/doxygen/work/doxygen-1.8.3/tmake/lib/macosx-c++ /opt/local/bin/perl /opt/local/var/macports/build/_Users_ci_devel_repos_macports_trunk_dports_textproc_doxygen/doxygen/work/doxygen-1.8.3/tmake/bin/tmake qtools.pro >Makefile.qtools
211/usr/bin/make -f Makefile.qtools    all
212make[2]: Entering directory `/opt/local/var/macports/build/_Users_ci_devel_repos_macports_trunk_dports_textproc_doxygen/doxygen/work/doxygen-1.8.3/qtools'
213/usr/bin/clang++ -I/opt/local/include -arch x86_64 -c -pipe -D__FreeBSD__=6 -DYY_TYPEDEF_YY_SIZE_T -Dyy_size_t=int -DQT_LITE_UNICODE -Wall -W -Wno-deprecated-declarations -O2 -I. -o ../objects/qbuffer.o qbuffer.cpp
214/usr/bin/clang++ -I/opt/local/include -arch x86_64 -c -pipe -D__FreeBSD__=6 -DYY_TYPEDEF_YY_SIZE_T -Dyy_size_t=int -DQT_LITE_UNICODE -Wall -W -Wno-deprecated-declarations -O2 -I. -o ../objects/qcollection.o qcollection.cpp
215/usr/bin/clang++ -I/opt/local/include -arch x86_64 -c -pipe -D__FreeBSD__=6 -DYY_TYPEDEF_YY_SIZE_T -Dyy_size_t=int -DQT_LITE_UNICODE -Wall -W -Wno-deprecated-declarations -O2 -I. -o ../objects/scstring.o scstring.cpp
216/usr/bin/clang++ -I/opt/local/include -arch x86_64 -c -pipe -D__FreeBSD__=6 -DYY_TYPEDEF_YY_SIZE_T -Dyy_size_t=int -DQT_LITE_UNICODE -Wall -W -Wno-deprecated-declarations -O2 -I. -o ../objects/qdatastream.o qdatastream.cpp
217/usr/bin/clang++ -I/opt/local/include -arch x86_64 -c -pipe -D__FreeBSD__=6 -DYY_TYPEDEF_YY_SIZE_T -Dyy_size_t=int -DQT_LITE_UNICODE -Wall -W -Wno-deprecated-declarations -O2 -I. -o ../objects/qdatetime.o qdatetime.cpp
218/usr/bin/clang++ -I/opt/local/include -arch x86_64 -c -pipe -D__FreeBSD__=6 -DYY_TYPEDEF_YY_SIZE_T -Dyy_size_t=int -DQT_LITE_UNICODE -Wall -W -Wno-deprecated-declarations -O2 -I. -o ../objects/qdir.o qdir.cpp
219/usr/bin/clang++ -I/opt/local/include -arch x86_64 -c -pipe -D__FreeBSD__=6 -DYY_TYPEDEF_YY_SIZE_T -Dyy_size_t=int -DQT_LITE_UNICODE -Wall -W -Wno-deprecated-declarations -O2 -I. -o ../objects/qfile.o qfile.cpp
220/usr/bin/clang++ -I/opt/local/include -arch x86_64 -c -pipe -D__FreeBSD__=6 -DYY_TYPEDEF_YY_SIZE_T -Dyy_size_t=int -DQT_LITE_UNICODE -Wall -W -Wno-deprecated-declarations -O2 -I. -o ../objects/qfileinfo.o qfileinfo.cpp
221/usr/bin/clang++ -I/opt/local/include -arch x86_64 -c -pipe -D__FreeBSD__=6 -DYY_TYPEDEF_YY_SIZE_T -Dyy_size_t=int -DQT_LITE_UNICODE -Wall -W -Wno-deprecated-declarations -O2 -I. -o ../objects/qgarray.o qgarray.cpp
222/usr/bin/clang++ -I/opt/local/include -arch x86_64 -c -pipe -D__FreeBSD__=6 -DYY_TYPEDEF_YY_SIZE_T -Dyy_size_t=int -DQT_LITE_UNICODE -Wall -W -Wno-deprecated-declarations -O2 -I. -o ../objects/qgcache.o qgcache.cpp
223/usr/bin/clang++ -I/opt/local/include -arch x86_64 -c -pipe -D__FreeBSD__=6 -DYY_TYPEDEF_YY_SIZE_T -Dyy_size_t=int -DQT_LITE_UNICODE -Wall -W -Wno-deprecated-declarations -O2 -I. -o ../objects/qgdict.o qgdict.cpp
224/usr/bin/clang++ -I/opt/local/include -arch x86_64 -c -pipe -D__FreeBSD__=6 -DYY_TYPEDEF_YY_SIZE_T -Dyy_size_t=int -DQT_LITE_UNICODE -Wall -W -Wno-deprecated-declarations -O2 -I. -o ../objects/qglist.o qglist.cpp
225/usr/bin/clang++ -I/opt/local/include -arch x86_64 -c -pipe -D__FreeBSD__=6 -DYY_TYPEDEF_YY_SIZE_T -Dyy_size_t=int -DQT_LITE_UNICODE -Wall -W -Wno-deprecated-declarations -O2 -I. -o ../objects/qglobal.o qglobal.cpp
226/usr/bin/clang++ -I/opt/local/include -arch x86_64 -c -pipe -D__FreeBSD__=6 -DYY_TYPEDEF_YY_SIZE_T -Dyy_size_t=int -DQT_LITE_UNICODE -Wall -W -Wno-deprecated-declarations -O2 -I. -o ../objects/qgstring.o qgstring.cpp
227/usr/bin/clang++ -I/opt/local/include -arch x86_64 -c -pipe -D__FreeBSD__=6 -DYY_TYPEDEF_YY_SIZE_T -Dyy_size_t=int -DQT_LITE_UNICODE -Wall -W -Wno-deprecated-declarations -O2 -I. -o ../objects/qgvector.o qgvector.cpp
228/usr/bin/clang++ -I/opt/local/include -arch x86_64 -c -pipe -D__FreeBSD__=6 -DYY_TYPEDEF_YY_SIZE_T -Dyy_size_t=int -DQT_LITE_UNICODE -Wall -W -Wno-deprecated-declarations -O2 -I. -o ../objects/qiodevice.o qiodevice.cpp
229/usr/bin/clang++ -I/opt/local/include -arch x86_64 -c -pipe -D__FreeBSD__=6 -DYY_TYPEDEF_YY_SIZE_T -Dyy_size_t=int -DQT_LITE_UNICODE -Wall -W -Wno-deprecated-declarations -O2 -I. -o ../objects/qregexp.o qregexp.cpp
230/usr/bin/clang++ -I/opt/local/include -arch x86_64 -c -pipe -D__FreeBSD__=6 -DYY_TYPEDEF_YY_SIZE_T -Dyy_size_t=int -DQT_LITE_UNICODE -Wall -W -Wno-deprecated-declarations -O2 -I. -o ../objects/qstring.o qstring.cpp
231/usr/bin/clang++ -I/opt/local/include -arch x86_64 -c -pipe -D__FreeBSD__=6 -DYY_TYPEDEF_YY_SIZE_T -Dyy_size_t=int -DQT_LITE_UNICODE -Wall -W -Wno-deprecated-declarations -O2 -I. -o ../objects/qtextstream.o qtextstream.cpp
232/usr/bin/clang++ -I/opt/local/include -arch x86_64 -c -pipe -D__FreeBSD__=6 -DYY_TYPEDEF_YY_SIZE_T -Dyy_size_t=int -DQT_LITE_UNICODE -Wall -W -Wno-deprecated-declarations -O2 -I. -o ../objects/qtextcodec.o qtextcodec.cpp
233/usr/bin/clang++ -I/opt/local/include -arch x86_64 -c -pipe -D__FreeBSD__=6 -DYY_TYPEDEF_YY_SIZE_T -Dyy_size_t=int -DQT_LITE_UNICODE -Wall -W -Wno-deprecated-declarations -O2 -I. -o ../objects/qstringlist.o qstringlist.cpp
234/usr/bin/clang++ -I/opt/local/include -arch x86_64 -c -pipe -D__FreeBSD__=6 -DYY_TYPEDEF_YY_SIZE_T -Dyy_size_t=int -DQT_LITE_UNICODE -Wall -W -Wno-deprecated-declarations -O2 -I. -o ../objects/qxml.o qxml.cpp
235/usr/bin/clang++ -I/opt/local/include -arch x86_64 -c -pipe -D__FreeBSD__=6 -DYY_TYPEDEF_YY_SIZE_T -Dyy_size_t=int -DQT_LITE_UNICODE -Wall -W -Wno-deprecated-declarations -O2 -I. -o ../objects/qmap.o qmap.cpp
236/usr/bin/clang++ -I/opt/local/include -arch x86_64 -c -pipe -D__FreeBSD__=6 -DYY_TYPEDEF_YY_SIZE_T -Dyy_size_t=int -DQT_LITE_UNICODE -Wall -W -Wno-deprecated-declarations -O2 -I. -o ../objects/qthread.o qthread.cpp
237/usr/bin/clang++ -I/opt/local/include -arch x86_64 -c -pipe -D__FreeBSD__=6 -DYY_TYPEDEF_YY_SIZE_T -Dyy_size_t=int -DQT_LITE_UNICODE -Wall -W -Wno-deprecated-declarations -O2 -I. -o ../objects/qmutex.o qmutex.cpp
238/usr/bin/clang++ -I/opt/local/include -arch x86_64 -c -pipe -D__FreeBSD__=6 -DYY_TYPEDEF_YY_SIZE_T -Dyy_size_t=int -DQT_LITE_UNICODE -Wall -W -Wno-deprecated-declarations -O2 -I. -o ../objects/qutfcodec.o qutfcodec.cpp
239/usr/bin/clang++ -I/opt/local/include -arch x86_64 -c -pipe -D__FreeBSD__=6 -DYY_TYPEDEF_YY_SIZE_T -Dyy_size_t=int -DQT_LITE_UNICODE -Wall -W -Wno-deprecated-declarations -O2 -I. -o ../objects/qfile_unix.o qfile_unix.cpp
240/usr/bin/clang++ -I/opt/local/include -arch x86_64 -c -pipe -D__FreeBSD__=6 -DYY_TYPEDEF_YY_SIZE_T -Dyy_size_t=int -DQT_LITE_UNICODE -Wall -W -Wno-deprecated-declarations -O2 -I. -o ../objects/qdir_unix.o qdir_unix.cpp
241/usr/bin/clang++ -I/opt/local/include -arch x86_64 -c -pipe -D__FreeBSD__=6 -DYY_TYPEDEF_YY_SIZE_T -Dyy_size_t=int -DQT_LITE_UNICODE -Wall -W -Wno-deprecated-declarations -O2 -I. -o ../objects/qfileinfo_unix.o qfileinfo_unix.cpp
242/usr/bin/clang++ -I/opt/local/include -arch x86_64 -c -pipe -D__FreeBSD__=6 -DYY_TYPEDEF_YY_SIZE_T -Dyy_size_t=int -DQT_LITE_UNICODE -Wall -W -Wno-deprecated-declarations -O2 -I. -o ../objects/qthread_unix.o qthread_unix.cpp
243/usr/bin/clang++ -I/opt/local/include -arch x86_64 -c -pipe -D__FreeBSD__=6 -DYY_TYPEDEF_YY_SIZE_T -Dyy_size_t=int -DQT_LITE_UNICODE -Wall -W -Wno-deprecated-declarations -O2 -I. -o ../objects/qmutex_unix.o qmutex_unix.cpp
244/usr/bin/clang++ -I/opt/local/include -arch x86_64 -c -pipe -D__FreeBSD__=6 -DYY_TYPEDEF_YY_SIZE_T -Dyy_size_t=int -DQT_LITE_UNICODE -Wall -W -Wno-deprecated-declarations -O2 -I. -o ../objects/qwaitcondition_unix.o qwaitcondition_unix.cpp
245rm -f ../lib/libqtools.a
246ar cq ../lib/libqtools.a ../objects/qbuffer.o ../objects/qcollection.o ../objects/scstring.o ../objects/qdatastream.o ../objects/qdatetime.o ../objects/qdir.o ../objects/qfile.o ../objects/qfileinfo.o ../objects/qgarray.o ../objects/qgcache.o ../objects/qgdict.o ../objects/qglist.o ../objects/qglobal.o ../objects/qgstring.o ../objects/qgvector.o ../objects/qiodevice.o ../objects/qregexp.o ../objects/qstring.o ../objects/qtextstream.o ../objects/qtextcodec.o ../objects/qstringlist.o ../objects/qxml.o ../objects/qmap.o ../objects/qthread.o ../objects/qmutex.o ../objects/qutfcodec.o ../objects/qfile_unix.o ../objects/qdir_unix.o ../objects/qfileinfo_unix.o ../objects/qthread_unix.o ../objects/qmutex_unix.o ../objects/qwaitcondition_unix.o
247ranlib ../lib/libqtools.a
248make[2]: Leaving directory `/opt/local/var/macports/build/_Users_ci_devel_repos_macports_trunk_dports_textproc_doxygen/doxygen/work/doxygen-1.8.3/qtools'
249make[1]: Leaving directory `/opt/local/var/macports/build/_Users_ci_devel_repos_macports_trunk_dports_textproc_doxygen/doxygen/work/doxygen-1.8.3/qtools'
250/usr/bin/make -C libmd5
251make[1]: Entering directory `/opt/local/var/macports/build/_Users_ci_devel_repos_macports_trunk_dports_textproc_doxygen/doxygen/work/doxygen-1.8.3/libmd5'
252/usr/bin/make -f Makefile.libmd5
253make[2]: Entering directory `/opt/local/var/macports/build/_Users_ci_devel_repos_macports_trunk_dports_textproc_doxygen/doxygen/work/doxygen-1.8.3/libmd5'
254cc -c -pipe -Wall -W -Wno-deprecated-declarations  -g -fstack-protector -I/usr/local/include -o ../objects/md5.o md5.c
255cc -c -pipe -Wall -W -Wno-deprecated-declarations -g -fstack-protector -I/usr/local/include -o ../objects/md5.o md5.c
256cc: Error: You should be using ${configure.cc}
257See https://trac.macports.org/wiki/UsingTheRightCompiler
258make[2]: *** [../objects/md5.o] Error 1
259make[2]: Leaving directory `/opt/local/var/macports/build/_Users_ci_devel_repos_macports_trunk_dports_textproc_doxygen/doxygen/work/doxygen-1.8.3/libmd5'
260make[1]: *** [all] Error 2
261make[1]: Leaving directory `/opt/local/var/macports/build/_Users_ci_devel_repos_macports_trunk_dports_textproc_doxygen/doxygen/work/doxygen-1.8.3/libmd5'
262make: *** [all] Error 2
263make: Leaving directory `/opt/local/var/macports/build/_Users_ci_devel_repos_macports_trunk_dports_textproc_doxygen/doxygen/work/doxygen-1.8.3'
264Command failed:  cd "/opt/local/var/macports/build/_Users_ci_devel_repos_macports_trunk_dports_textproc_doxygen/doxygen/work/doxygen-1.8.3" && /usr/bin/make -j8 -w all
265Exit code: 2
266Error: org.macports.build for port doxygen returned: command execution failed
267DEBUG: Error code: CHILDSTATUS 1011 2
268DEBUG: Backtrace: command execution failed
269Warning: targets not executed for doxygen: org.macports.install org.macports.build org.macports.destroot
270Please see the log file for port doxygen for details: