Ticket #40403: main.log

File main.log, 12.3 KB (added by boloomka@…, 8 years ago)

log output from compiling gtypist

Line 
1version:1
2:debug:main epoch: in tree: 0 installed: 0
3:debug:main ncurses 5.9_2 exists in the ports tree
4:debug:main ncurses 5.9_2  is the latest installed
5:debug:main ncurses 5.9_2  is active
6:debug:main Merging existing variants '' into variants
7:debug:main new fully merged portvariants:
8:debug:main Changing to port directory: /opt/local/var/macports/sources/rsync.macports.org/release/tarballs/ports/devel/ncurses
9:debug:main OS darwin/12.4.1 (Mac OS X 10.8) arch i386
10:debug:main adding the default universal variant
11:debug:main Reading variant descriptions from /opt/local/var/macports/sources/rsync.macports.org/release/tarballs/ports/_resources/port1.0/variant_descriptions.conf
12:debug:main Running callback portconfigure::add_automatic_compiler_dependencies
13:debug:main Finished running callback portconfigure::add_automatic_compiler_dependencies
14:debug:main Running callback portbuild::add_automatic_buildsystem_dependencies
15:debug:main Finished running callback portbuild::add_automatic_buildsystem_dependencies
16:debug:main No need to upgrade! ncurses 5.9_2 >= ncurses 5.9_2
17:debug:main epoch: in tree: 0 installed: 0
18:debug:main gettext 0.18.3.1_0 exists in the ports tree
19:debug:main gettext 0.18.3.1_0  is the latest installed
20:debug:main gettext 0.18.3.1_0  is active
21:debug:main Merging existing variants '' into variants
22:debug:main new fully merged portvariants:
23:debug:main Changing to port directory: /opt/local/var/macports/sources/rsync.macports.org/release/tarballs/ports/devel/gettext
24:debug:main OS darwin/12.4.1 (Mac OS X 10.8) arch i386
25:debug:main Reading variant descriptions from /opt/local/var/macports/sources/rsync.macports.org/release/tarballs/ports/_resources/port1.0/variant_descriptions.conf
26:debug:main compiler clang 425.0.28 not blacklisted because does not match {clang < 211.10.1}
27:debug:main universal variant already exists, so not adding the default one
28:debug:main Running callback portconfigure::add_automatic_compiler_dependencies
29:debug:main Finished running callback portconfigure::add_automatic_compiler_dependencies
30:debug:main Running callback portbuild::add_automatic_buildsystem_dependencies
31:debug:main Finished running callback portbuild::add_automatic_buildsystem_dependencies
32:debug:main No need to upgrade! gettext 0.18.3.1_0 >= gettext 0.18.3.1_0
33:debug:main epoch: in tree: 0 installed: 0
34:debug:main expat 2.1.0_0 exists in the ports tree
35:debug:main expat 2.1.0_0  is the latest installed
36:debug:main expat 2.1.0_0  is active
37:debug:main Merging existing variants '' into variants
38:debug:main new fully merged portvariants:
39:debug:main Changing to port directory: /opt/local/var/macports/sources/rsync.macports.org/release/tarballs/ports/textproc/expat
40:debug:main OS darwin/12.4.1 (Mac OS X 10.8) arch i386
41:debug:main adding the default universal variant
42:debug:main Reading variant descriptions from /opt/local/var/macports/sources/rsync.macports.org/release/tarballs/ports/_resources/port1.0/variant_descriptions.conf
43:debug:main Running callback portconfigure::add_automatic_compiler_dependencies
44:debug:main Finished running callback portconfigure::add_automatic_compiler_dependencies
45:debug:main Running callback portbuild::add_automatic_buildsystem_dependencies
46:debug:main Finished running callback portbuild::add_automatic_buildsystem_dependencies
47:debug:main No need to upgrade! expat 2.1.0_0 >= expat 2.1.0_0
48:debug:main epoch: in tree: 0 installed: 0
49:debug:main libiconv 1.14_0 exists in the ports tree
50:debug:main libiconv 1.14_0  is the latest installed
51:debug:main libiconv 1.14_0  is active
52:debug:main Merging existing variants '' into variants
53:debug:main new fully merged portvariants:
54:debug:main Changing to port directory: /opt/local/var/macports/sources/rsync.macports.org/release/tarballs/ports/textproc/libiconv
55:debug:main OS darwin/12.4.1 (Mac OS X 10.8) arch i386
56:debug:main Reading variant descriptions from /opt/local/var/macports/sources/rsync.macports.org/release/tarballs/ports/_resources/port1.0/variant_descriptions.conf
57:debug:main universal variant already exists, so not adding the default one
58:debug:main Running callback portconfigure::add_automatic_compiler_dependencies
59:debug:main Finished running callback portconfigure::add_automatic_compiler_dependencies
60:debug:main Running callback portbuild::add_automatic_buildsystem_dependencies
61:debug:main Finished running callback portbuild::add_automatic_buildsystem_dependencies
62:debug:main No need to upgrade! libiconv 1.14_0 >= libiconv 1.14_0
63:msg:main --->  Computing dependencies for gtypist:info:main .:debug:main gtypist has no conflicts
64:debug:main Searching for dependency: ncurses
65:debug:main Found Dependency: receipt exists for ncurses
66:debug:main Searching for dependency: gettext
67:debug:main Found Dependency: receipt exists for gettext
68:msg:main
69:debug:main Executing org.macports.main (gtypist)
70:debug:main changing euid/egid - current euid: 0 - current egid: 0
71:debug:main egid changed to: 501
72:debug:main euid changed to: 502
73:debug:main Skipping completed org.macports.archivefetch (gtypist)
74:debug:main Privilege de-escalation not attempted as not running as root.
75:debug:main Skipping completed org.macports.fetch (gtypist)
76:debug:main Privilege de-escalation not attempted as not running as root.
77:debug:main Skipping completed org.macports.checksum (gtypist)
78:debug:main Privilege de-escalation not attempted as not running as root.
79:debug:main Skipping completed org.macports.extract (gtypist)
80:debug:main Privilege de-escalation not attempted as not running as root.
81:debug:main Skipping completed org.macports.patch (gtypist)
82:debug:main Privilege de-escalation not attempted as not running as root.
83:debug:main Skipping completed org.macports.configure (gtypist)
84:debug:main Privilege de-escalation not attempted as not running as root.
85:debug:build build phase started at Sat Sep  7 20:30:08 CEST 2013
86:notice:build --->  Building gtypist
87:debug:build Executing org.macports.build (gtypist)
88:debug:build Environment: CPATH='/opt/local/include' CC_PRINT_OPTIONS_FILE='/opt/local/var/macports/build/_opt_local_var_macports_sources_rsync.macports.org_release_tarballs_ports_games_gtypist/gtypist/work/.CC_PRINT_OPTIONS' LIBRARY_PATH='/opt/local/lib' CC_PRINT_OPTIONS='YES' MACOSX_DEPLOYMENT_TARGET='10.8'
89:debug:build Assembled command: 'cd "/opt/local/var/macports/build/_opt_local_var_macports_sources_rsync.macports.org_release_tarballs_ports_games_gtypist/gtypist/work/gtypist-2.9.1" && /usr/bin/make -j4 -w all'
90:debug:build Executing command line:  cd "/opt/local/var/macports/build/_opt_local_var_macports_sources_rsync.macports.org_release_tarballs_ports_games_gtypist/gtypist/work/gtypist-2.9.1" && /usr/bin/make -j4 -w all
91:info:build make: Entering directory `/opt/local/var/macports/build/_opt_local_var_macports_sources_rsync.macports.org_release_tarballs_ports_games_gtypist/gtypist/work/gtypist-2.9.1'
92:info:build /usr/bin/make  all-recursive
93:info:build make[1]: Entering directory `/opt/local/var/macports/build/_opt_local_var_macports_sources_rsync.macports.org_release_tarballs_ports_games_gtypist/gtypist/work/gtypist-2.9.1'
94:info:build Making all in m4
95:info:build make[2]: Entering directory `/opt/local/var/macports/build/_opt_local_var_macports_sources_rsync.macports.org_release_tarballs_ports_games_gtypist/gtypist/work/gtypist-2.9.1/m4'
96:info:build make[2]: Nothing to be done for `all'.
97:info:build make[2]: Leaving directory `/opt/local/var/macports/build/_opt_local_var_macports_sources_rsync.macports.org_release_tarballs_ports_games_gtypist/gtypist/work/gtypist-2.9.1/m4'
98:info:build Making all in po
99:info:build make[2]: Entering directory `/opt/local/var/macports/build/_opt_local_var_macports_sources_rsync.macports.org_release_tarballs_ports_games_gtypist/gtypist/work/gtypist-2.9.1/po'
100:info:build make[2]: Nothing to be done for `all'.
101:info:build make[2]: Leaving directory `/opt/local/var/macports/build/_opt_local_var_macports_sources_rsync.macports.org_release_tarballs_ports_games_gtypist/gtypist/work/gtypist-2.9.1/po'
102:info:build Making all in intl
103:info:build make[2]: Entering directory `/opt/local/var/macports/build/_opt_local_var_macports_sources_rsync.macports.org_release_tarballs_ports_games_gtypist/gtypist/work/gtypist-2.9.1/intl'
104:info:build make[2]: Nothing to be done for `all'.
105:info:build make[2]: Leaving directory `/opt/local/var/macports/build/_opt_local_var_macports_sources_rsync.macports.org_release_tarballs_ports_games_gtypist/gtypist/work/gtypist-2.9.1/intl'
106:info:build Making all in lessons
107:info:build make[2]: Entering directory `/opt/local/var/macports/build/_opt_local_var_macports_sources_rsync.macports.org_release_tarballs_ports_games_gtypist/gtypist/work/gtypist-2.9.1/lessons'
108:info:build make[2]: Nothing to be done for `all'.
109:info:build make[2]: Leaving directory `/opt/local/var/macports/build/_opt_local_var_macports_sources_rsync.macports.org_release_tarballs_ports_games_gtypist/gtypist/work/gtypist-2.9.1/lessons'
110:info:build Making all in tools
111:info:build make[2]: Entering directory `/opt/local/var/macports/build/_opt_local_var_macports_sources_rsync.macports.org_release_tarballs_ports_games_gtypist/gtypist/work/gtypist-2.9.1/tools'
112:info:build make[2]: Nothing to be done for `all'.
113:info:build make[2]: Leaving directory `/opt/local/var/macports/build/_opt_local_var_macports_sources_rsync.macports.org_release_tarballs_ports_games_gtypist/gtypist/work/gtypist-2.9.1/tools'
114:info:build Making all in doc
115:info:build make[2]: Entering directory `/opt/local/var/macports/build/_opt_local_var_macports_sources_rsync.macports.org_release_tarballs_ports_games_gtypist/gtypist/work/gtypist-2.9.1/doc'
116:info:build make[2]: Nothing to be done for `all'.
117:info:build make[2]: Leaving directory `/opt/local/var/macports/build/_opt_local_var_macports_sources_rsync.macports.org_release_tarballs_ports_games_gtypist/gtypist/work/gtypist-2.9.1/doc'
118:info:build Making all in src
119:info:build make[2]: Entering directory `/opt/local/var/macports/build/_opt_local_var_macports_sources_rsync.macports.org_release_tarballs_ports_games_gtypist/gtypist/work/gtypist-2.9.1/src'
120:info:build /usr/bin/clang  -pipe -Os -arch x86_64  -L/opt/local/lib -Wl,-headerpad_max_install_names -arch x86_64 -o gtypist gtypist.o cursmenu.o script.o error.o getopt.o getopt1.o utf8.o -lintl -lncurses
121:info:build Undefined symbols for architecture x86_64:
122:info:build   "_libiconv", referenced from:
123:info:build       _convertUTF8ToCurrentEncoding in utf8.o
124:info:build   "_libiconv_close", referenced from:
125:info:build       _convertUTF8ToCurrentEncoding in utf8.o
126:info:build   "_libiconv_open", referenced from:
127:info:build       _convertUTF8ToCurrentEncoding in utf8.o
128:info:build ld: symbol(s) not found for architecture x86_64
129:info:build clang: error: linker command failed with exit code 1 (use -v to see invocation)
130:info:build make[2]: *** [gtypist] Error 1
131:info:build make[2]: Leaving directory `/opt/local/var/macports/build/_opt_local_var_macports_sources_rsync.macports.org_release_tarballs_ports_games_gtypist/gtypist/work/gtypist-2.9.1/src'
132:info:build make[1]: *** [all-recursive] Error 1
133:info:build make[1]: Leaving directory `/opt/local/var/macports/build/_opt_local_var_macports_sources_rsync.macports.org_release_tarballs_ports_games_gtypist/gtypist/work/gtypist-2.9.1'
134:info:build make: *** [all] Error 2
135:info:build make: Leaving directory `/opt/local/var/macports/build/_opt_local_var_macports_sources_rsync.macports.org_release_tarballs_ports_games_gtypist/gtypist/work/gtypist-2.9.1'
136:info:build Command failed:  cd "/opt/local/var/macports/build/_opt_local_var_macports_sources_rsync.macports.org_release_tarballs_ports_games_gtypist/gtypist/work/gtypist-2.9.1" && /usr/bin/make -j4 -w all
137:info:build Exit code: 2
138:error:build org.macports.build for port gtypist returned: command execution failed
139:debug:build Error code: CHILDSTATUS 499 2
140:debug:build Backtrace: command execution failed
141    while executing
142"system -nice 0 $fullcmdstring"
143    ("eval" body line 1)
144    invoked from within
145"eval system $notty $nice \$fullcmdstring"
146    invoked from within
147"command_exec build"
148    (procedure "portbuild::build_main" line 8)
149    invoked from within
150"$procedure $targetname"
151:info:build Warning: targets not executed for gtypist: org.macports.activate org.macports.build org.macports.destroot org.macports.install
152:notice:build Please see the log file for port gtypist for details:
153    /opt/local/var/macports/logs/_opt_local_var_macports_sources_rsync.macports.org_release_tarballs_ports_games_gtypist/gtypist/main.log