Ticket #40408: dwarf.main.log

File dwarf.main.log, 29.7 KB (added by larryv (Lawrence Velázquez), 4 years ago)

failed build on Yosemite

Line 
1version:1
2:debug:main epoch: in tree: 0 installed: 0
3:debug:main flex 2.5.37_1 exists in the ports tree
4:debug:main flex 2.5.37_1  is the latest installed
5:debug:main flex 2.5.37_1  is active
6:debug:main Merging existing variants '' into variants
7:debug:main new fully merged portvariants:
8:debug:main Changing to port directory: /Users/larryv/Projects/MacPorts/git-svn/trunk/dports/devel/flex
9:debug:main OS darwin/14.1.0 (Mac OS X 10.10) arch i386
10:debug:main adding the default universal variant
11:debug:main Reading variant descriptions from /Users/larryv/Projects/MacPorts/git-svn/trunk/dports/_resources/port1.0/variant_descriptions.conf
12:debug:main Running callback portconfigure::add_automatic_compiler_dependencies
13:debug:main Finished running callback portconfigure::add_automatic_compiler_dependencies
14:debug:main Running callback portbuild::add_automatic_buildsystem_dependencies
15:debug:main Finished running callback portbuild::add_automatic_buildsystem_dependencies
16:debug:main No need to upgrade! flex 2.5.37_1 >= flex 2.5.37_1
17:debug:main epoch: in tree: 2 installed: 2
18:debug:main gettext 0.19.4_0 exists in the ports tree
19:debug:main gettext 0.19.4_0 +universal is the latest installed
20:debug:main gettext 0.19.4_0 +universal is active
21:debug:main Merging existing variants '+universal' into variants
22:debug:main new fully merged portvariants: universal +
23:debug:main Changing to port directory: /Users/larryv/Projects/MacPorts/git-svn/trunk/dports/devel/gettext
24:debug:main OS darwin/14.1.0 (Mac OS X 10.10) arch i386
25:debug:main Sourcing PortGroup compiler_blacklist_versions 1.0 from /Users/larryv/Projects/MacPorts/git-svn/trunk/dports/_resources/port1.0/group/compiler_blacklist_versions-1.0.tcl
26:debug:main Reading variant descriptions from /Users/larryv/Projects/MacPorts/git-svn/trunk/dports/_resources/port1.0/variant_descriptions.conf
27:debug:main Sourcing PortGroup muniversal 1.0 from /Users/larryv/Projects/MacPorts/git-svn/trunk/dports/_resources/port1.0/group/muniversal-1.0.tcl
28:debug:main compiler clang 600.0.57 not blacklisted because it doesn't match {clang < 211.10.1}
29:debug:main universal variant already exists, so not adding the default one
30:debug:main Executing variant universal provides universal
31:debug:main Running callback portconfigure::add_automatic_compiler_dependencies
32:debug:main Finished running callback portconfigure::add_automatic_compiler_dependencies
33:debug:main Running callback portbuild::add_automatic_buildsystem_dependencies
34:debug:main Finished running callback portbuild::add_automatic_buildsystem_dependencies
35:debug:main No need to upgrade! gettext 0.19.4_0 >= gettext 0.19.4_0
36:debug:main epoch: in tree: 0 installed: 0
37:debug:main expat 2.1.0_0 exists in the ports tree
38:debug:main expat 2.1.0_0 +universal is the latest installed
39:debug:main expat 2.1.0_0 +universal is active
40:debug:main Merging existing variants '+universal' into variants
41:debug:main new fully merged portvariants: universal +
42:debug:main Changing to port directory: /Users/larryv/Projects/MacPorts/git-svn/trunk/dports/textproc/expat
43:debug:main OS darwin/14.1.0 (Mac OS X 10.10) arch i386
44:debug:main adding the default universal variant
45:debug:main Reading variant descriptions from /Users/larryv/Projects/MacPorts/git-svn/trunk/dports/_resources/port1.0/variant_descriptions.conf
46:debug:main Executing variant universal provides universal
47:debug:main Running callback portconfigure::add_automatic_compiler_dependencies
48:debug:main Finished running callback portconfigure::add_automatic_compiler_dependencies
49:debug:main Running callback portbuild::add_automatic_buildsystem_dependencies
50:debug:main Finished running callback portbuild::add_automatic_buildsystem_dependencies
51:debug:main No need to upgrade! expat 2.1.0_0 >= expat 2.1.0_0
52:debug:main epoch: in tree: 0 installed: 0
53:debug:main libiconv 1.14_0 exists in the ports tree
54:debug:main libiconv 1.14_0 +universal is the latest installed
55:debug:main libiconv 1.14_0 +universal is active
56:debug:main Merging existing variants '+universal' into variants
57:debug:main new fully merged portvariants: universal +
58:debug:main Changing to port directory: /Users/larryv/Projects/MacPorts/git-svn/trunk/dports/textproc/libiconv
59:debug:main OS darwin/14.1.0 (Mac OS X 10.10) arch i386
60:debug:main Reading variant descriptions from /Users/larryv/Projects/MacPorts/git-svn/trunk/dports/_resources/port1.0/variant_descriptions.conf
61:debug:main Sourcing PortGroup muniversal 1.0 from /Users/larryv/Projects/MacPorts/git-svn/trunk/dports/_resources/port1.0/group/muniversal-1.0.tcl
62:debug:main universal variant already exists, so not adding the default one
63:debug:main Executing variant universal provides universal
64:debug:main Running callback portconfigure::add_automatic_compiler_dependencies
65:debug:main Finished running callback portconfigure::add_automatic_compiler_dependencies
66:debug:main Running callback portbuild::add_automatic_buildsystem_dependencies
67:debug:main Finished running callback portbuild::add_automatic_buildsystem_dependencies
68:debug:main No need to upgrade! libiconv 1.14_0 >= libiconv 1.14_0
69:debug:main epoch: in tree: 0 installed: 0
70:debug:main ncurses 5.9_2 exists in the ports tree
71:debug:main ncurses 5.9_2 +universal is the latest installed
72:debug:main ncurses 5.9_2 +universal is active
73:debug:main Merging existing variants '+universal' into variants
74:debug:main new fully merged portvariants: universal +
75:debug:main Changing to port directory: /Users/larryv/Projects/MacPorts/git-svn/trunk/dports/devel/ncurses
76:debug:main OS darwin/14.1.0 (Mac OS X 10.10) arch i386
77:debug:main adding the default universal variant
78:debug:main Reading variant descriptions from /Users/larryv/Projects/MacPorts/git-svn/trunk/dports/_resources/port1.0/variant_descriptions.conf
79:debug:main Executing variant universal provides universal
80:debug:main Running callback portconfigure::add_automatic_compiler_dependencies
81:debug:main Finished running callback portconfigure::add_automatic_compiler_dependencies
82:debug:main Running callback portbuild::add_automatic_buildsystem_dependencies
83:debug:main Finished running callback portbuild::add_automatic_buildsystem_dependencies
84:debug:main No need to upgrade! ncurses 5.9_2 >= ncurses 5.9_2
85:debug:main epoch: in tree: 0 installed: 0
86:debug:main m4 1.4.17_0 exists in the ports tree
87:debug:main m4 1.4.17_0 +universal is the latest installed
88:debug:main m4 1.4.17_0 +universal is active
89:debug:main Merging existing variants '+universal' into variants
90:debug:main new fully merged portvariants: universal +
91:debug:main Changing to port directory: /Users/larryv/Projects/MacPorts/git-svn/trunk/dports/devel/m4
92:debug:main OS darwin/14.1.0 (Mac OS X 10.10) arch i386
93:debug:main adding the default universal variant
94:debug:main Reading variant descriptions from /Users/larryv/Projects/MacPorts/git-svn/trunk/dports/_resources/port1.0/variant_descriptions.conf
95:debug:main Executing variant universal provides universal
96:debug:main Running callback portconfigure::add_automatic_compiler_dependencies
97:debug:main Finished running callback portconfigure::add_automatic_compiler_dependencies
98:debug:main Running callback portbuild::add_automatic_buildsystem_dependencies
99:debug:main Finished running callback portbuild::add_automatic_buildsystem_dependencies
100:debug:main No need to upgrade! m4 1.4.17_0 >= m4 1.4.17_0
101:debug:main epoch: in tree: 1 installed: 1
102:debug:main bison 2.7.1_1 exists in the ports tree
103:debug:main bison 3.0.4_0  is the latest installed
104:debug:main bison 3.0.4_0  is active
105:debug:main Merging existing variants '' into variants
106:debug:main new fully merged portvariants:
107:debug:main Changing to port directory: /Users/larryv/Projects/MacPorts/git-svn/trunk/dports/devel/bison
108:debug:main OS darwin/14.1.0 (Mac OS X 10.10) arch i386
109:debug:main adding the default universal variant
110:debug:main Reading variant descriptions from /Users/larryv/Projects/MacPorts/git-svn/trunk/dports/_resources/port1.0/variant_descriptions.conf
111:debug:main Running callback portconfigure::add_automatic_compiler_dependencies
112:debug:main Finished running callback portconfigure::add_automatic_compiler_dependencies
113:debug:main Running callback portbuild::add_automatic_buildsystem_dependencies
114:debug:main Finished running callback portbuild::add_automatic_buildsystem_dependencies
115:debug:main No need to upgrade! bison 3.0.4_0 >= bison 2.7.1_1
116:debug:main epoch: in tree: 0 installed: 0
117:debug:main xz 5.2.1_0 exists in the ports tree
118:debug:main xz 5.2.1_0 +universal is the latest installed
119:debug:main xz 5.2.1_0 +universal is active
120:debug:main Merging existing variants '+universal' into variants
121:debug:main new fully merged portvariants: universal +
122:debug:main Changing to port directory: /Users/larryv/Projects/MacPorts/git-svn/trunk/dports/archivers/xz
123:debug:main OS darwin/14.1.0 (Mac OS X 10.10) arch i386
124:debug:main adding the default universal variant
125:debug:main Reading variant descriptions from /Users/larryv/Projects/MacPorts/git-svn/trunk/dports/_resources/port1.0/variant_descriptions.conf
126:debug:main Executing variant universal provides universal
127:debug:main Running callback portconfigure::add_automatic_compiler_dependencies
128:debug:main Finished running callback portconfigure::add_automatic_compiler_dependencies
129:debug:main Running callback portbuild::add_automatic_buildsystem_dependencies
130:debug:main Finished running callback portbuild::add_automatic_buildsystem_dependencies
131:debug:main No need to upgrade! xz 5.2.1_0 >= xz 5.2.1_0
132:debug:main epoch: in tree: 0 installed: 0
133:debug:main readline 6.3.003_0 exists in the ports tree
134:debug:main readline 6.3.003_0  is the latest installed
135:debug:main readline 6.3.003_0  is active
136:debug:main Merging existing variants '' into variants
137:debug:main new fully merged portvariants:
138:debug:main Changing to port directory: /Users/larryv/Projects/MacPorts/git-svn/trunk/dports/devel/readline
139:debug:main OS darwin/14.1.0 (Mac OS X 10.10) arch i386
140:debug:main Reading variant descriptions from /Users/larryv/Projects/MacPorts/git-svn/trunk/dports/_resources/port1.0/variant_descriptions.conf
141:debug:main Sourcing PortGroup muniversal 1.0 from /Users/larryv/Projects/MacPorts/git-svn/trunk/dports/_resources/port1.0/group/muniversal-1.0.tcl
142:debug:main universal variant already exists, so not adding the default one
143:debug:main Running callback portconfigure::add_automatic_compiler_dependencies
144:debug:main Finished running callback portconfigure::add_automatic_compiler_dependencies
145:debug:main Running callback portbuild::add_automatic_buildsystem_dependencies
146:debug:main Finished running callback portbuild::add_automatic_buildsystem_dependencies
147:debug:main No need to upgrade! readline 6.3.003_0 >= readline 6.3.003_0
148:msg:main --->  Computing dependencies for dwarf:msg:main
149:debug:main Searching for dependency: flex
150:debug:main Found Dependency: receipt exists for flex
151:debug:main Searching for dependency: bison
152:debug:main Found Dependency: receipt exists for bison
153:debug:main Searching for dependency: readline
154:debug:main Found Dependency: receipt exists for readline
155:debug:main Executing org.macports.main (dwarf)
156:debug:main changing euid/egid - current euid: 0 - current egid: 0
157:debug:main egid changed to: 501
158:debug:main euid changed to: 502
159:debug:fetch fetch phase started at Thu Mar 19 18:52:52 EDT 2015
160:notice:fetch --->  Fetching distfiles for dwarf
161:warn:fetch Your DNS servers incorrectly claim to know the address of nonexistent hosts. This may cause checksum mismatches for some ports. See this page for more information: <https://trac.macports.org/wiki/MisbehavingServers>
162:debug:fetch Executing org.macports.fetch (dwarf)
163:debug:fetch Privilege de-escalation not attempted as not running as root.
164:debug:checksum checksum phase started at Thu Mar 19 18:52:52 EDT 2015
165:notice:checksum --->  Verifying checksums for dwarf
166:debug:checksum Executing org.macports.checksum (dwarf)
167:info:checksum --->  Checksumming dwarf-0.3.1.tar.gz
168:debug:checksum Calculated (md5) is 17743b4aa7d9408a44388ce9a8421433
169:debug:checksum Correct (md5) checksum for dwarf-0.3.1.tar.gz
170:debug:checksum Calculated (sha1) is ce0f90d07feaeba874fe5948e4f1334bbee25c51
171:debug:checksum Correct (sha1) checksum for dwarf-0.3.1.tar.gz
172:debug:checksum Calculated (rmd160) is 5303b949666f63949d77a9de7cf7fc91e414497c
173:debug:checksum Correct (rmd160) checksum for dwarf-0.3.1.tar.gz
174:debug:checksum Calculated (sha256) is cb6d28e1c86dff4eb046c67007e822294a2016bd6a0d8e38306d750fb7f86ca6
175:debug:checksum Correct (sha256) checksum for dwarf-0.3.1.tar.gz
176:debug:checksum Privilege de-escalation not attempted as not running as root.
177:debug:extract extract phase started at Thu Mar 19 18:52:52 EDT 2015
178:notice:extract --->  Extracting dwarf
179:debug:extract Executing org.macports.extract (dwarf)
180:info:extract --->  Extracting dwarf-0.3.1.tar.gz
181:debug:extract setting option extract.args to '/opt/local/var/macports/distfiles/dwarf/dwarf-0.3.1.tar.gz'
182:debug:extract Environment:
183CC_PRINT_OPTIONS='YES'
184CC_PRINT_OPTIONS_FILE='/opt/local/var/macports/build/_Users_larryv_Projects_MacPorts_git-svn_trunk_dports_sysutils_dwarf/dwarf/work/.CC_PRINT_OPTIONS'
185CPATH='/opt/local/include'
186LIBRARY_PATH='/opt/local/lib'
187MACOSX_DEPLOYMENT_TARGET='10.10'
188:debug:extract Assembled command: 'cd "/opt/local/var/macports/build/_Users_larryv_Projects_MacPorts_git-svn_trunk_dports_sysutils_dwarf/dwarf/work" && /usr/bin/gzip -dc '/opt/local/var/macports/distfiles/dwarf/dwarf-0.3.1.tar.gz' | /usr/bin/tar -xf -'
189:debug:extract Executing command line:  cd "/opt/local/var/macports/build/_Users_larryv_Projects_MacPorts_git-svn_trunk_dports_sysutils_dwarf/dwarf/work" && /usr/bin/gzip -dc '/opt/local/var/macports/distfiles/dwarf/dwarf-0.3.1.tar.gz' | /usr/bin/tar -xf -
190:debug:extract euid/egid changed to: 0/0
191:debug:extract chowned /opt/local/var/macports/build/_Users_larryv_Projects_MacPorts_git-svn_trunk_dports_sysutils_dwarf/dwarf/work to macports
192:debug:extract euid/egid changed to: 502/501
193:debug:extract Privilege de-escalation not attempted as not running as root.
194:debug:patch patch phase started at Thu Mar 19 18:52:52 EDT 2015
195:debug:patch Executing org.macports.patch (dwarf)
196:debug:patch Privilege de-escalation not attempted as not running as root.
197:debug:configure configure phase started at Thu Mar 19 18:52:52 EDT 2015
198:notice:configure --->  Configuring dwarf
199:debug:configure Using compiler 'Xcode Clang'
200:debug:configure Can't run configure ccache on this port without elevated privileges. Escalating privileges back to root.
201:debug:configure euid changed to: 0. egid changed to: 0.
202:debug:configure changing euid/egid - current euid: 0 - current egid: 0
203:debug:configure egid changed to: 501
204:debug:configure euid changed to: 502
205:debug:configure Executing org.macports.configure (dwarf)
206:debug:configure Environment:
207CC='ccache /usr/bin/clang'
208CC_PRINT_OPTIONS='YES'
209CC_PRINT_OPTIONS_FILE='/opt/local/var/macports/build/_Users_larryv_Projects_MacPorts_git-svn_trunk_dports_sysutils_dwarf/dwarf/work/.CC_PRINT_OPTIONS'
210CFLAGS='-pipe -Os -arch x86_64'
211CPATH='/opt/local/include'
212CPPFLAGS='-I/opt/local/include'
213CXX='ccache /usr/bin/clang++'
214CXXFLAGS='-pipe -Os -stdlib=libc++ -arch x86_64'
215F77FLAGS='-m64'
216F90FLAGS='-pipe -Os -m64'
217FCFLAGS='-pipe -Os -m64'
218FFLAGS='-pipe -Os'
219INSTALL='/usr/bin/install -c'
220LDFLAGS='-L/opt/local/lib -Wl,-headerpad_max_install_names -arch x86_64'
221LIBRARY_PATH='/opt/local/lib'
222MACOSX_DEPLOYMENT_TARGET='10.10'
223OBJC='ccache /usr/bin/clang'
224OBJCFLAGS='-pipe -Os -arch x86_64'
225OBJCXX='ccache /usr/bin/clang++'
226OBJCXXFLAGS='-pipe -Os -stdlib=libc++ -arch x86_64'
227:debug:configure Assembled command: 'cd "/opt/local/var/macports/build/_Users_larryv_Projects_MacPorts_git-svn_trunk_dports_sysutils_dwarf/dwarf/work/dwarf-0.3.1" && ./configure --prefix=/opt/local'
228:debug:configure Executing command line:  cd "/opt/local/var/macports/build/_Users_larryv_Projects_MacPorts_git-svn_trunk_dports_sysutils_dwarf/dwarf/work/dwarf-0.3.1" && ./configure --prefix=/opt/local
229:info:configure configure:
230:info:configure         Welcome to the dwarf-ng configure script!
231:info:configure         This script will create the right Makefile for building dwarf-ng on your system.
232:info:configure         But first, it will check if your system has the right configuration for dwarf-ng to build.
233:info:configure
234:info:configure         There are options to this script, please run :
235:info:configure           ./configure --help=short
236:info:configure         for a complete list of these options.
237:info:configure
238:info:configure         Please read BUGS and README and report any bug found to dwarf-ng maintainer!
239:info:configure
240:info:configure checking for a BSD-compatible install... /usr/bin/install -c
241:info:configure checking whether build environment is sane... yes
242:info:configure checking for a thread-safe mkdir -p... /opt/local/bin/gmkdir -p
243:info:configure checking for gawk... no
244:info:configure checking for mawk... no
245:info:configure checking for nawk... no
246:info:configure checking for awk... awk
247:info:configure checking whether make sets $(MAKE)... yes
248:info:configure checking for gcc... ccache /usr/bin/clang
249:info:configure checking whether the C compiler works... yes
250:info:configure checking for C compiler default output file name... a.out
251:info:configure checking for suffix of executables...
252:info:configure checking whether we are cross compiling... no
253:info:configure checking for suffix of object files... o
254:info:configure checking whether we are using the GNU C compiler... yes
255:info:configure checking whether ccache /usr/bin/clang accepts -g... yes
256:info:configure checking for ccache /usr/bin/clang option to accept ISO C89... none needed
257:info:configure checking for style of include used by make... GNU
258:info:configure checking dependency style of ccache /usr/bin/clang... gcc3
259:info:configure checking whether make sets $(MAKE)... (cached) yes
260:info:configure checking how to run the C preprocessor... ccache /usr/bin/clang -E
261:info:configure checking for grep that handles long lines and -e... /usr/bin/grep
262:info:configure checking for egrep... /usr/bin/grep -E
263:info:configure checking for ANSI C header files... yes
264:info:configure checking for flex... flex
265:info:configure checking lex output file root... lex.yy
266:info:configure checking lex library... -lfl
267:info:configure checking whether yytext is a pointer... yes
268:info:configure checking for bison... bison -y
269:info:configure checking for ranlib... ranlib
270:info:configure checking whether ccache /usr/bin/clang and cc understand -c and -o together... yes
271:info:configure checking for mremap... no
272:info:configure checking for mmap... yes
273:info:configure checking for munmap... yes
274:info:configure checking for malloc... yes
275:info:configure checking for open... yes
276:info:configure checking for lseek... yes
277:info:configure checking for fopen... yes
278:info:configure checking for fclose... yes
279:info:configure checking for getopt... yes
280:info:configure checking for getopt_long... yes
281:info:configure checking for ftruncate... yes
282:info:configure checking for strlen... yes
283:info:configure checking for strdup... yes
284:info:configure checking for free... yes
285:info:configure checking for strcmp... yes
286:info:configure checking for isalnum... yes
287:info:configure checking for isdigit... yes
288:info:configure checking for mremap... (cached) no
289:info:configure checking for main in -lreadline... yes
290:info:configure configure: creating ./config.status
291:info:configure config.status: creating Makefile
292:info:configure config.status: creating src/Makefile
293:info:configure config.status: creating src/cmdline/Makefile
294:info:configure config.status: creating src/libdwarf/Makefile
295:info:configure config.status: creating doc/Makefile
296:info:configure config.status: creating config.h
297:info:configure config.status: executing depfiles commands
298:info:configure configure:
299:info:configure         dwarf-ng v0.3.1 has been configured as follows:
300:info:configure
301:info:configure         no-as-needed flag         : no
302:info:configure
303:debug:configure Privilege de-escalation not attempted as not running as root.
304:debug:build build phase started at Thu Mar 19 18:52:55 EDT 2015
305:notice:build --->  Building dwarf
306:debug:build Executing org.macports.build (dwarf)
307:debug:build Environment:
308CC_PRINT_OPTIONS='YES'
309CC_PRINT_OPTIONS_FILE='/opt/local/var/macports/build/_Users_larryv_Projects_MacPorts_git-svn_trunk_dports_sysutils_dwarf/dwarf/work/.CC_PRINT_OPTIONS'
310CPATH='/opt/local/include'
311LIBRARY_PATH='/opt/local/lib'
312MACOSX_DEPLOYMENT_TARGET='10.10'
313:debug:build Assembled command: 'cd "/opt/local/var/macports/build/_Users_larryv_Projects_MacPorts_git-svn_trunk_dports_sysutils_dwarf/dwarf/work/dwarf-0.3.1" && /usr/bin/make -w all'
314:debug:build Executing command line:  cd "/opt/local/var/macports/build/_Users_larryv_Projects_MacPorts_git-svn_trunk_dports_sysutils_dwarf/dwarf/work/dwarf-0.3.1" && /usr/bin/make -w all
315:info:build make: Entering directory `/opt/local/var/macports/build/_Users_larryv_Projects_MacPorts_git-svn_trunk_dports_sysutils_dwarf/dwarf/work/dwarf-0.3.1'
316:info:build (CDPATH="${ZSH_VERSION+.}:" && cd . && /bin/sh /opt/local/var/macports/build/_Users_larryv_Projects_MacPorts_git-svn_trunk_dports_sysutils_dwarf/dwarf/work/dwarf-0.3.1/missing --run autoheader)
317:info:build rm -f stamp-h1
318:info:build touch src/config.h.in
319:info:build cd . && /bin/sh ./config.status config.h
320:info:build config.status: creating config.h
321:info:build config.status: config.h is unchanged
322:info:build /Applications/Xcode.app/Contents/Developer/usr/bin/make  all-recursive
323:info:build make[1]: Entering directory `/opt/local/var/macports/build/_Users_larryv_Projects_MacPorts_git-svn_trunk_dports_sysutils_dwarf/dwarf/work/dwarf-0.3.1'
324:info:build Making all in src
325:info:build make[2]: Entering directory `/opt/local/var/macports/build/_Users_larryv_Projects_MacPorts_git-svn_trunk_dports_sysutils_dwarf/dwarf/work/dwarf-0.3.1/src'
326:info:build Making all in libdwarf
327:info:build make[3]: Entering directory `/opt/local/var/macports/build/_Users_larryv_Projects_MacPorts_git-svn_trunk_dports_sysutils_dwarf/dwarf/work/dwarf-0.3.1/src/libdwarf'
328:info:build /Applications/Xcode.app/Contents/Developer/usr/bin/make  all-am
329:info:build make[4]: Entering directory `/opt/local/var/macports/build/_Users_larryv_Projects_MacPorts_git-svn_trunk_dports_sysutils_dwarf/dwarf/work/dwarf-0.3.1/src/libdwarf'
330:info:build ccache /usr/bin/clang -DHAVE_CONFIG_H -I. -I../..   -I/opt/local/include  -O0 -lm -pipe -Os -arch x86_64 -MT libdwarf_a-y.tab.o -MD -MP -MF .deps/libdwarf_a-y.tab.Tpo -c -o libdwarf_a-y.tab.o `test -f 'y.tab.c' || echo './'`y.tab.c
331:info:build clang: warning: -lm: 'linker' input unused
332:info:build clang: warning: -lm: 'linker' input unused
333:info:build y.tab.c:1318:14: warning: equality comparison with extraneous parentheses [-Wparentheses-equality]
334:info:build   if (((yyn) == (-11)))
335:info:build        ~~~~~~^~~~~~~~
336:info:build y.tab.c:1318:14: note: remove extraneous parentheses around the comparison to silence this warning
337:info:build   if (((yyn) == (-11)))
338:info:build       ~      ^       ~
339:info:build y.tab.c:1318:14: note: use '=' to turn this equality comparison into an assignment
340:info:build   if (((yyn) == (-11)))
341:info:build              ^~
342:info:build              =
343:info:build 1 warning generated.
344:info:build mv -f .deps/libdwarf_a-y.tab.Tpo .deps/libdwarf_a-y.tab.Po
345:info:build ccache /usr/bin/clang -DHAVE_CONFIG_H -I. -I../..   -I/opt/local/include  -O0 -lm -pipe -Os -arch x86_64 -MT libdwarf_a-lex.cfgyy.o -MD -MP -MF .deps/libdwarf_a-lex.cfgyy.Tpo -c -o libdwarf_a-lex.cfgyy.o `test -f 'lex.cfgyy.c' || echo './'`lex.cfgyy.c
346:info:build clang: warning: -lm: 'linker' input unused
347:info:build clang: warning: -lm: 'linker' input unused
348:info:build mv -f .deps/libdwarf_a-lex.cfgyy.Tpo .deps/libdwarf_a-lex.cfgyy.Po
349:info:build ccache /usr/bin/clang -DHAVE_CONFIG_H -I. -I../..   -I/opt/local/include  -O0 -lm -pipe -Os -arch x86_64 -MT libdwarf_a-vars.o -MD -MP -MF .deps/libdwarf_a-vars.Tpo -c -o libdwarf_a-vars.o `test -f 'vars.c' || echo './'`vars.c
350:info:build clang: warning: -lm: 'linker' input unused
351:info:build clang: warning: -lm: 'linker' input unused
352:info:build vars.c:85:16: warning: incompatible pointer to integer conversion assigning to 'off_t' (aka 'long long') from 'off_t *' (aka 'long long *'); dereference with * [-Wint-conversion]
353:info:build    ptr->val.num=x;
354:info:build                ^~
355:info:build                 *
356:info:build vars.c:115:1: warning: control may reach end of non-void function [-Wreturn-type]
357:info:build }
358:info:build ^
359:info:build vars.c:119:1: warning: control reaches end of non-void function [-Wreturn-type]
360:info:build }
361:info:build ^
362:info:build vars.c:123:1: warning: control reaches end of non-void function [-Wreturn-type]
363:info:build }
364:info:build ^
365:info:build 4 warnings generated.
366:info:build mv -f .deps/libdwarf_a-vars.Tpo .deps/libdwarf_a-vars.Po
367:info:build ccache /usr/bin/clang -DHAVE_CONFIG_H -I. -I../..   -I/opt/local/include  -O0 -lm -pipe -Os -arch x86_64 -MT libdwarf_a-utils.o -MD -MP -MF .deps/libdwarf_a-utils.Tpo -c -o libdwarf_a-utils.o `test -f 'utils.c' || echo './'`utils.c
368:info:build clang: warning: -lm: 'linker' input unused
369:info:build clang: warning: -lm: 'linker' input unused
370:info:build utils.c:93:55: warning: incompatible pointer types passing 'int *' to parameter of type 'uint16_t *' (aka 'unsigned short *') [-Wincompatible-pointer-types]
371:info:build  if(fc_ptr->cpu_endian==little_endian) endian_swap_16(&res);
372:info:build                                                       ^~~~
373:info:build utils.c:41:38: note: passing argument to parameter 'x' here
374:info:build inline void endian_swap_16(uint16_t *x)
375:info:build                                      ^
376:info:build utils.c:103:55: warning: passing 'int *' to parameter of type 'uint32_t *' (aka 'unsigned int *') converts between pointers to integer types with different sign [-Wpointer-sign]
377:info:build  if(fc_ptr->cpu_endian==little_endian) endian_swap_32(&res);
378:info:build                                                       ^~~~
379:info:build utils.c:47:38: note: passing argument to parameter 'x' here
380:info:build inline void endian_swap_32(uint32_t *x)
381:info:build                                      ^
382:info:build utils.c:114:55: warning: incompatible pointer types passing 'int *' to parameter of type 'uint64_t *' (aka 'unsigned long long *') [-Wincompatible-pointer-types]
383:info:build  if(fc_ptr->cpu_endian==little_endian) endian_swap_64(&res);
384:info:build                                                       ^~~~
385:info:build utils.c:56:38: note: passing argument to parameter 'x' here
386:info:build inline void endian_swap_64(uint64_t *x)
387:info:build                                      ^
388:info:build utils.c:201:7: warning: implicit declaration of function 'isprint' is invalid in C99 [-Wimplicit-function-declaration]
389:info:build    if(isprint(*uc)) printf("%c",*uc); else printf(".");
390:info:build       ^
391:info:build 4 warnings generated.
392:info:build mv -f .deps/libdwarf_a-utils.Tpo .deps/libdwarf_a-utils.Po
393:info:build ccache /usr/bin/clang -DHAVE_CONFIG_H -I. -I../..   -I/opt/local/include  -O0 -lm -pipe -Os -arch x86_64 -MT libdwarf_a-libdwarf.o -MD -MP -MF .deps/libdwarf_a-libdwarf.Tpo -c -o libdwarf_a-libdwarf.o `test -f 'libdwarf.c' || echo './'`libdwarf.c
394:info:build clang: warning: -lm: 'linker' input unused
395:info:build clang: warning: -lm: 'linker' input unused
396:info:build libdwarf.c:63:2: warning: implicit declaration of function 'cfgyyparse' is invalid in C99 [-Wimplicit-function-declaration]
397:info:build  cfgyyparse();
398:info:build  ^
399:info:build libdwarf.c:314:81: warning: format specifies type 'long' but the argument has type 'off_t' (aka 'long long') [-Wformat]
400:info:build  __builtin___sprintf_chk (s, 0, __builtin_object_size (s, 2 > 1 ? 1 : 0), "%ld",num);
401:info:build                                                                            ~~~  ^~~
402:info:build                                                                            %lld
403:info:build libdwarf.c:338:43: error: non-void function 'growth' should return a value [-Wreturn-type]
404:info:build  if(!fc_ptr) {printf("no file opened!\n");return;}
405:info:build                                           ^
406:info:build libdwarf.c:360:43: error: non-void function 'shrink' should return a value [-Wreturn-type]
407:info:build  if(!fc_ptr) {printf("no file opened!\n");return;}
408:info:build                                           ^
409:info:build 2 warnings and 2 errors generated.
410:info:build make[4]: *** [libdwarf_a-libdwarf.o] Error 1
411:info:build make[4]: Leaving directory `/opt/local/var/macports/build/_Users_larryv_Projects_MacPorts_git-svn_trunk_dports_sysutils_dwarf/dwarf/work/dwarf-0.3.1/src/libdwarf'
412:info:build make[3]: *** [all] Error 2
413:info:build make[3]: Leaving directory `/opt/local/var/macports/build/_Users_larryv_Projects_MacPorts_git-svn_trunk_dports_sysutils_dwarf/dwarf/work/dwarf-0.3.1/src/libdwarf'
414:info:build make[2]: *** [all-recursive] Error 1
415:info:build make[2]: Leaving directory `/opt/local/var/macports/build/_Users_larryv_Projects_MacPorts_git-svn_trunk_dports_sysutils_dwarf/dwarf/work/dwarf-0.3.1/src'
416:info:build make[1]: *** [all-recursive] Error 1
417:info:build make[1]: Leaving directory `/opt/local/var/macports/build/_Users_larryv_Projects_MacPorts_git-svn_trunk_dports_sysutils_dwarf/dwarf/work/dwarf-0.3.1'
418:info:build make: *** [all] Error 2
419:info:build make: Leaving directory `/opt/local/var/macports/build/_Users_larryv_Projects_MacPorts_git-svn_trunk_dports_sysutils_dwarf/dwarf/work/dwarf-0.3.1'
420:info:build Command failed:  cd "/opt/local/var/macports/build/_Users_larryv_Projects_MacPorts_git-svn_trunk_dports_sysutils_dwarf/dwarf/work/dwarf-0.3.1" && /usr/bin/make -w all
421:info:build Exit code: 2
422:error:build Failed to build dwarf: command execution failed
423:debug:build Error code: CHILDSTATUS 20480 2
424:debug:build Backtrace: command execution failed
425    while executing
426"system {*}$notty {*}$nice $fullcmdstring"
427    invoked from within
428"command_exec build"
429    (procedure "portbuild::build_main" line 8)
430    invoked from within
431"$procedure $targetname"
432:error:build See /opt/local/var/macports/logs/_Users_larryv_Projects_MacPorts_git-svn_trunk_dports_sysutils_dwarf/dwarf/main.log for details.