Ticket #40863: bonniexx.buildlog.txt

File bonniexx.buildlog.txt, 50.5 KB (added by takanori@…, 5 years ago)
Line 
1DEBUG: Executing org.macports.main (bonniexx)
2DEBUG: changing euid/egid - current euid: 0 - current egid: 0
3DEBUG: egid changed to: 501
4DEBUG: euid changed to: 502
5DEBUG: fetch phase started at Thu Oct 24 00:09:18 JST 2013
6--->  Fetching distfiles for bonniexx
7DEBUG: Can't run fetch on this port without elevated privileges. Escalating privileges back to root.
8DEBUG: euid changed to: 0. egid changed to: 0.
9DEBUG: changing euid/egid - current euid: 0 - current egid: 0
10DEBUG: egid changed to: 501
11DEBUG: euid changed to: 502
12DEBUG: Executing org.macports.fetch (bonniexx)
13--->  bonnie++-1.96.tgz doesn't seem to exist in /opt/local/var/macports/distfiles/bonniexx
14--->  Attempting to fetch bonnie++-1.96.tgz from http://cjj.kr.distfiles.macports.org/bonniexx
15DEBUG: Privilege de-escalation not attempted as not running as root.
16DEBUG: checksum phase started at Thu Oct 24 00:09:26 JST 2013
17--->  Verifying checksums for bonniexx
18DEBUG: Executing org.macports.checksum (bonniexx)
19--->  Checksumming bonnie++-1.96.tgz
20DEBUG: Correct (rmd160) checksum for bonnie++-1.96.tgz
21DEBUG: Privilege de-escalation not attempted as not running as root.
22DEBUG: extract phase started at Thu Oct 24 00:09:27 JST 2013
23--->  Extracting bonniexx
24DEBUG: Executing org.macports.extract (bonniexx)
25--->  Extracting bonnie++-1.96.tgz
26DEBUG: setting option extract.args to '/opt/local/var/macports/distfiles/bonniexx/bonnie++-1.96.tgz'
27DEBUG: Environment: CPATH='/opt/local/include' CC_PRINT_OPTIONS_FILE='/opt/local/var/macports/build/_opt_local_var_macports_sources_rsync.macports.org_release_tarballs_ports_benchmarks_bonniexx/bonniexx/work/.CC_PRINT_OPTIONS' LIBRARY_PATH='/opt/local/lib' CC_PRINT_OPTIONS='YES' MACOSX_DEPLOYMENT_TARGET='10.9'
28DEBUG: Assembled command: 'cd "/opt/local/var/macports/build/_opt_local_var_macports_sources_rsync.macports.org_release_tarballs_ports_benchmarks_bonniexx/bonniexx/work" && /usr/bin/gzip -dc '/opt/local/var/macports/distfiles/bonniexx/bonnie++-1.96.tgz' | /usr/bin/tar -xf -'
29DEBUG: Executing command line:  cd "/opt/local/var/macports/build/_opt_local_var_macports_sources_rsync.macports.org_release_tarballs_ports_benchmarks_bonniexx/bonniexx/work" && /usr/bin/gzip -dc '/opt/local/var/macports/distfiles/bonniexx/bonnie++-1.96.tgz' | /usr/bin/tar -xf -
30DEBUG: euid/egid changed to: 0/0
31DEBUG: chowned /opt/local/var/macports/build/_opt_local_var_macports_sources_rsync.macports.org_release_tarballs_ports_benchmarks_bonniexx/bonniexx/work to macports
32DEBUG: euid/egid changed to: 502/501
33DEBUG: Privilege de-escalation not attempted as not running as root.
34DEBUG: patch phase started at Thu Oct 24 00:09:27 JST 2013
35DEBUG: Executing proc-pre-org.macports.patch-patch-0
36DEBUG: Executing reinplace: /usr/bin/sed s|/usr/share/|/opt/local/share/|g < /opt/local/var/macports/build/_opt_local_var_macports_sources_rsync.macports.org_release_tarballs_ports_benchmarks_bonniexx/bonniexx/work/bonnie++-1.96/bonnie++.8 >@ file11
37DEBUG: euid/egid changed to: 0/0
38DEBUG: chowned /opt/local/var/macports/build/_opt_local_var_macports_sources_rsync.macports.org_release_tarballs_ports_benchmarks_bonniexx/bonniexx/work/bonnie++-1.96/bonnie++.8 to macports
39DEBUG: euid/egid changed to: 502/501
40DEBUG: euid/egid changed to: 0/0
41DEBUG: setting attributes on /opt/local/var/macports/build/_opt_local_var_macports_sources_rsync.macports.org_release_tarballs_ports_benchmarks_bonniexx/bonniexx/work/bonnie++-1.96/bonnie++.8
42DEBUG: euid/egid changed to: 502/501
43DEBUG: Executing org.macports.patch (bonniexx)
44--->  Applying patches to bonniexx
45--->  Applying patch-Makefile.in
46DEBUG: Environment: CPATH='/opt/local/include' CC_PRINT_OPTIONS_FILE='/opt/local/var/macports/build/_opt_local_var_macports_sources_rsync.macports.org_release_tarballs_ports_benchmarks_bonniexx/bonniexx/work/.CC_PRINT_OPTIONS' LIBRARY_PATH='/opt/local/lib' CC_PRINT_OPTIONS='YES' MACOSX_DEPLOYMENT_TARGET='10.9'
47DEBUG: Assembled command: 'cd "/opt/local/var/macports/build/_opt_local_var_macports_sources_rsync.macports.org_release_tarballs_ports_benchmarks_bonniexx/bonniexx/work/bonnie++-1.96" && /usr/bin/patch -p0'
48DEBUG: Executing command line:  cd "/opt/local/var/macports/build/_opt_local_var_macports_sources_rsync.macports.org_release_tarballs_ports_benchmarks_bonniexx/bonniexx/work/bonnie++-1.96" && /usr/bin/patch -p0 < '/opt/local/var/macports/sources/rsync.macports.org/release/tarballs/ports/benchmarks/bonniexx/files/patch-Makefile.in'
49patching file Makefile.in
50--->  Applying patch-bonnie++.cpp
51DEBUG: Environment: CPATH='/opt/local/include' CC_PRINT_OPTIONS_FILE='/opt/local/var/macports/build/_opt_local_var_macports_sources_rsync.macports.org_release_tarballs_ports_benchmarks_bonniexx/bonniexx/work/.CC_PRINT_OPTIONS' LIBRARY_PATH='/opt/local/lib' CC_PRINT_OPTIONS='YES' MACOSX_DEPLOYMENT_TARGET='10.9'
52DEBUG: Assembled command: 'cd "/opt/local/var/macports/build/_opt_local_var_macports_sources_rsync.macports.org_release_tarballs_ports_benchmarks_bonniexx/bonniexx/work/bonnie++-1.96" && /usr/bin/patch -p0'
53DEBUG: Executing command line:  cd "/opt/local/var/macports/build/_opt_local_var_macports_sources_rsync.macports.org_release_tarballs_ports_benchmarks_bonniexx/bonniexx/work/bonnie++-1.96" && /usr/bin/patch -p0 < '/opt/local/var/macports/sources/rsync.macports.org/release/tarballs/ports/benchmarks/bonniexx/files/patch-bonnie++.cpp'
54patching file bonnie++.cpp
55--->  Applying patch-bonnie.h.in.diff
56DEBUG: Environment: CPATH='/opt/local/include' CC_PRINT_OPTIONS_FILE='/opt/local/var/macports/build/_opt_local_var_macports_sources_rsync.macports.org_release_tarballs_ports_benchmarks_bonniexx/bonniexx/work/.CC_PRINT_OPTIONS' LIBRARY_PATH='/opt/local/lib' CC_PRINT_OPTIONS='YES' MACOSX_DEPLOYMENT_TARGET='10.9'
57DEBUG: Assembled command: 'cd "/opt/local/var/macports/build/_opt_local_var_macports_sources_rsync.macports.org_release_tarballs_ports_benchmarks_bonniexx/bonniexx/work/bonnie++-1.96" && /usr/bin/patch -p0'
58DEBUG: Executing command line:  cd "/opt/local/var/macports/build/_opt_local_var_macports_sources_rsync.macports.org_release_tarballs_ports_benchmarks_bonniexx/bonniexx/work/bonnie++-1.96" && /usr/bin/patch -p0 < '/opt/local/var/macports/sources/rsync.macports.org/release/tarballs/ports/benchmarks/bonniexx/files/patch-bonnie.h.in.diff'
59patching file bonnie.h.in
60--->  Applying patch-port.h.in
61DEBUG: Environment: CPATH='/opt/local/include' CC_PRINT_OPTIONS_FILE='/opt/local/var/macports/build/_opt_local_var_macports_sources_rsync.macports.org_release_tarballs_ports_benchmarks_bonniexx/bonniexx/work/.CC_PRINT_OPTIONS' LIBRARY_PATH='/opt/local/lib' CC_PRINT_OPTIONS='YES' MACOSX_DEPLOYMENT_TARGET='10.9'
62DEBUG: Assembled command: 'cd "/opt/local/var/macports/build/_opt_local_var_macports_sources_rsync.macports.org_release_tarballs_ports_benchmarks_bonniexx/bonniexx/work/bonnie++-1.96" && /usr/bin/patch -p0'
63DEBUG: Executing command line:  cd "/opt/local/var/macports/build/_opt_local_var_macports_sources_rsync.macports.org_release_tarballs_ports_benchmarks_bonniexx/bonniexx/work/bonnie++-1.96" && /usr/bin/patch -p0 < '/opt/local/var/macports/sources/rsync.macports.org/release/tarballs/ports/benchmarks/bonniexx/files/patch-port.h.in'
64patching file port.h.in
65--->  Applying patch-zcav.8
66DEBUG: Environment: CPATH='/opt/local/include' CC_PRINT_OPTIONS_FILE='/opt/local/var/macports/build/_opt_local_var_macports_sources_rsync.macports.org_release_tarballs_ports_benchmarks_bonniexx/bonniexx/work/.CC_PRINT_OPTIONS' LIBRARY_PATH='/opt/local/lib' CC_PRINT_OPTIONS='YES' MACOSX_DEPLOYMENT_TARGET='10.9'
67DEBUG: Assembled command: 'cd "/opt/local/var/macports/build/_opt_local_var_macports_sources_rsync.macports.org_release_tarballs_ports_benchmarks_bonniexx/bonniexx/work/bonnie++-1.96" && /usr/bin/patch -p0'
68DEBUG: Executing command line:  cd "/opt/local/var/macports/build/_opt_local_var_macports_sources_rsync.macports.org_release_tarballs_ports_benchmarks_bonniexx/bonniexx/work/bonnie++-1.96" && /usr/bin/patch -p0 < '/opt/local/var/macports/sources/rsync.macports.org/release/tarballs/ports/benchmarks/bonniexx/files/patch-zcav.8'
69patching file zcav.8
70--->  Applying patch-zcav.cpp
71DEBUG: Environment: CPATH='/opt/local/include' CC_PRINT_OPTIONS_FILE='/opt/local/var/macports/build/_opt_local_var_macports_sources_rsync.macports.org_release_tarballs_ports_benchmarks_bonniexx/bonniexx/work/.CC_PRINT_OPTIONS' LIBRARY_PATH='/opt/local/lib' CC_PRINT_OPTIONS='YES' MACOSX_DEPLOYMENT_TARGET='10.9'
72DEBUG: Assembled command: 'cd "/opt/local/var/macports/build/_opt_local_var_macports_sources_rsync.macports.org_release_tarballs_ports_benchmarks_bonniexx/bonniexx/work/bonnie++-1.96" && /usr/bin/patch -p0'
73DEBUG: Executing command line:  cd "/opt/local/var/macports/build/_opt_local_var_macports_sources_rsync.macports.org_release_tarballs_ports_benchmarks_bonniexx/bonniexx/work/bonnie++-1.96" && /usr/bin/patch -p0 < '/opt/local/var/macports/sources/rsync.macports.org/release/tarballs/ports/benchmarks/bonniexx/files/patch-zcav.cpp'
74patching file zcav.cpp
75--->  Applying patch-zcav_io.cpp
76DEBUG: Environment: CPATH='/opt/local/include' CC_PRINT_OPTIONS_FILE='/opt/local/var/macports/build/_opt_local_var_macports_sources_rsync.macports.org_release_tarballs_ports_benchmarks_bonniexx/bonniexx/work/.CC_PRINT_OPTIONS' LIBRARY_PATH='/opt/local/lib' CC_PRINT_OPTIONS='YES' MACOSX_DEPLOYMENT_TARGET='10.9'
77DEBUG: Assembled command: 'cd "/opt/local/var/macports/build/_opt_local_var_macports_sources_rsync.macports.org_release_tarballs_ports_benchmarks_bonniexx/bonniexx/work/bonnie++-1.96" && /usr/bin/patch -p0'
78DEBUG: Executing command line:  cd "/opt/local/var/macports/build/_opt_local_var_macports_sources_rsync.macports.org_release_tarballs_ports_benchmarks_bonniexx/bonniexx/work/bonnie++-1.96" && /usr/bin/patch -p0 < '/opt/local/var/macports/sources/rsync.macports.org/release/tarballs/ports/benchmarks/bonniexx/files/patch-zcav_io.cpp'
79patching file zcav_io.cpp
80DEBUG: Privilege de-escalation not attempted as not running as root.
81DEBUG: configure phase started at Thu Oct 24 00:09:27 JST 2013
82--->  Configuring bonniexx
83DEBUG: Using compiler 'Mac OS X Clang'
84DEBUG: Executing org.macports.configure (bonniexx)
85DEBUG: Environment: CPATH='/opt/local/include' CFLAGS='-pipe -Os -arch x86_64' CPPFLAGS='-I/opt/local/include' CXXFLAGS='-pipe -Os -arch x86_64' LIBRARY_PATH='/opt/local/lib' MACOSX_DEPLOYMENT_TARGET='10.9' CXX='/usr/bin/clang++' CC_PRINT_OPTIONS_FILE='/opt/local/var/macports/build/_opt_local_var_macports_sources_rsync.macports.org_release_tarballs_ports_benchmarks_bonniexx/bonniexx/work/.CC_PRINT_OPTIONS' F90FLAGS='-pipe -Os -m64' LDFLAGS='-L/opt/local/lib -Wl,-headerpad_max_install_names -arch x86_64' OBJC='/usr/bin/clang' FCFLAGS='-pipe -Os -m64' INSTALL='/usr/bin/install -c' OBJCFLAGS='-pipe -Os -arch x86_64' FFLAGS='-pipe -Os -m64' CC_PRINT_OPTIONS='YES' CC='/usr/bin/clang'
86DEBUG: Assembled command: 'cd "/opt/local/var/macports/build/_opt_local_var_macports_sources_rsync.macports.org_release_tarballs_ports_benchmarks_bonniexx/bonniexx/work/bonnie++-1.96" && ./configure --prefix=/opt/local'
87DEBUG: Executing command line:  cd "/opt/local/var/macports/build/_opt_local_var_macports_sources_rsync.macports.org_release_tarballs_ports_benchmarks_bonniexx/bonniexx/work/bonnie++-1.96" && ./configure --prefix=/opt/local
88checking for gcc... /usr/bin/clang
89checking for C compiler default output file name... a.out
90checking whether the C compiler works... yes
91checking whether we are cross compiling... no
92checking for suffix of executables...
93checking for suffix of object files... o
94checking whether we are using the GNU C compiler... yes
95checking whether /usr/bin/clang accepts -g... yes
96checking for /usr/bin/clang option to accept ISO C89... none needed
97checking whether we are using the GNU C++ compiler... yes
98checking whether /usr/bin/clang++ accepts -g... yes
99checking how to run the C++ preprocessor... /usr/bin/clang++ -E
100checking for a BSD-compatible install... /usr/bin/install -c
101checking for an ANSI C-conforming const... yes
102checking for grep that handles long lines and -e... /usr/bin/grep
103checking for egrep... /usr/bin/grep -E
104checking for ANSI C header files... yes
105checking for sys/types.h... yes
106checking for sys/stat.h... yes
107checking for stdlib.h... yes
108checking for string.h... yes
109checking for memory.h... yes
110checking for strings.h... yes
111checking for inttypes.h... yes
112checking for stdint.h... yes
113checking for unistd.h... yes
114checking for size_t... yes
115checking algorithm usability... yes
116checking algorithm presence... yes
117checking for algorithm... yes
118checking algo.h usability... no
119checking algo.h presence... no
120checking for algo.h... no
121checking algo usability... no
122checking algo presence... no
123checking for algo... no
124configure: creating ./config.status
125config.status: creating Makefile
126config.status: WARNING:  Makefile.in seems to ignore the --datarootdir setting
127config.status: creating bonnie.h
128config.status: creating port.h
129config.status: creating bonnie++.spec
130config.status: creating bon_csv2txt
131config.status: creating bon_csv2html.1
132config.status: creating sun/pkginfo
133config.status: creating conf.h
134config.status: conf.h is unchanged
135DEBUG: Privilege de-escalation not attempted as not running as root.
136DEBUG: build phase started at Thu Oct 24 00:09:31 JST 2013
137--->  Building bonniexx
138DEBUG: Executing org.macports.build (bonniexx)
139DEBUG: Environment: CPATH='/opt/local/include' CC_PRINT_OPTIONS_FILE='/opt/local/var/macports/build/_opt_local_var_macports_sources_rsync.macports.org_release_tarballs_ports_benchmarks_bonniexx/bonniexx/work/.CC_PRINT_OPTIONS' LIBRARY_PATH='/opt/local/lib' CC_PRINT_OPTIONS='YES' MACOSX_DEPLOYMENT_TARGET='10.9'
140DEBUG: Assembled command: 'cd "/opt/local/var/macports/build/_opt_local_var_macports_sources_rsync.macports.org_release_tarballs_ports_benchmarks_bonniexx/bonniexx/work/bonnie++-1.96" && /usr/bin/make -j4 -w all'
141DEBUG: Executing command line:  cd "/opt/local/var/macports/build/_opt_local_var_macports_sources_rsync.macports.org_release_tarballs_ports_benchmarks_bonniexx/bonniexx/work/bonnie++-1.96" && /usr/bin/make -j4 -w all
142make: Entering directory `/opt/local/var/macports/build/_opt_local_var_macports_sources_rsync.macports.org_release_tarballs_ports_benchmarks_bonniexx/bonniexx/work/bonnie++-1.96'
143/usr/bin/clang++  -DNDEBUG -Wall -W -Wshadow -Wpointer-arith -Wwrite-strings -pedantic -ffor-scope -Wcast-align -Wsign-compare -Wpointer-arith -Wwrite-strings -Wformat-security -Wswitch-enum -Winit-self   -c bon_csv2html.cpp
144/usr/bin/clang++  -DNDEBUG -Wall -W -Wshadow -Wpointer-arith -Wwrite-strings -pedantic -ffor-scope -Wcast-align -Wsign-compare -Wpointer-arith -Wwrite-strings -Wformat-security -Wswitch-enum -Winit-self   -c generate_randfile.cpp
145/usr/bin/clang++  -DNDEBUG -Wall -W -Wshadow -Wpointer-arith -Wwrite-strings -pedantic -ffor-scope -Wcast-align -Wsign-compare -Wpointer-arith -Wwrite-strings -Wformat-security -Wswitch-enum -Winit-self   -c bonnie++.cpp
146/usr/bin/clang++  -DNDEBUG -Wall -W -Wshadow -Wpointer-arith -Wwrite-strings -pedantic -ffor-scope -Wcast-align -Wsign-compare -Wpointer-arith -Wwrite-strings -Wformat-security -Wswitch-enum -Winit-self   -c bon_io.cpp
147In file included from bon_io.cpp:1:
148./bonnie.h:4:17: warning: using directive refers to implicitly-defined namespace 'std'
149using namespace std;
150                ^
151In file included from bon_csv2html.cpp:1:
152./bonnie.h:4:17: warning: using directive refers to implicitly-defined namespace 'std'
153In file included from bonnie++.cpp:20:
154./bonnie.h:4:17: warning: using directive refers to implicitly-defined namespace 'std'
155using namespace std;
156                ^
157using namespace std;
158                ^
159In file included from bonnie++.cpp:26:
160In file included from /Applications/Xcode.app/Contents/Developer/Toolchains/XcodeDefault.xctoolchain/usr/bin/../lib/c++/v1/algorithm:594:
161In file included from /Applications/Xcode.app/Contents/Developer/Toolchains/XcodeDefault.xctoolchain/usr/bin/../lib/c++/v1/memory:595:
162In file included from /Applications/Xcode.app/Contents/Developer/Toolchains/XcodeDefault.xctoolchain/usr/bin/../lib/c++/v1/limits:111:
163/Applications/Xcode.app/Contents/Developer/Toolchains/XcodeDefault.xctoolchain/usr/bin/../lib/c++/v1/__undef_min_max:12:2: warning: : macro min is incompatible with C++.  #undefing min [-W#warnings]
164#warning: macro min is incompatible with C++.  #undefing min
165 ^
166/Applications/Xcode.app/Contents/Developer/Toolchains/XcodeDefault.xctoolchain/usr/bin/../lib/c++/v1/__undef_min_max:17:2: warning: : macro max is incompatible with C++.  #undefing max [-W#warnings]
167#warning: macro max is incompatible with C++.  #undefing max
168 ^
169In file included from bonnie++.cpp:26:
170In file included from /Applications/Xcode.app/Contents/Developer/Toolchains/XcodeDefault.xctoolchain/usr/bin/../lib/c++/v1/algorithm:594:
171In file included from /Applications/Xcode.app/Contents/Developer/Toolchains/XcodeDefault.xctoolchain/usr/bin/../lib/c++/v1/memory:595:
172/Applications/Xcode.app/Contents/Developer/Toolchains/XcodeDefault.xctoolchain/usr/bin/../lib/c++/v1/limits:206:61: error: redefinition of 'min' as different kind of symbol
173    _LIBCPP_INLINE_VISIBILITY static _LIBCPP_CONSTEXPR type min() _NOEXCEPT {return __min;}
174                                                            ^
175/Applications/Xcode.app/Contents/Developer/Toolchains/XcodeDefault.xctoolchain/usr/bin/../lib/c++/v1/limits:204:41: note: previous definition is here
176    static _LIBCPP_CONSTEXPR const type __min = __libcpp_compute_min<type, digits, is_signed>::value;
177                                        ^
178./port.h:42:15: note: expanded from macro '__min'
179#define __min min
180              ^
181In file included from bonnie++.cpp:26:
182In file included from /Applications/Xcode.app/Contents/Developer/Toolchains/XcodeDefault.xctoolchain/usr/bin/../lib/c++/v1/algorithm:594:
183In file included from /Applications/Xcode.app/Contents/Developer/Toolchains/XcodeDefault.xctoolchain/usr/bin/../lib/c++/v1/memory:595:
184/Applications/Xcode.app/Contents/Developer/Toolchains/XcodeDefault.xctoolchain/usr/bin/../lib/c++/v1/limits:207:61: error: redefinition of 'max' as different kind of symbol
185    _LIBCPP_INLINE_VISIBILITY static _LIBCPP_CONSTEXPR type max() _NOEXCEPT {return __max;}
186                                                            ^
187/Applications/Xcode.app/Contents/Developer/Toolchains/XcodeDefault.xctoolchain/usr/bin/../lib/c++/v1/limits:205:41: note: previous definition is here
188    static _LIBCPP_CONSTEXPR const type __max = is_signed ? type(type(~0) ^ __min) : type(~0);
189                                        ^
190./port.h:43:15: note: expanded from macro '__max'
191#define __max max
192              ^
193In file included from bonnie++.cpp:26:
194In file included from /Applications/Xcode.app/Contents/Developer/Toolchains/XcodeDefault.xctoolchain/usr/bin/../lib/c++/v1/algorithm:594:
195In file included from /Applications/Xcode.app/Contents/Developer/Toolchains/XcodeDefault.xctoolchain/usr/bin/../lib/c++/v1/memory:595:
196/Applications/Xcode.app/Contents/Developer/Toolchains/XcodeDefault.xctoolchain/usr/bin/../lib/c++/v1/limits:258:61: error: redefinition of 'min' as different kind of symbol
197    _LIBCPP_INLINE_VISIBILITY static _LIBCPP_CONSTEXPR type min() _NOEXCEPT {return __min;}
198                                                            ^
199/Applications/Xcode.app/Contents/Developer/Toolchains/XcodeDefault.xctoolchain/usr/bin/../lib/c++/v1/limits:256:41: note: previous definition is here
200    static _LIBCPP_CONSTEXPR const type __min = false;
201                                        ^
202./port.h:42:15: note: expanded from macro '__min'
203#define __min min
204              ^
205In file included from bonnie++.cpp:26:
206In file included from /Applications/Xcode.app/Contents/Developer/Toolchains/XcodeDefault.xctoolchain/usr/bin/../lib/c++/v1/algorithm:594:
207In file included from /Applications/Xcode.app/Contents/Developer/Toolchains/XcodeDefault.xctoolchain/usr/bin/../lib/c++/v1/memory:595:
208/Applications/Xcode.app/Contents/Developer/Toolchains/XcodeDefault.xctoolchain/usr/bin/../lib/c++/v1/limits:259:61: error: redefinition of 'max' as different kind of symbol
209    _LIBCPP_INLINE_VISIBILITY static _LIBCPP_CONSTEXPR type max() _NOEXCEPT {return __max;}
210                                                            ^
211/Applications/Xcode.app/Contents/Developer/Toolchains/XcodeDefault.xctoolchain/usr/bin/../lib/c++/v1/limits:257:41: note: previous definition is here
212    static _LIBCPP_CONSTEXPR const type __max = true;
213                                        ^
214./port.h:43:15: note: expanded from macro '__max'
215#define __max max
216              ^
217In file included from bonnie++.cpp:26:
218In file included from /Applications/Xcode.app/Contents/Developer/Toolchains/XcodeDefault.xctoolchain/usr/bin/../lib/c++/v1/algorithm:594:
219In file included from /Applications/Xcode.app/Contents/Developer/Toolchains/XcodeDefault.xctoolchain/usr/bin/../lib/c++/v1/memory:595:
220/Applications/Xcode.app/Contents/Developer/Toolchains/XcodeDefault.xctoolchain/usr/bin/../lib/c++/v1/limits:260:91: error: called object type 'int' is not a function or function pointer
221    _LIBCPP_INLINE_VISIBILITY static _LIBCPP_CONSTEXPR type lowest() _NOEXCEPT {return min();}
222                                                                                       ~~~^
223/usr/bin/clang++  -DNDEBUG -Wall -W -Wshadow -Wpointer-arith -Wwrite-strings -pedantic -ffor-scope -Wcast-align -Wsign-compare -Wpointer-arith -Wwrite-strings -Wformat-security -Wswitch-enum -Winit-self   -c bon_file.cpp
224In file included from bon_csv2html.cpp:4:
225In file included from /Applications/Xcode.app/Contents/Developer/Toolchains/XcodeDefault.xctoolchain/usr/bin/../lib/c++/v1/vector:261:
226In file included from /Applications/Xcode.app/Contents/Developer/Toolchains/XcodeDefault.xctoolchain/usr/bin/../lib/c++/v1/__bit_reference:15:
227In file included from /Applications/Xcode.app/Contents/Developer/Toolchains/XcodeDefault.xctoolchain/usr/bin/../lib/c++/v1/algorithm:594:
228In file included from /Applications/Xcode.app/Contents/Developer/Toolchains/XcodeDefault.xctoolchain/usr/bin/../lib/c++/v1/memory:595:
229In file included from /Applications/Xcode.app/Contents/Developer/Toolchains/XcodeDefault.xctoolchain/usr/bin/../lib/c++/v1/limits:111:
230/Applications/Xcode.app/Contents/Developer/Toolchains/XcodeDefault.xctoolchain/usr/bin/../lib/c++/v1/__undef_min_max:12:2: warning: : macro min is incompatible with C++.  #undefing min [-W#warnings]
231#warning: macro min is incompatible with C++.  #undefing min
232 ^
233/Applications/Xcode.app/Contents/Developer/Toolchains/XcodeDefault.xctoolchain/usr/bin/../lib/c++/v1/__undef_min_max:17:2: warning: : macro max is incompatible with C++.  #undefing max [-W#warnings]
234#warning: macro max is incompatible with C++.  #undefing max
235 ^
236In file included from bon_csv2html.cpp:4:
237In file included from /Applications/Xcode.app/Contents/Developer/Toolchains/XcodeDefault.xctoolchain/usr/bin/../lib/c++/v1/vector:261:
238In file included from /Applications/Xcode.app/Contents/Developer/Toolchains/XcodeDefault.xctoolchain/usr/bin/../lib/c++/v1/__bit_reference:15:
239In file included from /Applications/Xcode.app/Contents/Developer/Toolchains/XcodeDefault.xctoolchain/usr/bin/../lib/c++/v1/algorithm:594:
240In file included from /Applications/Xcode.app/Contents/Developer/Toolchains/XcodeDefault.xctoolchain/usr/bin/../lib/c++/v1/memory:595:
241/Applications/Xcode.app/Contents/Developer/Toolchains/XcodeDefault.xctoolchain/usr/bin/../lib/c++/v1/limits:206:61: error: redefinition of 'min' as different kind of symbol
242    _LIBCPP_INLINE_VISIBILITY static _LIBCPP_CONSTEXPR type min() _NOEXCEPT {return __min;}
243                                                            ^
244/Applications/Xcode.app/Contents/Developer/Toolchains/XcodeDefault.xctoolchain/usr/bin/../lib/c++/v1/limits:204:41: note: previous definition is here
245    static _LIBCPP_CONSTEXPR const type __min = __libcpp_compute_min<type, digits, is_signed>::value;
246                                        ^
247./port.h:42:15: note: expanded from macro '__min'
248#define __min min
249              ^
250In file included from bon_csv2html.cpp:4:
251In file included from /Applications/Xcode.app/Contents/Developer/Toolchains/XcodeDefault.xctoolchain/usr/bin/../lib/c++/v1/vector:261:
252In file included from /Applications/Xcode.app/Contents/Developer/Toolchains/XcodeDefault.xctoolchain/usr/bin/../lib/c++/v1/__bit_reference:15:
253In file included from /Applications/Xcode.app/Contents/Developer/Toolchains/XcodeDefault.xctoolchain/usr/bin/../lib/c++/v1/algorithm:594:
254In file included from /Applications/Xcode.app/Contents/Developer/Toolchains/XcodeDefault.xctoolchain/usr/bin/../lib/c++/v1/memory:595:
255/Applications/Xcode.app/Contents/Developer/Toolchains/XcodeDefault.xctoolchain/usr/bin/../lib/c++/v1/limits:207:61: error: redefinition of 'max' as different kind of symbol
256    _LIBCPP_INLINE_VISIBILITY static _LIBCPP_CONSTEXPR type max() _NOEXCEPT {return __max;}
257                                                            ^
258/Applications/Xcode.app/Contents/Developer/Toolchains/XcodeDefault.xctoolchain/usr/bin/../lib/c++/v1/limits:205:41: note: previous definition is here
259    static _LIBCPP_CONSTEXPR const type __max = is_signed ? type(type(~0) ^ __min) : type(~0);
260                                        ^
261./port.h:43:15: note: expanded from macro '__max'
262#define __max max
263              ^
264In file included from bon_csv2html.cpp:4:
265In file included from /Applications/Xcode.app/Contents/Developer/Toolchains/XcodeDefault.xctoolchain/usr/bin/../lib/c++/v1/vector:261:
266In file included from /Applications/Xcode.app/Contents/Developer/Toolchains/XcodeDefault.xctoolchain/usr/bin/../lib/c++/v1/__bit_reference:15:
267In file included from /Applications/Xcode.app/Contents/Developer/Toolchains/XcodeDefault.xctoolchain/usr/bin/../lib/c++/v1/algorithm:594:
268In file included from /Applications/Xcode.app/Contents/Developer/Toolchains/XcodeDefault.xctoolchain/usr/bin/../lib/c++/v1/memory:595:
269/Applications/Xcode.app/Contents/Developer/Toolchains/XcodeDefault.xctoolchain/usr/bin/../lib/c++/v1/limits:258:61: error: redefinition of 'min' as different kind of symbol
270    _LIBCPP_INLINE_VISIBILITY static _LIBCPP_CONSTEXPR type min() _NOEXCEPT {return __min;}
271                                                            ^
272/Applications/Xcode.app/Contents/Developer/Toolchains/XcodeDefault.xctoolchain/usr/bin/../lib/c++/v1/limits:256:41: note: previous definition is here
273    static _LIBCPP_CONSTEXPR const type __min = false;
274                                        ^
275./port.h:42:15: note: expanded from macro '__min'
276#define __min min
277              ^
278In file included from bon_csv2html.cpp:4:
279In file included from /Applications/Xcode.app/Contents/Developer/Toolchains/XcodeDefault.xctoolchain/usr/bin/../lib/c++/v1/vector:261:
280In file included from /Applications/Xcode.app/Contents/Developer/Toolchains/XcodeDefault.xctoolchain/usr/bin/../lib/c++/v1/__bit_reference:15:
281In file included from /Applications/Xcode.app/Contents/Developer/Toolchains/XcodeDefault.xctoolchain/usr/bin/../lib/c++/v1/algorithm:594:
282In file included from /Applications/Xcode.app/Contents/Developer/Toolchains/XcodeDefault.xctoolchain/usr/bin/../lib/c++/v1/memory:595:
283/Applications/Xcode.app/Contents/Developer/Toolchains/XcodeDefault.xctoolchain/usr/bin/../lib/c++/v1/limits:259:61: error: redefinition of 'max' as different kind of symbol
284    _LIBCPP_INLINE_VISIBILITY static _LIBCPP_CONSTEXPR type max() _NOEXCEPT {return __max;}
285                                                            ^
286/Applications/Xcode.app/Contents/Developer/Toolchains/XcodeDefault.xctoolchain/usr/bin/../lib/c++/v1/limits:257:41: note: previous definition is here
287    static _LIBCPP_CONSTEXPR const type __max = true;
288                                        ^
289./port.h:43:15: note: expanded from macro '__max'
290#define __max max
291              ^
292In file included from bon_csv2html.cpp:4:
293In file included from /Applications/Xcode.app/Contents/Developer/Toolchains/XcodeDefault.xctoolchain/usr/bin/../lib/c++/v1/vector:261:
294In file included from /Applications/Xcode.app/Contents/Developer/Toolchains/XcodeDefault.xctoolchain/usr/bin/../lib/c++/v1/__bit_reference:15:
295In file included from /Applications/Xcode.app/Contents/Developer/Toolchains/XcodeDefault.xctoolchain/usr/bin/../lib/c++/v1/algorithm:594:
296In file included from /Applications/Xcode.app/Contents/Developer/Toolchains/XcodeDefault.xctoolchain/usr/bin/../lib/c++/v1/memory:595:
297/Applications/Xcode.app/Contents/Developer/Toolchains/XcodeDefault.xctoolchain/usr/bin/../lib/c++/v1/limits:260:91: error: called object type 'int' is not a function or function pointer
298    _LIBCPP_INLINE_VISIBILITY static _LIBCPP_CONSTEXPR type lowest() _NOEXCEPT {return min();}
299                                                                                       ~~~^
300In file included from bon_file.cpp:1:
301./bonnie.h:4:17: warning: using directive refers to implicitly-defined namespace 'std'
302using namespace std;
303                ^
304In file included from bon_io.cpp:14:
305In file included from ./bon_time.h:6:
306./rand.h:4:17: warning: using directive refers to implicitly-defined namespace 'std'
307using namespace std;
308                ^
309In file included from bon_file.cpp:9:
310In file included from ./bon_time.h:6:
311./rand.h:4:17: warning: using directive refers to implicitly-defined namespace 'std'
312using namespace std;
313                ^
314In file included from bon_io.cpp:14:
315In file included from ./bon_time.h:6:
316In file included from ./rand.h:8:
317In file included from /Applications/Xcode.app/Contents/Developer/Toolchains/XcodeDefault.xctoolchain/usr/bin/../lib/c++/v1/string:434:
318In file included from /Applications/Xcode.app/Contents/Developer/Toolchains/XcodeDefault.xctoolchain/usr/bin/../lib/c++/v1/algorithm:594:
319In file included from /Applications/Xcode.app/Contents/Developer/Toolchains/XcodeDefault.xctoolchain/usr/bin/../lib/c++/v1/memory:595:
320In file included from /Applications/Xcode.app/Contents/Developer/Toolchains/XcodeDefault.xctoolchain/usr/bin/../lib/c++/v1/limits:111:
321/Applications/Xcode.app/Contents/Developer/Toolchains/XcodeDefault.xctoolchain/usr/bin/../lib/c++/v1/__undef_min_max:12:2: warning: : macro min is incompatible with C++.  #undefing min [-W#warnings]
322#warning: macro min is incompatible with C++.  #undefing min
323 ^
324/Applications/Xcode.app/Contents/Developer/Toolchains/XcodeDefault.xctoolchain/usr/bin/../lib/c++/v1/__undef_min_max:17:2: warning: : macro max is incompatible with C++.  #undefing max [-W#warnings]
325#warning: macro max is incompatible with C++.  #undefing max
326 ^
327In file included from bon_io.cpp:14:
328In file included from ./bon_time.h:6:
329In file included from ./rand.h:8:
330In file included from /Applications/Xcode.app/Contents/Developer/Toolchains/XcodeDefault.xctoolchain/usr/bin/../lib/c++/v1/string:434:
331In file included from /Applications/Xcode.app/Contents/Developer/Toolchains/XcodeDefault.xctoolchain/usr/bin/../lib/c++/v1/algorithm:594:
332In file included from /Applications/Xcode.app/Contents/Developer/Toolchains/XcodeDefault.xctoolchain/usr/bin/../lib/c++/v1/memory:595:
333/Applications/Xcode.app/Contents/Developer/Toolchains/XcodeDefault.xctoolchain/usr/bin/../lib/c++/v1/limits:206:61: error: redefinition of 'min' as different kind of symbol
334    _LIBCPP_INLINE_VISIBILITY static _LIBCPP_CONSTEXPR type min() _NOEXCEPT {return __min;}
335                                                            ^
336/Applications/Xcode.app/Contents/Developer/Toolchains/XcodeDefault.xctoolchain/usr/bin/../lib/c++/v1/limits:204:41: note: previous definition is here
337    static _LIBCPP_CONSTEXPR const type __min = __libcpp_compute_min<type, digits, is_signed>::value;
338                                        ^
339./port.h:42:15: note: expanded from macro '__min'
340#define __min min
341              ^
342In file included from bon_io.cpp:14:
343In file included from ./bon_time.h:6:
344In file included from ./rand.h:8:
345In file included from /Applications/Xcode.app/Contents/Developer/Toolchains/XcodeDefault.xctoolchain/usr/bin/../lib/c++/v1/string:434:
346In file included from /Applications/Xcode.app/Contents/Developer/Toolchains/XcodeDefault.xctoolchain/usr/bin/../lib/c++/v1/algorithm:594:
347In file included from /Applications/Xcode.app/Contents/Developer/Toolchains/XcodeDefault.xctoolchain/usr/bin/../lib/c++/v1/memory:595:
348/Applications/Xcode.app/Contents/Developer/Toolchains/XcodeDefault.xctoolchain/usr/bin/../lib/c++/v1/limits:207:61: error: redefinition of 'max' as different kind of symbol
349    _LIBCPP_INLINE_VISIBILITY static _LIBCPP_CONSTEXPR type max() _NOEXCEPT {return __max;}
350                                                            ^
351/Applications/Xcode.app/Contents/Developer/Toolchains/XcodeDefault.xctoolchain/usr/bin/../lib/c++/v1/limits:205:41: note: previous definition is here
352    static _LIBCPP_CONSTEXPR const type __max = is_signed ? type(type(~0) ^ __min) : type(~0);
353                                        ^
354./port.h:43:15: note: expanded from macro '__max'
355#define __max max
356              ^
357In file included from bon_io.cpp:14:
358In file included from ./bon_time.h:6:
359In file included from ./rand.h:8:
360In file included from /Applications/Xcode.app/Contents/Developer/Toolchains/XcodeDefault.xctoolchain/usr/bin/../lib/c++/v1/string:434:
361In file included from /Applications/Xcode.app/Contents/Developer/Toolchains/XcodeDefault.xctoolchain/usr/bin/../lib/c++/v1/algorithm:594:
362In file included from /Applications/Xcode.app/Contents/Developer/Toolchains/XcodeDefault.xctoolchain/usr/bin/../lib/c++/v1/memory:595:
363/Applications/Xcode.app/Contents/Developer/Toolchains/XcodeDefault.xctoolchain/usr/bin/../lib/c++/v1/limits:258:61: error: redefinition of 'min' as different kind of symbol
364    _LIBCPP_INLINE_VISIBILITY static _LIBCPP_CONSTEXPR type min() _NOEXCEPT {return __min;}
365                                                            ^
366/Applications/Xcode.app/Contents/Developer/Toolchains/XcodeDefault.xctoolchain/usr/bin/../lib/c++/v1/limits:256:41: note: previous definition is here
367    static _LIBCPP_CONSTEXPR const type __min = false;
368                                        ^
369./port.h:42:15: note: expanded from macro '__min'
370#define __min min
371              ^
372In file included from bon_io.cpp:14:
373In file included from ./bon_time.h:6:
374In file included from ./rand.h:8:
375In file included from /Applications/Xcode.app/Contents/Developer/Toolchains/XcodeDefault.xctoolchain/usr/bin/../lib/c++/v1/string:434:
376In file included from /Applications/Xcode.app/Contents/Developer/Toolchains/XcodeDefault.xctoolchain/usr/bin/../lib/c++/v1/algorithm:594:
377In file included from /Applications/Xcode.app/Contents/Developer/Toolchains/XcodeDefault.xctoolchain/usr/bin/../lib/c++/v1/memory:595:
378/Applications/Xcode.app/Contents/Developer/Toolchains/XcodeDefault.xctoolchain/usr/bin/../lib/c++/v1/limits:259:61: error: redefinition of 'max' as different kind of symbol
379    _LIBCPP_INLINE_VISIBILITY static _LIBCPP_CONSTEXPR type max() _NOEXCEPT {return __max;}
380                                                            ^
381/Applications/Xcode.app/Contents/Developer/Toolchains/XcodeDefault.xctoolchain/usr/bin/../lib/c++/v1/limits:257:41: note: previous definition is here
382    static _LIBCPP_CONSTEXPR const type __max = true;
383                                        ^
384./port.h:43:15: note: expanded from macro '__max'
385#define __max max
386              ^
387In file included from bon_io.cpp:14:
388In file included from ./bon_time.h:6:
389In file included from ./rand.h:8:
390In file included from /Applications/Xcode.app/Contents/Developer/Toolchains/XcodeDefault.xctoolchain/usr/bin/../lib/c++/v1/string:434:
391In file included from /Applications/Xcode.app/Contents/Developer/Toolchains/XcodeDefault.xctoolchain/usr/bin/../lib/c++/v1/algorithm:594:
392In file included from /Applications/Xcode.app/Contents/Developer/Toolchains/XcodeDefault.xctoolchain/usr/bin/../lib/c++/v1/memory:595:
393/Applications/Xcode.app/Contents/Developer/Toolchains/XcodeDefault.xctoolchain/usr/bin/../lib/c++/v1/limits:260:91: error: called object type 'int' is not a function or function pointer
394    _LIBCPP_INLINE_VISIBILITY static _LIBCPP_CONSTEXPR type lowest() _NOEXCEPT {return min();}
395                                                                                       ~~~^
396In file included from bon_file.cpp:9:
397In file included from ./bon_time.h:6:
398In file included from ./rand.h:8:
399In file included from /Applications/Xcode.app/Contents/Developer/Toolchains/XcodeDefault.xctoolchain/usr/bin/../lib/c++/v1/string:434:
400In file included from /Applications/Xcode.app/Contents/Developer/Toolchains/XcodeDefault.xctoolchain/usr/bin/../lib/c++/v1/algorithm:594:
401In file included from /Applications/Xcode.app/Contents/Developer/Toolchains/XcodeDefault.xctoolchain/usr/bin/../lib/c++/v1/memory:595:
402In file included from /Applications/Xcode.app/Contents/Developer/Toolchains/XcodeDefault.xctoolchain/usr/bin/../lib/c++/v1/limits:111:
403/Applications/Xcode.app/Contents/Developer/Toolchains/XcodeDefault.xctoolchain/usr/bin/../lib/c++/v1/__undef_min_max:12:2: warning: : macro min is incompatible with C++.  #undefing min [-W#warnings]
404#warning: macro min is incompatible with C++.  #undefing min
405 ^
406/Applications/Xcode.app/Contents/Developer/Toolchains/XcodeDefault.xctoolchain/usr/bin/../lib/c++/v1/__undef_min_max:17:2: warning: : macro max is incompatible with C++.  #undefing max [-W#warnings]
407#warning: macro max is incompatible with C++.  #undefing max
408 ^
409In file included from bon_file.cpp:9:
410In file included from ./bon_time.h:6:
411In file included from ./rand.h:8:
412In file included from /Applications/Xcode.app/Contents/Developer/Toolchains/XcodeDefault.xctoolchain/usr/bin/../lib/c++/v1/string:434:
413In file included from /Applications/Xcode.app/Contents/Developer/Toolchains/XcodeDefault.xctoolchain/usr/bin/../lib/c++/v1/algorithm:594:
414In file included from /Applications/Xcode.app/Contents/Developer/Toolchains/XcodeDefault.xctoolchain/usr/bin/../lib/c++/v1/memory:595:
415/Applications/Xcode.app/Contents/Developer/Toolchains/XcodeDefault.xctoolchain/usr/bin/../lib/c++/v1/limits:206:61: error: redefinition of 'min' as different kind of symbol
416    _LIBCPP_INLINE_VISIBILITY static _LIBCPP_CONSTEXPR type min() _NOEXCEPT {return __min;}
417                                                            ^
418/Applications/Xcode.app/Contents/Developer/Toolchains/XcodeDefault.xctoolchain/usr/bin/../lib/c++/v1/limits:204:41: note: previous definition is here
419    static _LIBCPP_CONSTEXPR const type __min = __libcpp_compute_min<type, digits, is_signed>::value;
420                                        ^
421./port.h:42:15: note: expanded from macro '__min'
422#define __min min
423              ^
424In file included from bon_file.cpp:9:
425In file included from ./bon_time.h:6:
426In file included from ./rand.h:8:
427In file included from /Applications/Xcode.app/Contents/Developer/Toolchains/XcodeDefault.xctoolchain/usr/bin/../lib/c++/v1/string:434:
428In file included from /Applications/Xcode.app/Contents/Developer/Toolchains/XcodeDefault.xctoolchain/usr/bin/../lib/c++/v1/algorithm:594:
429In file included from /Applications/Xcode.app/Contents/Developer/Toolchains/XcodeDefault.xctoolchain/usr/bin/../lib/c++/v1/memory:595:
430/Applications/Xcode.app/Contents/Developer/Toolchains/XcodeDefault.xctoolchain/usr/bin/../lib/c++/v1/limits:207:61: error: redefinition of 'max' as different kind of symbol
431    _LIBCPP_INLINE_VISIBILITY static _LIBCPP_CONSTEXPR type max() _NOEXCEPT {return __max;}
432                                                            ^
433/Applications/Xcode.app/Contents/Developer/Toolchains/XcodeDefault.xctoolchain/usr/bin/../lib/c++/v1/limits:205:41: note: previous definition is here
434    static _LIBCPP_CONSTEXPR const type __max = is_signed ? type(type(~0) ^ __min) : type(~0);
435                                        ^
436./port.h:43:15: note: expanded from macro '__max'
437#define __max max
438              ^
439In file included from bon_file.cpp:9:
440In file included from ./bon_time.h:6:
441In file included from ./rand.h:8:
442In file included from /Applications/Xcode.app/Contents/Developer/Toolchains/XcodeDefault.xctoolchain/usr/bin/../lib/c++/v1/string:434:
443In file included from /Applications/Xcode.app/Contents/Developer/Toolchains/XcodeDefault.xctoolchain/usr/bin/../lib/c++/v1/algorithm:594:
444In file included from /Applications/Xcode.app/Contents/Developer/Toolchains/XcodeDefault.xctoolchain/usr/bin/../lib/c++/v1/memory:595:
445/Applications/Xcode.app/Contents/Developer/Toolchains/XcodeDefault.xctoolchain/usr/bin/../lib/c++/v1/limits:258:61: error: redefinition of 'min' as different kind of symbol
446    _LIBCPP_INLINE_VISIBILITY static _LIBCPP_CONSTEXPR type min() _NOEXCEPT {return __min;}
447                                                            ^
448/Applications/Xcode.app/Contents/Developer/Toolchains/XcodeDefault.xctoolchain/usr/bin/../lib/c++/v1/limits:256:41: note: previous definition is here
449    static _LIBCPP_CONSTEXPR const type __min = false;
450                                        ^
451./port.h:42:15: note: expanded from macro '__min'
452#define __min min
453              ^
454In file included from bon_file.cpp:9:
455In file included from ./bon_time.h:6:
456In file included from ./rand.h:8:
457In file included from /Applications/Xcode.app/Contents/Developer/Toolchains/XcodeDefault.xctoolchain/usr/bin/../lib/c++/v1/string:434:
458In file included from /Applications/Xcode.app/Contents/Developer/Toolchains/XcodeDefault.xctoolchain/usr/bin/../lib/c++/v1/algorithm:594:
459In file included from /Applications/Xcode.app/Contents/Developer/Toolchains/XcodeDefault.xctoolchain/usr/bin/../lib/c++/v1/memory:595:
460/Applications/Xcode.app/Contents/Developer/Toolchains/XcodeDefault.xctoolchain/usr/bin/../lib/c++/v1/limits:259:61: error: redefinition of 'max' as different kind of symbol
461    _LIBCPP_INLINE_VISIBILITY static _LIBCPP_CONSTEXPR type max() _NOEXCEPT {return __max;}
462                                                            ^
463/Applications/Xcode.app/Contents/Developer/Toolchains/XcodeDefault.xctoolchain/usr/bin/../lib/c++/v1/limits:257:41: note: previous definition is here
464    static _LIBCPP_CONSTEXPR const type __max = true;
465                                        ^
466./port.h:43:15: note: expanded from macro '__max'
467#define __max max
468              ^
469In file included from bon_file.cpp:9:
470In file included from ./bon_time.h:6:
471In file included from ./rand.h:8:
472In file included from /Applications/Xcode.app/Contents/Developer/Toolchains/XcodeDefault.xctoolchain/usr/bin/../lib/c++/v1/string:434:
473In file included from /Applications/Xcode.app/Contents/Developer/Toolchains/XcodeDefault.xctoolchain/usr/bin/../lib/c++/v1/algorithm:594:
474In file included from /Applications/Xcode.app/Contents/Developer/Toolchains/XcodeDefault.xctoolchain/usr/bin/../lib/c++/v1/memory:595:
475/Applications/Xcode.app/Contents/Developer/Toolchains/XcodeDefault.xctoolchain/usr/bin/../lib/c++/v1/limits:260:91: error: called object type 'int' is not a function or function pointer
476    _LIBCPP_INLINE_VISIBILITY static _LIBCPP_CONSTEXPR type lowest() _NOEXCEPT {return min();}
477                                                                                       ~~~^
478/Applications/Xcode.app/Contents/Developer/Toolchains/XcodeDefault.xctoolchain/usr/bin/../lib/c++/v1/limits:443:85: error: called object type 'type' (aka 'long') is not a function or function pointer
479    _LIBCPP_INLINE_VISIBILITY static _LIBCPP_CONSTEXPR type max() _NOEXCEPT {return __base::max();}
480                                                                                    ^~~~~~~~~~~
481/Applications/Xcode.app/Contents/Developer/Toolchains/XcodeDefault.xctoolchain/usr/bin/../lib/c++/v1/algorithm:2702:86: note: in instantiation of member function 'std::__1::numeric_limits<long>::max' requested here
482                                      result_type __b = numeric_limits<result_type>::max())
483                                                                                     ^
484bonnie++.cpp:160:27: warning: unused parameter 'sig' [-Wunused-parameter]
485  void ctrl_c_handler(int sig, siginfo_t *siginf, void *unused)
486                          ^
487bonnie++.cpp:160:57: warning: unused parameter 'unused' [-Wunused-parameter]
488  void ctrl_c_handler(int sig, siginfo_t *siginf, void *unused)
489                                                        ^
490In file included from bon_csv2html.cpp:4:
491In file included from /Applications/Xcode.app/Contents/Developer/Toolchains/XcodeDefault.xctoolchain/usr/bin/../lib/c++/v1/vector:261:
492In file included from /Applications/Xcode.app/Contents/Developer/Toolchains/XcodeDefault.xctoolchain/usr/bin/../lib/c++/v1/__bit_reference:15:
493In file included from /Applications/Xcode.app/Contents/Developer/Toolchains/XcodeDefault.xctoolchain/usr/bin/../lib/c++/v1/algorithm:594:
494In file included from /Applications/Xcode.app/Contents/Developer/Toolchains/XcodeDefault.xctoolchain/usr/bin/../lib/c++/v1/memory:595:
495/Applications/Xcode.app/Contents/Developer/Toolchains/XcodeDefault.xctoolchain/usr/bin/../lib/c++/v1/limits:443:85: error: called object type 'type' (aka 'unsigned long') is not a function or function pointer
496    _LIBCPP_INLINE_VISIBILITY static _LIBCPP_CONSTEXPR type max() _NOEXCEPT {return __base::max();}
497                                                                                    ^~~~~~~~~~~
498/Applications/Xcode.app/Contents/Developer/Toolchains/XcodeDefault.xctoolchain/usr/bin/../lib/c++/v1/vector:865:104: note: in instantiation of member function 'std::__1::numeric_limits<unsigned long>::max' requested here
499    return _VSTD::min<size_type>(__alloc_traits::max_size(this->__alloc()), numeric_limits<size_type>::max() / 2);  // end() >= begin(), always
500                                                                                                       ^
501/Applications/Xcode.app/Contents/Developer/Toolchains/XcodeDefault.xctoolchain/usr/bin/../lib/c++/v1/vector:874:28: note: in instantiation of member function 'std::__1::vector<const char *, std::__1::allocator<const char *> >::max_size' requested here
502    const size_type __ms = max_size();
503                           ^
504/Applications/Xcode.app/Contents/Developer/Toolchains/XcodeDefault.xctoolchain/usr/bin/../lib/c++/v1/vector:1458:53: note: in instantiation of member function 'std::__1::vector<const char *, std::__1::allocator<const char *> >::__recommend' requested here
505    __split_buffer<value_type, allocator_type&> __v(__recommend(size() + 1), size(), __a);
506                                                    ^
507/Applications/Xcode.app/Contents/Developer/Toolchains/XcodeDefault.xctoolchain/usr/bin/../lib/c++/v1/vector:1477:9: note: in instantiation of function template specialization 'std::__1::vector<const char *, std::__1::allocator<const char *> >::__push_back_slow_path<const char *const>' requested here
508        __push_back_slow_path(__x);
509        ^
510bon_csv2html.cpp:461:9: note: in instantiation of member function 'std::__1::vector<const char *, std::__1::allocator<const char *> >::push_back' requested here
511    arr.push_back(tmp);
512        ^
513bonnie++.cpp:709:57: warning: comparison of integers of different signs: 'unsigned long' and 'int' [-Wsign-compare]
514  if(globals.ram && directory_size * MaxDataPerFile * 2 > (globals.ram << 10))
515                    ~~~~~~~~~~~~~~~~~~~~~~~~~~~~~~~~~~~ ^  ~~~~~~~~~~~~~~~~~
516In file included from bonnie++.cpp:26:
517In file included from /Applications/Xcode.app/Contents/Developer/Toolchains/XcodeDefault.xctoolchain/usr/bin/../lib/c++/v1/algorithm:594:
518In file included from /Applications/Xcode.app/Contents/Developer/Toolchains/XcodeDefault.xctoolchain/usr/bin/../lib/c++/v1/memory:595:
519/Applications/Xcode.app/Contents/Developer/Toolchains/XcodeDefault.xctoolchain/usr/bin/../lib/c++/v1/limits:443:85: error: called object type 'type' (aka 'long') is not a function or function pointer
520    _LIBCPP_INLINE_VISIBILITY static _LIBCPP_CONSTEXPR type max() _NOEXCEPT {return __base::max();}
521                                                                                    ^~~~~~~~~~~
522/Applications/Xcode.app/Contents/Developer/Toolchains/XcodeDefault.xctoolchain/usr/bin/../lib/c++/v1/algorithm:2702:86: note: in instantiation of member function 'std::__1::numeric_limits<long>::max' requested here
523                                      result_type __b = numeric_limits<result_type>::max())
524                                                                                     ^
5256 warnings and 6 errors generated.
5263 warnings and 7 errors generated.
527make: *** [bonnie++.o] Error 1
528make: *** Waiting for unfinished jobs....
529make: *** [bon_csv2html.o] Error 1
530bon_io.cpp:161:76: warning: format specifies type 'int' but the argument has type 'off_t' (aka 'long long') [-Wformat]
531    sprintf(m_buf, "Error in lseek to chunk %d(" OFF_T_PRINTF ")", offset, real_offset);
532                                                                           ^~~~~~~~~~~
533In file included from bon_io.cpp:14:
534In file included from ./bon_time.h:6:
535In file included from ./rand.h:8:
536In file included from /Applications/Xcode.app/Contents/Developer/Toolchains/XcodeDefault.xctoolchain/usr/bin/../lib/c++/v1/string:434:
537In file included from /Applications/Xcode.app/Contents/Developer/Toolchains/XcodeDefault.xctoolchain/usr/bin/../lib/c++/v1/algorithm:594:
538In file included from /Applications/Xcode.app/Contents/Developer/Toolchains/XcodeDefault.xctoolchain/usr/bin/../lib/c++/v1/memory:595:
539/Applications/Xcode.app/Contents/Developer/Toolchains/XcodeDefault.xctoolchain/usr/bin/../lib/c++/v1/limits:443:85: error: called object type 'type' (aka 'long') is not a function or function pointer
540    _LIBCPP_INLINE_VISIBILITY static _LIBCPP_CONSTEXPR type max() _NOEXCEPT {return __base::max();}
541                                                                                    ^~~~~~~~~~~
542/Applications/Xcode.app/Contents/Developer/Toolchains/XcodeDefault.xctoolchain/usr/bin/../lib/c++/v1/algorithm:2702:86: note: in instantiation of member function 'std::__1::numeric_limits<long>::max' requested here
543                                      result_type __b = numeric_limits<result_type>::max())
544                                                                                     ^
5455 warnings and 6 errors generated.
546make: *** [bon_io.o] Error 1
547/Applications/Xcode.app/Contents/Developer/Toolchains/XcodeDefault.xctoolchain/usr/bin/../lib/c++/v1/limits:443:85: error: called object type 'type' (aka 'long') is not a function or function pointer
548    _LIBCPP_INLINE_VISIBILITY static _LIBCPP_CONSTEXPR type max() _NOEXCEPT {return __base::max();}
549                                                                                    ^~~~~~~~~~~
550/Applications/Xcode.app/Contents/Developer/Toolchains/XcodeDefault.xctoolchain/usr/bin/../lib/c++/v1/algorithm:2702:86: note: in instantiation of member function 'std::__1::numeric_limits<long>::max' requested here
551                                      result_type __b = numeric_limits<result_type>::max())
552                                                                                     ^
5534 warnings and 6 errors generated.
554make: *** [bon_file.o] Error 1
555make: Leaving directory `/opt/local/var/macports/build/_opt_local_var_macports_sources_rsync.macports.org_release_tarballs_ports_benchmarks_bonniexx/bonniexx/work/bonnie++-1.96'
556Command failed:  cd "/opt/local/var/macports/build/_opt_local_var_macports_sources_rsync.macports.org_release_tarballs_ports_benchmarks_bonniexx/bonniexx/work/bonnie++-1.96" && /usr/bin/make -j4 -w all
557Exit code: 2
558Error: org.macports.build for port bonniexx returned: command execution failed
559DEBUG: Error code: CHILDSTATUS 62192 2
560DEBUG: Backtrace: command execution failed
561Warning: targets not executed for bonniexx: org.macports.destroot org.macports.build
562Please see the log file for port bonniexx for details: