Ticket #41555: libgcc_config.log

File libgcc_config.log, 80.5 KB (added by liampg72@…, 8 years ago)

libgcc config.log

Line 
1This file contains any messages produced by compilers while
2running configure, to aid debugging if configure makes a mistake.
3
4It was created by GNU Fortran Runtime Library configure 0.3, which was
5generated by GNU Autoconf 2.64.  Invocation command line was
6
7  $ /opt/local/var/macports/build/_opt_local_var_macports_sources_rsync.macports.org_release_tarballs_ports_lang_gcc48/libgcc/work/gcc-4.8.2/libgfortran/configure --cache-file=./config.cache --prefix=/opt/local --includedir=/opt/local/include/gcc48 --infodir=/opt/local/share/info --mandir=/opt/local/share/man --datarootdir=/opt/local/share/gcc-4.8 --with-local-prefix=/opt/local --with-system-zlib --disable-nls --with-gxx-include-dir=/opt/local/include/gcc48/c++/ --with-gmp=/opt/local --with-mpfr=/opt/local --with-mpc=/opt/local --with-cloog=/opt/local --enable-cloog-backend=isl --disable-cloog-version-check --enable-stage1-checking --disable-multilib --enable-lto --enable-libstdcxx-time --with-as=/opt/local/bin/as --with-ld=/opt/local/bin/ld --with-ar=/opt/local/bin/ar --with-bugurl=https://trac.macports.org/newticket --libdir=/opt/local/lib/libgcc --with-pkgversion=MacPorts gcc48 4.8.2_0 --enable-languages=c,c++,fortran,lto,objc,obj-c++ --program-transform-name=s&$&-mp-4.8& --disable-option-checking --with-target-subdir=x86_64-apple-darwin12 --build=x86_64-apple-darwin12 --host=x86_64-apple-darwin12 --target=x86_64-apple-darwin12 --srcdir=/opt/local/var/macports/build/_opt_local_var_macports_sources_rsync.macports.org_release_tarballs_ports_lang_gcc48/libgcc/work/gcc-4.8.2/libgfortran
8
9## --------- ##
10## Platform. ##
11## --------- ##
12
13hostname = dhcp-10-33-62-75.fys.kuleuven.be
14uname -m = x86_64
15uname -r = 12.5.0
16uname -s = Darwin
17uname -v = Darwin Kernel Version 12.5.0: Sun Sep 29 13:33:47 PDT 2013; root:xnu-2050.48.12~1/RELEASE_X86_64
18
19/usr/bin/uname -p = i386
20/bin/uname -X     = unknown
21
22/bin/arch              = unknown
23/usr/bin/arch -k       = unknown
24/usr/convex/getsysinfo = unknown
25/usr/bin/hostinfo      = Mach kernel version:
26         Darwin Kernel Version 12.5.0: Sun Sep 29 13:33:47 PDT 2013; root:xnu-2050.48.12~1/RELEASE_X86_64
27Kernel configured for up to 2 processors.
282 processors are physically available.
292 processors are logically available.
30Processor type: i486 (Intel 80486)
31Processors active: 0 1
32Primary memory available: 8.00 gigabytes
33Default processor set: 152 tasks, 693 threads, 2 processors
34Load average: 3.64, Mach factor: 0.42
35/bin/machine           = unknown
36/usr/bin/oslevel       = unknown
37/bin/universe          = unknown
38
39PATH: /opt/local/bin
40PATH: /opt/local/sbin
41PATH: /bin
42PATH: /sbin
43PATH: /usr/bin
44PATH: /usr/sbin
45
46
47## ----------- ##
48## Core tests. ##
49## ----------- ##
50
51configure:2529: creating cache ./config.cache
52configure:2699: checking build system type
53configure:2713: result: x86_64-apple-darwin12
54configure:2783: checking for --enable-version-specific-runtime-libs
55configure:2796: result: no
56configure:2800: checking for --enable-intermodule
57configure:2812: result:
58configure:2839: checking host system type
59configure:2852: result: x86_64-apple-darwin12
60configure:2872: checking target system type
61configure:2885: result: x86_64-apple-darwin12
62configure:2945: checking for a BSD-compatible install
63configure:3013: result: /usr/bin/install -c
64configure:3024: checking whether build environment is sane
65configure:3074: result: yes
66configure:3215: checking for a thread-safe mkdir -p
67configure:3254: result: /opt/local/bin/gmkdir -p
68configure:3267: checking for gawk
69configure:3294: result: gawk
70configure:3305: checking whether /usr/bin/make sets $(MAKE)
71configure:3327: result: yes
72configure:3400: checking whether to enable maintainer-specific portions of Makefiles
73configure:3409: result: no
74configure:3485: checking for style of include used by /usr/bin/make
75configure:3513: result: GNU
76configure:3544: checking for x86_64-apple-darwin12-gcc
77configure:3571: result: /opt/local/var/macports/build/_opt_local_var_macports_sources_rsync.macports.org_release_tarballs_ports_lang_gcc48/libgcc/work/build/./gcc/xgcc -B/opt/local/var/macports/build/_opt_local_var_macports_sources_rsync.macports.org_release_tarballs_ports_lang_gcc48/libgcc/work/build/./gcc/ -B/opt/local/x86_64-apple-darwin12/bin/ -B/opt/local/x86_64-apple-darwin12/lib/ -isystem /opt/local/x86_64-apple-darwin12/include -isystem /opt/local/x86_64-apple-darwin12/sys-include   
78configure:3840: checking for C compiler version
79configure:3849: /opt/local/var/macports/build/_opt_local_var_macports_sources_rsync.macports.org_release_tarballs_ports_lang_gcc48/libgcc/work/build/./gcc/xgcc -B/opt/local/var/macports/build/_opt_local_var_macports_sources_rsync.macports.org_release_tarballs_ports_lang_gcc48/libgcc/work/build/./gcc/ -B/opt/local/x86_64-apple-darwin12/bin/ -B/opt/local/x86_64-apple-darwin12/lib/ -isystem /opt/local/x86_64-apple-darwin12/include -isystem /opt/local/x86_64-apple-darwin12/sys-include    --version >&5
80xgcc (MacPorts gcc48 4.8.2_0) 4.8.2
81Copyright (C) 2013 Free Software Foundation, Inc.
82This is free software; see the source for copying conditions.  There is NO
83warranty; not even for MERCHANTABILITY or FITNESS FOR A PARTICULAR PURPOSE.
84
85configure:3860: $? = 0
86configure:3849: /opt/local/var/macports/build/_opt_local_var_macports_sources_rsync.macports.org_release_tarballs_ports_lang_gcc48/libgcc/work/build/./gcc/xgcc -B/opt/local/var/macports/build/_opt_local_var_macports_sources_rsync.macports.org_release_tarballs_ports_lang_gcc48/libgcc/work/build/./gcc/ -B/opt/local/x86_64-apple-darwin12/bin/ -B/opt/local/x86_64-apple-darwin12/lib/ -isystem /opt/local/x86_64-apple-darwin12/include -isystem /opt/local/x86_64-apple-darwin12/sys-include    -v >&5
87Reading specs from /opt/local/var/macports/build/_opt_local_var_macports_sources_rsync.macports.org_release_tarballs_ports_lang_gcc48/libgcc/work/build/./gcc/specs
88COLLECT_GCC=/opt/local/var/macports/build/_opt_local_var_macports_sources_rsync.macports.org_release_tarballs_ports_lang_gcc48/libgcc/work/build/./gcc/xgcc
89COLLECT_LTO_WRAPPER=/opt/local/var/macports/build/_opt_local_var_macports_sources_rsync.macports.org_release_tarballs_ports_lang_gcc48/libgcc/work/build/./gcc/lto-wrapper
90Target: x86_64-apple-darwin12
91Configured with: /opt/local/var/macports/build/_opt_local_var_macports_sources_rsync.macports.org_release_tarballs_ports_lang_gcc48/libgcc/work/gcc-4.8.2/configure --prefix=/opt/local --build=x86_64-apple-darwin12 --includedir=/opt/local/include/gcc48 --infodir=/opt/local/share/info --mandir=/opt/local/share/man --datarootdir=/opt/local/share/gcc-4.8 --with-local-prefix=/opt/local --with-system-zlib --disable-nls --program-suffix=-mp-4.8 --with-gxx-include-dir=/opt/local/include/gcc48/c++/ --with-gmp=/opt/local --with-mpfr=/opt/local --with-mpc=/opt/local --with-cloog=/opt/local --enable-cloog-backend=isl --disable-cloog-version-check --enable-stage1-checking --disable-multilib --enable-lto --enable-libstdcxx-time --with-as=/opt/local/bin/as --with-ld=/opt/local/bin/ld --with-ar=/opt/local/bin/ar --with-bugurl=https://trac.macports.org/newticket --libdir=/opt/local/lib/libgcc --enable-languages=c,c++,objc,obj-c++,lto,fortran --with-pkgversion='MacPorts gcc48 4.8.2_0'
92Thread model: posix
93gcc version 4.8.2 (MacPorts gcc48 4.8.2_0)
94configure:3860: $? = 0
95configure:3849: /opt/local/var/macports/build/_opt_local_var_macports_sources_rsync.macports.org_release_tarballs_ports_lang_gcc48/libgcc/work/build/./gcc/xgcc -B/opt/local/var/macports/build/_opt_local_var_macports_sources_rsync.macports.org_release_tarballs_ports_lang_gcc48/libgcc/work/build/./gcc/ -B/opt/local/x86_64-apple-darwin12/bin/ -B/opt/local/x86_64-apple-darwin12/lib/ -isystem /opt/local/x86_64-apple-darwin12/include -isystem /opt/local/x86_64-apple-darwin12/sys-include    -V >&5
96xgcc: error: unrecognized command line option '-V'
97xgcc: fatal error: no input files
98compilation terminated.
99configure:3860: $? = 1
100configure:3849: /opt/local/var/macports/build/_opt_local_var_macports_sources_rsync.macports.org_release_tarballs_ports_lang_gcc48/libgcc/work/build/./gcc/xgcc -B/opt/local/var/macports/build/_opt_local_var_macports_sources_rsync.macports.org_release_tarballs_ports_lang_gcc48/libgcc/work/build/./gcc/ -B/opt/local/x86_64-apple-darwin12/bin/ -B/opt/local/x86_64-apple-darwin12/lib/ -isystem /opt/local/x86_64-apple-darwin12/include -isystem /opt/local/x86_64-apple-darwin12/sys-include    -qversion >&5
101xgcc: error: unrecognized command line option '-qversion'
102xgcc: fatal error: no input files
103compilation terminated.
104configure:3860: $? = 1
105configure:3876: /opt/local/var/macports/build/_opt_local_var_macports_sources_rsync.macports.org_release_tarballs_ports_lang_gcc48/libgcc/work/build/./gcc/xgcc -B/opt/local/var/macports/build/_opt_local_var_macports_sources_rsync.macports.org_release_tarballs_ports_lang_gcc48/libgcc/work/build/./gcc/ -B/opt/local/x86_64-apple-darwin12/bin/ -B/opt/local/x86_64-apple-darwin12/lib/ -isystem /opt/local/x86_64-apple-darwin12/include -isystem /opt/local/x86_64-apple-darwin12/sys-include    -o conftest -g -O2 -pipe -Os   conftest.c  >&5
106configure:3879: $? = 0
107configure:3908: checking for C compiler default output file name
108configure:3930: /opt/local/var/macports/build/_opt_local_var_macports_sources_rsync.macports.org_release_tarballs_ports_lang_gcc48/libgcc/work/build/./gcc/xgcc -B/opt/local/var/macports/build/_opt_local_var_macports_sources_rsync.macports.org_release_tarballs_ports_lang_gcc48/libgcc/work/build/./gcc/ -B/opt/local/x86_64-apple-darwin12/bin/ -B/opt/local/x86_64-apple-darwin12/lib/ -isystem /opt/local/x86_64-apple-darwin12/include -isystem /opt/local/x86_64-apple-darwin12/sys-include    -g -O2 -pipe -Os   conftest.c  >&5
109configure:3934: $? = 0
110configure:3971: result: a.out
111configure:3987: checking whether the C compiler works
112configure:3996: ./a.out
113configure:4000: $? = 0
114configure:4015: result: yes
115configure:4022: checking whether we are cross compiling
116configure:4024: result: no
117configure:4027: checking for suffix of executables
118configure:4034: /opt/local/var/macports/build/_opt_local_var_macports_sources_rsync.macports.org_release_tarballs_ports_lang_gcc48/libgcc/work/build/./gcc/xgcc -B/opt/local/var/macports/build/_opt_local_var_macports_sources_rsync.macports.org_release_tarballs_ports_lang_gcc48/libgcc/work/build/./gcc/ -B/opt/local/x86_64-apple-darwin12/bin/ -B/opt/local/x86_64-apple-darwin12/lib/ -isystem /opt/local/x86_64-apple-darwin12/include -isystem /opt/local/x86_64-apple-darwin12/sys-include    -o conftest -g -O2 -pipe -Os   conftest.c  >&5
119configure:4038: $? = 0
120configure:4060: result:
121configure:4067: checking for suffix of object files
122configure:4089: /opt/local/var/macports/build/_opt_local_var_macports_sources_rsync.macports.org_release_tarballs_ports_lang_gcc48/libgcc/work/build/./gcc/xgcc -B/opt/local/var/macports/build/_opt_local_var_macports_sources_rsync.macports.org_release_tarballs_ports_lang_gcc48/libgcc/work/build/./gcc/ -B/opt/local/x86_64-apple-darwin12/bin/ -B/opt/local/x86_64-apple-darwin12/lib/ -isystem /opt/local/x86_64-apple-darwin12/include -isystem /opt/local/x86_64-apple-darwin12/sys-include    -c -g -O2 -pipe -Os  conftest.c >&5
123configure:4093: $? = 0
124configure:4114: result: o
125configure:4118: checking whether we are using the GNU C compiler
126configure:4137: /opt/local/var/macports/build/_opt_local_var_macports_sources_rsync.macports.org_release_tarballs_ports_lang_gcc48/libgcc/work/build/./gcc/xgcc -B/opt/local/var/macports/build/_opt_local_var_macports_sources_rsync.macports.org_release_tarballs_ports_lang_gcc48/libgcc/work/build/./gcc/ -B/opt/local/x86_64-apple-darwin12/bin/ -B/opt/local/x86_64-apple-darwin12/lib/ -isystem /opt/local/x86_64-apple-darwin12/include -isystem /opt/local/x86_64-apple-darwin12/sys-include    -c -g -O2 -pipe -Os  conftest.c >&5
127configure:4137: $? = 0
128configure:4146: result: yes
129configure:4155: checking whether /opt/local/var/macports/build/_opt_local_var_macports_sources_rsync.macports.org_release_tarballs_ports_lang_gcc48/libgcc/work/build/./gcc/xgcc -B/opt/local/var/macports/build/_opt_local_var_macports_sources_rsync.macports.org_release_tarballs_ports_lang_gcc48/libgcc/work/build/./gcc/ -B/opt/local/x86_64-apple-darwin12/bin/ -B/opt/local/x86_64-apple-darwin12/lib/ -isystem /opt/local/x86_64-apple-darwin12/include -isystem /opt/local/x86_64-apple-darwin12/sys-include    accepts -g
130configure:4175: /opt/local/var/macports/build/_opt_local_var_macports_sources_rsync.macports.org_release_tarballs_ports_lang_gcc48/libgcc/work/build/./gcc/xgcc -B/opt/local/var/macports/build/_opt_local_var_macports_sources_rsync.macports.org_release_tarballs_ports_lang_gcc48/libgcc/work/build/./gcc/ -B/opt/local/x86_64-apple-darwin12/bin/ -B/opt/local/x86_64-apple-darwin12/lib/ -isystem /opt/local/x86_64-apple-darwin12/include -isystem /opt/local/x86_64-apple-darwin12/sys-include    -c -g  conftest.c >&5
131configure:4175: $? = 0
132configure:4216: result: yes
133configure:4233: checking for /opt/local/var/macports/build/_opt_local_var_macports_sources_rsync.macports.org_release_tarballs_ports_lang_gcc48/libgcc/work/build/./gcc/xgcc -B/opt/local/var/macports/build/_opt_local_var_macports_sources_rsync.macports.org_release_tarballs_ports_lang_gcc48/libgcc/work/build/./gcc/ -B/opt/local/x86_64-apple-darwin12/bin/ -B/opt/local/x86_64-apple-darwin12/lib/ -isystem /opt/local/x86_64-apple-darwin12/include -isystem /opt/local/x86_64-apple-darwin12/sys-include    option to accept ISO C89
134configure:4297: /opt/local/var/macports/build/_opt_local_var_macports_sources_rsync.macports.org_release_tarballs_ports_lang_gcc48/libgcc/work/build/./gcc/xgcc -B/opt/local/var/macports/build/_opt_local_var_macports_sources_rsync.macports.org_release_tarballs_ports_lang_gcc48/libgcc/work/build/./gcc/ -B/opt/local/x86_64-apple-darwin12/bin/ -B/opt/local/x86_64-apple-darwin12/lib/ -isystem /opt/local/x86_64-apple-darwin12/include -isystem /opt/local/x86_64-apple-darwin12/sys-include     -c -g -O2 -pipe -Os  conftest.c >&5
135configure:4297: $? = 0
136configure:4310: result: none needed
137configure:4332: checking dependency style of /opt/local/var/macports/build/_opt_local_var_macports_sources_rsync.macports.org_release_tarballs_ports_lang_gcc48/libgcc/work/build/./gcc/xgcc -B/opt/local/var/macports/build/_opt_local_var_macports_sources_rsync.macports.org_release_tarballs_ports_lang_gcc48/libgcc/work/build/./gcc/ -B/opt/local/x86_64-apple-darwin12/bin/ -B/opt/local/x86_64-apple-darwin12/lib/ -isystem /opt/local/x86_64-apple-darwin12/include -isystem /opt/local/x86_64-apple-darwin12/sys-include   
138configure:4443: result: gcc3
139configure:4464: checking how to run the C preprocessor
140configure:4534: result: /usr/bin/clang -E
141configure:4554: /usr/bin/clang -E  conftest.c
142configure:4554: $? = 0
143configure:4568: /usr/bin/clang -E  conftest.c
144conftest.c:9:10: fatal error: 'ac_nonexistent.h' file not found
145#include <ac_nonexistent.h>
146         ^
1471 error generated.
148configure:4568: $? = 1
149configure: failed program was:
150| /* confdefs.h */
151| #define PACKAGE_NAME "GNU Fortran Runtime Library"
152| #define PACKAGE_TARNAME "libgfortran"
153| #define PACKAGE_VERSION "0.3"
154| #define PACKAGE_STRING "GNU Fortran Runtime Library 0.3"
155| #define PACKAGE_BUGREPORT ""
156| #define PACKAGE_URL "http://www.gnu.org/software/libgfortran/"
157| /* end confdefs.h.  */
158| #include <ac_nonexistent.h>
159configure:4597: checking for grep that handles long lines and -e
160configure:4655: result: /opt/local/bin/grep
161configure:4660: checking for egrep
162configure:4722: result: /opt/local/bin/grep -E
163configure:4727: checking for ANSI C header files
164configure:4747: /opt/local/var/macports/build/_opt_local_var_macports_sources_rsync.macports.org_release_tarballs_ports_lang_gcc48/libgcc/work/build/./gcc/xgcc -B/opt/local/var/macports/build/_opt_local_var_macports_sources_rsync.macports.org_release_tarballs_ports_lang_gcc48/libgcc/work/build/./gcc/ -B/opt/local/x86_64-apple-darwin12/bin/ -B/opt/local/x86_64-apple-darwin12/lib/ -isystem /opt/local/x86_64-apple-darwin12/include -isystem /opt/local/x86_64-apple-darwin12/sys-include    -c -g -O2 -pipe -Os  conftest.c >&5
165configure:4747: $? = 0
166configure:4820: /opt/local/var/macports/build/_opt_local_var_macports_sources_rsync.macports.org_release_tarballs_ports_lang_gcc48/libgcc/work/build/./gcc/xgcc -B/opt/local/var/macports/build/_opt_local_var_macports_sources_rsync.macports.org_release_tarballs_ports_lang_gcc48/libgcc/work/build/./gcc/ -B/opt/local/x86_64-apple-darwin12/bin/ -B/opt/local/x86_64-apple-darwin12/lib/ -isystem /opt/local/x86_64-apple-darwin12/include -isystem /opt/local/x86_64-apple-darwin12/sys-include    -o conftest -g -O2 -pipe -Os   conftest.c  >&5
167configure:4820: $? = 0
168configure:4820: ./conftest
169configure:4820: $? = 0
170configure:4831: result: yes
171configure:4844: checking for sys/types.h
172configure:4844: /opt/local/var/macports/build/_opt_local_var_macports_sources_rsync.macports.org_release_tarballs_ports_lang_gcc48/libgcc/work/build/./gcc/xgcc -B/opt/local/var/macports/build/_opt_local_var_macports_sources_rsync.macports.org_release_tarballs_ports_lang_gcc48/libgcc/work/build/./gcc/ -B/opt/local/x86_64-apple-darwin12/bin/ -B/opt/local/x86_64-apple-darwin12/lib/ -isystem /opt/local/x86_64-apple-darwin12/include -isystem /opt/local/x86_64-apple-darwin12/sys-include    -c -g -O2 -pipe -Os  conftest.c >&5
173configure:4844: $? = 0
174configure:4844: result: yes
175configure:4844: checking for sys/stat.h
176configure:4844: /opt/local/var/macports/build/_opt_local_var_macports_sources_rsync.macports.org_release_tarballs_ports_lang_gcc48/libgcc/work/build/./gcc/xgcc -B/opt/local/var/macports/build/_opt_local_var_macports_sources_rsync.macports.org_release_tarballs_ports_lang_gcc48/libgcc/work/build/./gcc/ -B/opt/local/x86_64-apple-darwin12/bin/ -B/opt/local/x86_64-apple-darwin12/lib/ -isystem /opt/local/x86_64-apple-darwin12/include -isystem /opt/local/x86_64-apple-darwin12/sys-include    -c -g -O2 -pipe -Os  conftest.c >&5
177configure:4844: $? = 0
178configure:4844: result: yes
179configure:4844: checking for stdlib.h
180configure:4844: /opt/local/var/macports/build/_opt_local_var_macports_sources_rsync.macports.org_release_tarballs_ports_lang_gcc48/libgcc/work/build/./gcc/xgcc -B/opt/local/var/macports/build/_opt_local_var_macports_sources_rsync.macports.org_release_tarballs_ports_lang_gcc48/libgcc/work/build/./gcc/ -B/opt/local/x86_64-apple-darwin12/bin/ -B/opt/local/x86_64-apple-darwin12/lib/ -isystem /opt/local/x86_64-apple-darwin12/include -isystem /opt/local/x86_64-apple-darwin12/sys-include    -c -g -O2 -pipe -Os  conftest.c >&5
181configure:4844: $? = 0
182configure:4844: result: yes
183configure:4844: checking for string.h
184configure:4844: /opt/local/var/macports/build/_opt_local_var_macports_sources_rsync.macports.org_release_tarballs_ports_lang_gcc48/libgcc/work/build/./gcc/xgcc -B/opt/local/var/macports/build/_opt_local_var_macports_sources_rsync.macports.org_release_tarballs_ports_lang_gcc48/libgcc/work/build/./gcc/ -B/opt/local/x86_64-apple-darwin12/bin/ -B/opt/local/x86_64-apple-darwin12/lib/ -isystem /opt/local/x86_64-apple-darwin12/include -isystem /opt/local/x86_64-apple-darwin12/sys-include    -c -g -O2 -pipe -Os  conftest.c >&5
185configure:4844: $? = 0
186configure:4844: result: yes
187configure:4844: checking for memory.h
188configure:4844: /opt/local/var/macports/build/_opt_local_var_macports_sources_rsync.macports.org_release_tarballs_ports_lang_gcc48/libgcc/work/build/./gcc/xgcc -B/opt/local/var/macports/build/_opt_local_var_macports_sources_rsync.macports.org_release_tarballs_ports_lang_gcc48/libgcc/work/build/./gcc/ -B/opt/local/x86_64-apple-darwin12/bin/ -B/opt/local/x86_64-apple-darwin12/lib/ -isystem /opt/local/x86_64-apple-darwin12/include -isystem /opt/local/x86_64-apple-darwin12/sys-include    -c -g -O2 -pipe -Os  conftest.c >&5
189configure:4844: $? = 0
190configure:4844: result: yes
191configure:4844: checking for strings.h
192configure:4844: /opt/local/var/macports/build/_opt_local_var_macports_sources_rsync.macports.org_release_tarballs_ports_lang_gcc48/libgcc/work/build/./gcc/xgcc -B/opt/local/var/macports/build/_opt_local_var_macports_sources_rsync.macports.org_release_tarballs_ports_lang_gcc48/libgcc/work/build/./gcc/ -B/opt/local/x86_64-apple-darwin12/bin/ -B/opt/local/x86_64-apple-darwin12/lib/ -isystem /opt/local/x86_64-apple-darwin12/include -isystem /opt/local/x86_64-apple-darwin12/sys-include    -c -g -O2 -pipe -Os  conftest.c >&5
193configure:4844: $? = 0
194configure:4844: result: yes
195configure:4844: checking for inttypes.h
196configure:4844: /opt/local/var/macports/build/_opt_local_var_macports_sources_rsync.macports.org_release_tarballs_ports_lang_gcc48/libgcc/work/build/./gcc/xgcc -B/opt/local/var/macports/build/_opt_local_var_macports_sources_rsync.macports.org_release_tarballs_ports_lang_gcc48/libgcc/work/build/./gcc/ -B/opt/local/x86_64-apple-darwin12/bin/ -B/opt/local/x86_64-apple-darwin12/lib/ -isystem /opt/local/x86_64-apple-darwin12/include -isystem /opt/local/x86_64-apple-darwin12/sys-include    -c -g -O2 -pipe -Os  conftest.c >&5
197configure:4844: $? = 0
198configure:4844: result: yes
199configure:4844: checking for stdint.h
200configure:4844: /opt/local/var/macports/build/_opt_local_var_macports_sources_rsync.macports.org_release_tarballs_ports_lang_gcc48/libgcc/work/build/./gcc/xgcc -B/opt/local/var/macports/build/_opt_local_var_macports_sources_rsync.macports.org_release_tarballs_ports_lang_gcc48/libgcc/work/build/./gcc/ -B/opt/local/x86_64-apple-darwin12/bin/ -B/opt/local/x86_64-apple-darwin12/lib/ -isystem /opt/local/x86_64-apple-darwin12/include -isystem /opt/local/x86_64-apple-darwin12/sys-include    -c -g -O2 -pipe -Os  conftest.c >&5
201configure:4844: $? = 0
202configure:4844: result: yes
203configure:4844: checking for unistd.h
204configure:4844: /opt/local/var/macports/build/_opt_local_var_macports_sources_rsync.macports.org_release_tarballs_ports_lang_gcc48/libgcc/work/build/./gcc/xgcc -B/opt/local/var/macports/build/_opt_local_var_macports_sources_rsync.macports.org_release_tarballs_ports_lang_gcc48/libgcc/work/build/./gcc/ -B/opt/local/x86_64-apple-darwin12/bin/ -B/opt/local/x86_64-apple-darwin12/lib/ -isystem /opt/local/x86_64-apple-darwin12/include -isystem /opt/local/x86_64-apple-darwin12/sys-include    -c -g -O2 -pipe -Os  conftest.c >&5
205configure:4844: $? = 0
206configure:4844: result: yes
207configure:4858: checking minix/config.h usability
208configure:4858: /opt/local/var/macports/build/_opt_local_var_macports_sources_rsync.macports.org_release_tarballs_ports_lang_gcc48/libgcc/work/build/./gcc/xgcc -B/opt/local/var/macports/build/_opt_local_var_macports_sources_rsync.macports.org_release_tarballs_ports_lang_gcc48/libgcc/work/build/./gcc/ -B/opt/local/x86_64-apple-darwin12/bin/ -B/opt/local/x86_64-apple-darwin12/lib/ -isystem /opt/local/x86_64-apple-darwin12/include -isystem /opt/local/x86_64-apple-darwin12/sys-include    -c -g -O2 -pipe -Os  conftest.c >&5
209conftest.c:52:26: fatal error: minix/config.h: No such file or directory
210 #include <minix/config.h>
211                          ^
212compilation terminated.
213configure:4858: $? = 1
214configure: failed program was:
215| /* confdefs.h */
216| #define PACKAGE_NAME "GNU Fortran Runtime Library"
217| #define PACKAGE_TARNAME "libgfortran"
218| #define PACKAGE_VERSION "0.3"
219| #define PACKAGE_STRING "GNU Fortran Runtime Library 0.3"
220| #define PACKAGE_BUGREPORT ""
221| #define PACKAGE_URL "http://www.gnu.org/software/libgfortran/"
222| #define STDC_HEADERS 1
223| #define HAVE_SYS_TYPES_H 1
224| #define HAVE_SYS_STAT_H 1
225| #define HAVE_STDLIB_H 1
226| #define HAVE_STRING_H 1
227| #define HAVE_MEMORY_H 1
228| #define HAVE_STRINGS_H 1
229| #define HAVE_INTTYPES_H 1
230| #define HAVE_STDINT_H 1
231| #define HAVE_UNISTD_H 1
232| /* end confdefs.h.  */
233| #include <stdio.h>
234| #ifdef HAVE_SYS_TYPES_H
235| # include <sys/types.h>
236| #endif
237| #ifdef HAVE_SYS_STAT_H
238| # include <sys/stat.h>
239| #endif
240| #ifdef STDC_HEADERS
241| # include <stdlib.h>
242| # include <stddef.h>
243| #else
244| # ifdef HAVE_STDLIB_H
245| #  include <stdlib.h>
246| # endif
247| #endif
248| #ifdef HAVE_STRING_H
249| # if !defined STDC_HEADERS && defined HAVE_MEMORY_H
250| #  include <memory.h>
251| # endif
252| # include <string.h>
253| #endif
254| #ifdef HAVE_STRINGS_H
255| # include <strings.h>
256| #endif
257| #ifdef HAVE_INTTYPES_H
258| # include <inttypes.h>
259| #endif
260| #ifdef HAVE_STDINT_H
261| # include <stdint.h>
262| #endif
263| #ifdef HAVE_UNISTD_H
264| # include <unistd.h>
265| #endif
266| #include <minix/config.h>
267configure:4858: result: no
268configure:4858: checking minix/config.h presence
269configure:4858: /usr/bin/clang -E  conftest.c
270conftest.c:19:10: fatal error: 'minix/config.h' file not found
271#include <minix/config.h>
272         ^
2731 error generated.
274configure:4858: $? = 1
275configure: failed program was:
276| /* confdefs.h */
277| #define PACKAGE_NAME "GNU Fortran Runtime Library"
278| #define PACKAGE_TARNAME "libgfortran"
279| #define PACKAGE_VERSION "0.3"
280| #define PACKAGE_STRING "GNU Fortran Runtime Library 0.3"
281| #define PACKAGE_BUGREPORT ""
282| #define PACKAGE_URL "http://www.gnu.org/software/libgfortran/"
283| #define STDC_HEADERS 1
284| #define HAVE_SYS_TYPES_H 1
285| #define HAVE_SYS_STAT_H 1
286| #define HAVE_STDLIB_H 1
287| #define HAVE_STRING_H 1
288| #define HAVE_MEMORY_H 1
289| #define HAVE_STRINGS_H 1
290| #define HAVE_INTTYPES_H 1
291| #define HAVE_STDINT_H 1
292| #define HAVE_UNISTD_H 1
293| /* end confdefs.h.  */
294| #include <minix/config.h>
295configure:4858: result: no
296configure:4858: checking for minix/config.h
297configure:4858: result: no
298configure:4879: checking whether it is safe to define __EXTENSIONS__
299configure:4897: /opt/local/var/macports/build/_opt_local_var_macports_sources_rsync.macports.org_release_tarballs_ports_lang_gcc48/libgcc/work/build/./gcc/xgcc -B/opt/local/var/macports/build/_opt_local_var_macports_sources_rsync.macports.org_release_tarballs_ports_lang_gcc48/libgcc/work/build/./gcc/ -B/opt/local/x86_64-apple-darwin12/bin/ -B/opt/local/x86_64-apple-darwin12/lib/ -isystem /opt/local/x86_64-apple-darwin12/include -isystem /opt/local/x86_64-apple-darwin12/sys-include    -c -g -O2 -pipe -Os  conftest.c >&5
300configure:4897: $? = 0
301configure:4904: result: yes
302configure:4974: checking for x86_64-apple-darwin12-gcc
303configure:5001: result: /opt/local/var/macports/build/_opt_local_var_macports_sources_rsync.macports.org_release_tarballs_ports_lang_gcc48/libgcc/work/build/./gcc/xgcc -B/opt/local/var/macports/build/_opt_local_var_macports_sources_rsync.macports.org_release_tarballs_ports_lang_gcc48/libgcc/work/build/./gcc/ -B/opt/local/x86_64-apple-darwin12/bin/ -B/opt/local/x86_64-apple-darwin12/lib/ -isystem /opt/local/x86_64-apple-darwin12/include -isystem /opt/local/x86_64-apple-darwin12/sys-include   
304configure:5270: checking for C compiler version
305configure:5279: /opt/local/var/macports/build/_opt_local_var_macports_sources_rsync.macports.org_release_tarballs_ports_lang_gcc48/libgcc/work/build/./gcc/xgcc -B/opt/local/var/macports/build/_opt_local_var_macports_sources_rsync.macports.org_release_tarballs_ports_lang_gcc48/libgcc/work/build/./gcc/ -B/opt/local/x86_64-apple-darwin12/bin/ -B/opt/local/x86_64-apple-darwin12/lib/ -isystem /opt/local/x86_64-apple-darwin12/include -isystem /opt/local/x86_64-apple-darwin12/sys-include    --version >&5
306xgcc (MacPorts gcc48 4.8.2_0) 4.8.2
307Copyright (C) 2013 Free Software Foundation, Inc.
308This is free software; see the source for copying conditions.  There is NO
309warranty; not even for MERCHANTABILITY or FITNESS FOR A PARTICULAR PURPOSE.
310
311configure:5290: $? = 0
312configure:5279: /opt/local/var/macports/build/_opt_local_var_macports_sources_rsync.macports.org_release_tarballs_ports_lang_gcc48/libgcc/work/build/./gcc/xgcc -B/opt/local/var/macports/build/_opt_local_var_macports_sources_rsync.macports.org_release_tarballs_ports_lang_gcc48/libgcc/work/build/./gcc/ -B/opt/local/x86_64-apple-darwin12/bin/ -B/opt/local/x86_64-apple-darwin12/lib/ -isystem /opt/local/x86_64-apple-darwin12/include -isystem /opt/local/x86_64-apple-darwin12/sys-include    -v >&5
313Reading specs from /opt/local/var/macports/build/_opt_local_var_macports_sources_rsync.macports.org_release_tarballs_ports_lang_gcc48/libgcc/work/build/./gcc/specs
314COLLECT_GCC=/opt/local/var/macports/build/_opt_local_var_macports_sources_rsync.macports.org_release_tarballs_ports_lang_gcc48/libgcc/work/build/./gcc/xgcc
315COLLECT_LTO_WRAPPER=/opt/local/var/macports/build/_opt_local_var_macports_sources_rsync.macports.org_release_tarballs_ports_lang_gcc48/libgcc/work/build/./gcc/lto-wrapper
316Target: x86_64-apple-darwin12
317Configured with: /opt/local/var/macports/build/_opt_local_var_macports_sources_rsync.macports.org_release_tarballs_ports_lang_gcc48/libgcc/work/gcc-4.8.2/configure --prefix=/opt/local --build=x86_64-apple-darwin12 --includedir=/opt/local/include/gcc48 --infodir=/opt/local/share/info --mandir=/opt/local/share/man --datarootdir=/opt/local/share/gcc-4.8 --with-local-prefix=/opt/local --with-system-zlib --disable-nls --program-suffix=-mp-4.8 --with-gxx-include-dir=/opt/local/include/gcc48/c++/ --with-gmp=/opt/local --with-mpfr=/opt/local --with-mpc=/opt/local --with-cloog=/opt/local --enable-cloog-backend=isl --disable-cloog-version-check --enable-stage1-checking --disable-multilib --enable-lto --enable-libstdcxx-time --with-as=/opt/local/bin/as --with-ld=/opt/local/bin/ld --with-ar=/opt/local/bin/ar --with-bugurl=https://trac.macports.org/newticket --libdir=/opt/local/lib/libgcc --enable-languages=c,c++,objc,obj-c++,lto,fortran --with-pkgversion='MacPorts gcc48 4.8.2_0'
318Thread model: posix
319gcc version 4.8.2 (MacPorts gcc48 4.8.2_0)
320configure:5290: $? = 0
321configure:5279: /opt/local/var/macports/build/_opt_local_var_macports_sources_rsync.macports.org_release_tarballs_ports_lang_gcc48/libgcc/work/build/./gcc/xgcc -B/opt/local/var/macports/build/_opt_local_var_macports_sources_rsync.macports.org_release_tarballs_ports_lang_gcc48/libgcc/work/build/./gcc/ -B/opt/local/x86_64-apple-darwin12/bin/ -B/opt/local/x86_64-apple-darwin12/lib/ -isystem /opt/local/x86_64-apple-darwin12/include -isystem /opt/local/x86_64-apple-darwin12/sys-include    -V >&5
322xgcc: error: unrecognized command line option '-V'
323xgcc: fatal error: no input files
324compilation terminated.
325configure:5290: $? = 1
326configure:5279: /opt/local/var/macports/build/_opt_local_var_macports_sources_rsync.macports.org_release_tarballs_ports_lang_gcc48/libgcc/work/build/./gcc/xgcc -B/opt/local/var/macports/build/_opt_local_var_macports_sources_rsync.macports.org_release_tarballs_ports_lang_gcc48/libgcc/work/build/./gcc/ -B/opt/local/x86_64-apple-darwin12/bin/ -B/opt/local/x86_64-apple-darwin12/lib/ -isystem /opt/local/x86_64-apple-darwin12/include -isystem /opt/local/x86_64-apple-darwin12/sys-include    -qversion >&5
327xgcc: error: unrecognized command line option '-qversion'
328xgcc: fatal error: no input files
329compilation terminated.
330configure:5290: $? = 1
331configure:5294: checking whether we are using the GNU C compiler
332configure:5322: result: yes
333configure:5331: checking whether /opt/local/var/macports/build/_opt_local_var_macports_sources_rsync.macports.org_release_tarballs_ports_lang_gcc48/libgcc/work/build/./gcc/xgcc -B/opt/local/var/macports/build/_opt_local_var_macports_sources_rsync.macports.org_release_tarballs_ports_lang_gcc48/libgcc/work/build/./gcc/ -B/opt/local/x86_64-apple-darwin12/bin/ -B/opt/local/x86_64-apple-darwin12/lib/ -isystem /opt/local/x86_64-apple-darwin12/include -isystem /opt/local/x86_64-apple-darwin12/sys-include    accepts -g
334configure:5392: result: yes
335configure:5409: checking for /opt/local/var/macports/build/_opt_local_var_macports_sources_rsync.macports.org_release_tarballs_ports_lang_gcc48/libgcc/work/build/./gcc/xgcc -B/opt/local/var/macports/build/_opt_local_var_macports_sources_rsync.macports.org_release_tarballs_ports_lang_gcc48/libgcc/work/build/./gcc/ -B/opt/local/x86_64-apple-darwin12/bin/ -B/opt/local/x86_64-apple-darwin12/lib/ -isystem /opt/local/x86_64-apple-darwin12/include -isystem /opt/local/x86_64-apple-darwin12/sys-include    option to accept ISO C89
336configure:5486: result: none needed
337configure:5508: checking dependency style of /opt/local/var/macports/build/_opt_local_var_macports_sources_rsync.macports.org_release_tarballs_ports_lang_gcc48/libgcc/work/build/./gcc/xgcc -B/opt/local/var/macports/build/_opt_local_var_macports_sources_rsync.macports.org_release_tarballs_ports_lang_gcc48/libgcc/work/build/./gcc/ -B/opt/local/x86_64-apple-darwin12/bin/ -B/opt/local/x86_64-apple-darwin12/lib/ -isystem /opt/local/x86_64-apple-darwin12/include -isystem /opt/local/x86_64-apple-darwin12/sys-include   
338configure:5619: result: gcc3
339configure:5639: checking whether /opt/local/var/macports/build/_opt_local_var_macports_sources_rsync.macports.org_release_tarballs_ports_lang_gcc48/libgcc/work/build/./gcc/xgcc -B/opt/local/var/macports/build/_opt_local_var_macports_sources_rsync.macports.org_release_tarballs_ports_lang_gcc48/libgcc/work/build/./gcc/ -B/opt/local/x86_64-apple-darwin12/bin/ -B/opt/local/x86_64-apple-darwin12/lib/ -isystem /opt/local/x86_64-apple-darwin12/include -isystem /opt/local/x86_64-apple-darwin12/sys-include    and cc understand -c and -o together
340configure:5670: /opt/local/var/macports/build/_opt_local_var_macports_sources_rsync.macports.org_release_tarballs_ports_lang_gcc48/libgcc/work/build/./gcc/xgcc -B/opt/local/var/macports/build/_opt_local_var_macports_sources_rsync.macports.org_release_tarballs_ports_lang_gcc48/libgcc/work/build/./gcc/ -B/opt/local/x86_64-apple-darwin12/bin/ -B/opt/local/x86_64-apple-darwin12/lib/ -isystem /opt/local/x86_64-apple-darwin12/include -isystem /opt/local/x86_64-apple-darwin12/sys-include    -c conftest.c -o conftest2.o >&5
341configure:5674: $? = 0
342configure:5680: /opt/local/var/macports/build/_opt_local_var_macports_sources_rsync.macports.org_release_tarballs_ports_lang_gcc48/libgcc/work/build/./gcc/xgcc -B/opt/local/var/macports/build/_opt_local_var_macports_sources_rsync.macports.org_release_tarballs_ports_lang_gcc48/libgcc/work/build/./gcc/ -B/opt/local/x86_64-apple-darwin12/bin/ -B/opt/local/x86_64-apple-darwin12/lib/ -isystem /opt/local/x86_64-apple-darwin12/include -isystem /opt/local/x86_64-apple-darwin12/sys-include    -c conftest.c -o conftest2.o >&5
343configure:5684: $? = 0
344configure:5695: cc -c conftest.c >&5
345configure:5699: $? = 0
346configure:5707: cc -c conftest.c -o conftest2.o >&5
347configure:5711: $? = 0
348configure:5717: cc -c conftest.c -o conftest2.o >&5
349configure:5721: $? = 0
350configure:5739: result: yes
351configure:5780: checking whether symbol versioning is supported
352configure:5811: /opt/local/var/macports/build/_opt_local_var_macports_sources_rsync.macports.org_release_tarballs_ports_lang_gcc48/libgcc/work/build/./gcc/xgcc -B/opt/local/var/macports/build/_opt_local_var_macports_sources_rsync.macports.org_release_tarballs_ports_lang_gcc48/libgcc/work/build/./gcc/ -B/opt/local/x86_64-apple-darwin12/bin/ -B/opt/local/x86_64-apple-darwin12/lib/ -isystem /opt/local/x86_64-apple-darwin12/include -isystem /opt/local/x86_64-apple-darwin12/sys-include    -o conftest -std=gnu99 -g -O2 -pipe -Os   -fPIC -shared -Wl,--version-script,./conftest.map conftest.c  >&5
353ld: unknown option: --version-script
354collect2: error: ld returned 1 exit status
355configure:5811: $? = 1
356configure: failed program was:
357| /* confdefs.h */
358| #define PACKAGE_NAME "GNU Fortran Runtime Library"
359| #define PACKAGE_TARNAME "libgfortran"
360| #define PACKAGE_VERSION "0.3"
361| #define PACKAGE_STRING "GNU Fortran Runtime Library 0.3"
362| #define PACKAGE_BUGREPORT ""
363| #define PACKAGE_URL "http://www.gnu.org/software/libgfortran/"
364| #define STDC_HEADERS 1
365| #define HAVE_SYS_TYPES_H 1
366| #define HAVE_SYS_STAT_H 1
367| #define HAVE_STDLIB_H 1
368| #define HAVE_STRING_H 1
369| #define HAVE_MEMORY_H 1
370| #define HAVE_STRINGS_H 1
371| #define HAVE_INTTYPES_H 1
372| #define HAVE_STDINT_H 1
373| #define HAVE_UNISTD_H 1
374| #define __EXTENSIONS__ 1
375| #define _ALL_SOURCE 1
376| #define _GNU_SOURCE 1
377| #define _POSIX_PTHREAD_SEMANTICS 1
378| #define _TANDEM_SOURCE 1
379| /* end confdefs.h.  */
380| int foo;
381| int
382| main ()
383| {
384|
385|   ;
386|   return 0;
387| }
388configure:5855: result: no
389configure:5888: checking for gcc that supports -ffunction-sections -fdata-sections
390configure:5902: /opt/local/var/macports/build/_opt_local_var_macports_sources_rsync.macports.org_release_tarballs_ports_lang_gcc48/libgcc/work/build/./gcc/xgcc -B/opt/local/var/macports/build/_opt_local_var_macports_sources_rsync.macports.org_release_tarballs_ports_lang_gcc48/libgcc/work/build/./gcc/ -B/opt/local/x86_64-apple-darwin12/bin/ -B/opt/local/x86_64-apple-darwin12/lib/ -isystem /opt/local/x86_64-apple-darwin12/include -isystem /opt/local/x86_64-apple-darwin12/sys-include    -c -Werror -ffunction-sections -fdata-sections  conftest.c >&5
391configure:5902: $? = 0
392configure:5917: result: yes
393configure:5925: checking for x86_64-apple-darwin12-as
394configure:5952: result: /opt/local/var/macports/build/_opt_local_var_macports_sources_rsync.macports.org_release_tarballs_ports_lang_gcc48/libgcc/work/build/./gcc/as
395configure:6017: checking for x86_64-apple-darwin12-ar
396configure:6044: result: /opt/local/bin/ar
397configure:6109: checking for x86_64-apple-darwin12-ranlib
398configure:6136: result: /opt/local/bin/ranlib
399configure:6198: checking whether /usr/bin/make sets $(MAKE)
400configure:6220: result: yes
401configure:6283: checking how to print strings
402configure:6310: result: printf
403configure:6331: checking for a sed that does not truncate output
404configure:6395: result: /opt/local/bin/gsed
405configure:6413: checking for fgrep
406configure:6475: result: /opt/local/bin/grep -F
407configure:6510: checking for ld used by /opt/local/var/macports/build/_opt_local_var_macports_sources_rsync.macports.org_release_tarballs_ports_lang_gcc48/libgcc/work/build/./gcc/xgcc -B/opt/local/var/macports/build/_opt_local_var_macports_sources_rsync.macports.org_release_tarballs_ports_lang_gcc48/libgcc/work/build/./gcc/ -B/opt/local/x86_64-apple-darwin12/bin/ -B/opt/local/x86_64-apple-darwin12/lib/ -isystem /opt/local/x86_64-apple-darwin12/include -isystem /opt/local/x86_64-apple-darwin12/sys-include   
408configure:6577: result: /opt/local/var/macports/build/_opt_local_var_macports_sources_rsync.macports.org_release_tarballs_ports_lang_gcc48/libgcc/work/build/./gcc/collect-ld
409configure:6584: checking if the linker (/opt/local/var/macports/build/_opt_local_var_macports_sources_rsync.macports.org_release_tarballs_ports_lang_gcc48/libgcc/work/build/./gcc/collect-ld) is GNU ld
410configure:6599: result: no
411configure:6611: checking for BSD- or MS-compatible name lister (nm)
412configure:6660: result: /opt/local/var/macports/build/_opt_local_var_macports_sources_rsync.macports.org_release_tarballs_ports_lang_gcc48/libgcc/work/build/./gcc/nm
413configure:6790: checking the name lister (/opt/local/var/macports/build/_opt_local_var_macports_sources_rsync.macports.org_release_tarballs_ports_lang_gcc48/libgcc/work/build/./gcc/nm) interface
414configure:6797: /opt/local/var/macports/build/_opt_local_var_macports_sources_rsync.macports.org_release_tarballs_ports_lang_gcc48/libgcc/work/build/./gcc/xgcc -B/opt/local/var/macports/build/_opt_local_var_macports_sources_rsync.macports.org_release_tarballs_ports_lang_gcc48/libgcc/work/build/./gcc/ -B/opt/local/x86_64-apple-darwin12/bin/ -B/opt/local/x86_64-apple-darwin12/lib/ -isystem /opt/local/x86_64-apple-darwin12/include -isystem /opt/local/x86_64-apple-darwin12/sys-include    -c -std=gnu99 -g -O2 -pipe -Os  conftest.c >&5
415configure:6800: /opt/local/var/macports/build/_opt_local_var_macports_sources_rsync.macports.org_release_tarballs_ports_lang_gcc48/libgcc/work/build/./gcc/nm "conftest.o"
416configure:6803: output
4170000000000000224 S _some_variable
418configure:6810: result: BSD nm
419configure:6813: checking whether ln -s works
420configure:6817: result: yes
421configure:6825: checking the maximum length of command line arguments
422configure:6950: result: 196608
423configure:6967: checking whether the shell understands some XSI constructs
424configure:6977: result: yes
425configure:6981: checking whether the shell understands "+="
426configure:6987: result: yes
427configure:7022: checking for /opt/local/var/macports/build/_opt_local_var_macports_sources_rsync.macports.org_release_tarballs_ports_lang_gcc48/libgcc/work/build/./gcc/collect-ld option to reload object files
428configure:7029: result: -r
429configure:7058: checking for x86_64-apple-darwin12-objdump
430configure:7085: result: /opt/local/bin/objdump
431configure:7157: checking how to recognize dependent libraries
432configure:7358: result: pass_all
433configure:7378: checking for x86_64-apple-darwin12-ar
434configure:7405: result: /opt/local/bin/ar
435configure:7483: checking for x86_64-apple-darwin12-strip
436configure:7510: result: /opt/local/bin/strip
437configure:7582: checking for x86_64-apple-darwin12-ranlib
438configure:7609: result: /opt/local/bin/ranlib
439configure:7751: checking command to parse /opt/local/var/macports/build/_opt_local_var_macports_sources_rsync.macports.org_release_tarballs_ports_lang_gcc48/libgcc/work/build/./gcc/nm output from /opt/local/var/macports/build/_opt_local_var_macports_sources_rsync.macports.org_release_tarballs_ports_lang_gcc48/libgcc/work/build/./gcc/xgcc -B/opt/local/var/macports/build/_opt_local_var_macports_sources_rsync.macports.org_release_tarballs_ports_lang_gcc48/libgcc/work/build/./gcc/ -B/opt/local/x86_64-apple-darwin12/bin/ -B/opt/local/x86_64-apple-darwin12/lib/ -isystem /opt/local/x86_64-apple-darwin12/include -isystem /opt/local/x86_64-apple-darwin12/sys-include    object
440configure:7869: /opt/local/var/macports/build/_opt_local_var_macports_sources_rsync.macports.org_release_tarballs_ports_lang_gcc48/libgcc/work/build/./gcc/xgcc -B/opt/local/var/macports/build/_opt_local_var_macports_sources_rsync.macports.org_release_tarballs_ports_lang_gcc48/libgcc/work/build/./gcc/ -B/opt/local/x86_64-apple-darwin12/bin/ -B/opt/local/x86_64-apple-darwin12/lib/ -isystem /opt/local/x86_64-apple-darwin12/include -isystem /opt/local/x86_64-apple-darwin12/sys-include    -c -std=gnu99 -g -O2 -pipe -Os  conftest.c >&5
441configure:7872: $? = 0
442configure:7876: /opt/local/var/macports/build/_opt_local_var_macports_sources_rsync.macports.org_release_tarballs_ports_lang_gcc48/libgcc/work/build/./gcc/nm conftest.o \| sed -n -e 's/^.*[ ]\([BCDEGRST][BCDEGRST]*\)[ ][ ]*\([_A-Za-z][_A-Za-z0-9]*\)$/\1 \2 \2/p' \> conftest.nm
443configure:7879: $? = 0
444cannot find nm_test_var in conftest.nm
445configure:7869: /opt/local/var/macports/build/_opt_local_var_macports_sources_rsync.macports.org_release_tarballs_ports_lang_gcc48/libgcc/work/build/./gcc/xgcc -B/opt/local/var/macports/build/_opt_local_var_macports_sources_rsync.macports.org_release_tarballs_ports_lang_gcc48/libgcc/work/build/./gcc/ -B/opt/local/x86_64-apple-darwin12/bin/ -B/opt/local/x86_64-apple-darwin12/lib/ -isystem /opt/local/x86_64-apple-darwin12/include -isystem /opt/local/x86_64-apple-darwin12/sys-include    -c -std=gnu99 -g -O2 -pipe -Os  conftest.c >&5
446configure:7872: $? = 0
447configure:7876: /opt/local/var/macports/build/_opt_local_var_macports_sources_rsync.macports.org_release_tarballs_ports_lang_gcc48/libgcc/work/build/./gcc/nm conftest.o \| sed -n -e 's/^.*[ ]\([BCDEGRST][BCDEGRST]*\)[ ][ ]*_\([_A-Za-z][_A-Za-z0-9]*\)$/\1 _\2 \2/p' \> conftest.nm
448configure:7879: $? = 0
449configure:7933: /opt/local/var/macports/build/_opt_local_var_macports_sources_rsync.macports.org_release_tarballs_ports_lang_gcc48/libgcc/work/build/./gcc/xgcc -B/opt/local/var/macports/build/_opt_local_var_macports_sources_rsync.macports.org_release_tarballs_ports_lang_gcc48/libgcc/work/build/./gcc/ -B/opt/local/x86_64-apple-darwin12/bin/ -B/opt/local/x86_64-apple-darwin12/lib/ -isystem /opt/local/x86_64-apple-darwin12/include -isystem /opt/local/x86_64-apple-darwin12/sys-include    -o conftest -std=gnu99 -g -O2 -pipe -Os   conftest.c conftstm.o >&5
450configure:7936: $? = 0
451configure:7974: result: ok
452configure:8208: checking for x86_64-apple-darwin12-dsymutil
453configure:8238: result: no
454configure:8248: checking for dsymutil
455configure:8264: found /usr/bin/dsymutil
456configure:8275: result: dsymutil
457configure:8300: checking for x86_64-apple-darwin12-nmedit
458configure:8330: result: no
459configure:8340: checking for nmedit
460configure:8356: found /opt/local/bin/nmedit
461configure:8367: result: nmedit
462configure:8392: checking for x86_64-apple-darwin12-lipo
463configure:8419: result: lipo
464configure:8484: checking for x86_64-apple-darwin12-otool
465configure:8514: result: no
466configure:8524: checking for otool
467configure:8540: found /opt/local/bin/otool
468configure:8551: result: otool
469configure:8576: checking for x86_64-apple-darwin12-otool64
470configure:8606: result: no
471configure:8616: checking for otool64
472configure:8646: result: no
473configure:8691: checking for -single_module linker flag
474/opt/local/var/macports/build/_opt_local_var_macports_sources_rsync.macports.org_release_tarballs_ports_lang_gcc48/libgcc/work/build/./gcc/xgcc -B/opt/local/var/macports/build/_opt_local_var_macports_sources_rsync.macports.org_release_tarballs_ports_lang_gcc48/libgcc/work/build/./gcc/ -B/opt/local/x86_64-apple-darwin12/bin/ -B/opt/local/x86_64-apple-darwin12/lib/ -isystem /opt/local/x86_64-apple-darwin12/include -isystem /opt/local/x86_64-apple-darwin12/sys-include    -std=gnu99 -g -O2 -pipe -Os  -o libconftest.dylib -dynamiclib -Wl,-single_module conftest.c
475configure:8718: result: yes
476configure:8720: checking for -exported_symbols_list linker flag
477configure:8743: /opt/local/var/macports/build/_opt_local_var_macports_sources_rsync.macports.org_release_tarballs_ports_lang_gcc48/libgcc/work/build/./gcc/xgcc -B/opt/local/var/macports/build/_opt_local_var_macports_sources_rsync.macports.org_release_tarballs_ports_lang_gcc48/libgcc/work/build/./gcc/ -B/opt/local/x86_64-apple-darwin12/bin/ -B/opt/local/x86_64-apple-darwin12/lib/ -isystem /opt/local/x86_64-apple-darwin12/include -isystem /opt/local/x86_64-apple-darwin12/sys-include    -o conftest -std=gnu99 -g -O2 -pipe -Os   -Wl,-exported_symbols_list,conftest.sym conftest.c  >&5
478configure:8743: $? = 0
479configure:8753: result: yes
480configure:8755: checking for -force_load linker flag
481/opt/local/var/macports/build/_opt_local_var_macports_sources_rsync.macports.org_release_tarballs_ports_lang_gcc48/libgcc/work/build/./gcc/xgcc -B/opt/local/var/macports/build/_opt_local_var_macports_sources_rsync.macports.org_release_tarballs_ports_lang_gcc48/libgcc/work/build/./gcc/ -B/opt/local/x86_64-apple-darwin12/bin/ -B/opt/local/x86_64-apple-darwin12/lib/ -isystem /opt/local/x86_64-apple-darwin12/include -isystem /opt/local/x86_64-apple-darwin12/sys-include    -std=gnu99 -g -O2 -pipe -Os -c -o conftest.o conftest.c
482/opt/local/bin/ar cru libconftest.a conftest.o
483/opt/local/var/macports/build/_opt_local_var_macports_sources_rsync.macports.org_release_tarballs_ports_lang_gcc48/libgcc/work/build/./gcc/xgcc -B/opt/local/var/macports/build/_opt_local_var_macports_sources_rsync.macports.org_release_tarballs_ports_lang_gcc48/libgcc/work/build/./gcc/ -B/opt/local/x86_64-apple-darwin12/bin/ -B/opt/local/x86_64-apple-darwin12/lib/ -isystem /opt/local/x86_64-apple-darwin12/include -isystem /opt/local/x86_64-apple-darwin12/sys-include    -std=gnu99 -g -O2 -pipe -Os  -o conftest conftest.c -Wl,-force_load,./libconftest.a
484configure:8783: result: yes
485configure:8822: checking for dlfcn.h
486configure:8822: /opt/local/var/macports/build/_opt_local_var_macports_sources_rsync.macports.org_release_tarballs_ports_lang_gcc48/libgcc/work/build/./gcc/xgcc -B/opt/local/var/macports/build/_opt_local_var_macports_sources_rsync.macports.org_release_tarballs_ports_lang_gcc48/libgcc/work/build/./gcc/ -B/opt/local/x86_64-apple-darwin12/bin/ -B/opt/local/x86_64-apple-darwin12/lib/ -isystem /opt/local/x86_64-apple-darwin12/include -isystem /opt/local/x86_64-apple-darwin12/sys-include    -c -std=gnu99 -g -O2 -pipe -Os  conftest.c >&5
487configure:8822: $? = 0
488configure:8822: result: yes
489configure:9007: checking for objdir
490configure:9022: result: .libs
491configure:9293: checking if /opt/local/var/macports/build/_opt_local_var_macports_sources_rsync.macports.org_release_tarballs_ports_lang_gcc48/libgcc/work/build/./gcc/xgcc -B/opt/local/var/macports/build/_opt_local_var_macports_sources_rsync.macports.org_release_tarballs_ports_lang_gcc48/libgcc/work/build/./gcc/ -B/opt/local/x86_64-apple-darwin12/bin/ -B/opt/local/x86_64-apple-darwin12/lib/ -isystem /opt/local/x86_64-apple-darwin12/include -isystem /opt/local/x86_64-apple-darwin12/sys-include    supports -fno-rtti -fno-exceptions
492configure:9311: /opt/local/var/macports/build/_opt_local_var_macports_sources_rsync.macports.org_release_tarballs_ports_lang_gcc48/libgcc/work/build/./gcc/xgcc -B/opt/local/var/macports/build/_opt_local_var_macports_sources_rsync.macports.org_release_tarballs_ports_lang_gcc48/libgcc/work/build/./gcc/ -B/opt/local/x86_64-apple-darwin12/bin/ -B/opt/local/x86_64-apple-darwin12/lib/ -isystem /opt/local/x86_64-apple-darwin12/include -isystem /opt/local/x86_64-apple-darwin12/sys-include    -c -std=gnu99 -g -O2 -pipe -Os  -fno-rtti -fno-exceptions conftest.c >&5
493cc1: warning: command line option '-fno-rtti' is valid for C++/ObjC++ but not for C [enabled by default]
494configure:9315: $? = 0
495configure:9328: result: no
496configure:9348: checking for /opt/local/var/macports/build/_opt_local_var_macports_sources_rsync.macports.org_release_tarballs_ports_lang_gcc48/libgcc/work/build/./gcc/xgcc -B/opt/local/var/macports/build/_opt_local_var_macports_sources_rsync.macports.org_release_tarballs_ports_lang_gcc48/libgcc/work/build/./gcc/ -B/opt/local/x86_64-apple-darwin12/bin/ -B/opt/local/x86_64-apple-darwin12/lib/ -isystem /opt/local/x86_64-apple-darwin12/include -isystem /opt/local/x86_64-apple-darwin12/sys-include    option to produce PIC
497configure:9634: result: -fno-common -DPIC
498configure:9646: checking if /opt/local/var/macports/build/_opt_local_var_macports_sources_rsync.macports.org_release_tarballs_ports_lang_gcc48/libgcc/work/build/./gcc/xgcc -B/opt/local/var/macports/build/_opt_local_var_macports_sources_rsync.macports.org_release_tarballs_ports_lang_gcc48/libgcc/work/build/./gcc/ -B/opt/local/x86_64-apple-darwin12/bin/ -B/opt/local/x86_64-apple-darwin12/lib/ -isystem /opt/local/x86_64-apple-darwin12/include -isystem /opt/local/x86_64-apple-darwin12/sys-include    PIC flag -fno-common -DPIC works
499configure:9664: /opt/local/var/macports/build/_opt_local_var_macports_sources_rsync.macports.org_release_tarballs_ports_lang_gcc48/libgcc/work/build/./gcc/xgcc -B/opt/local/var/macports/build/_opt_local_var_macports_sources_rsync.macports.org_release_tarballs_ports_lang_gcc48/libgcc/work/build/./gcc/ -B/opt/local/x86_64-apple-darwin12/bin/ -B/opt/local/x86_64-apple-darwin12/lib/ -isystem /opt/local/x86_64-apple-darwin12/include -isystem /opt/local/x86_64-apple-darwin12/sys-include    -c -std=gnu99 -g -O2 -pipe -Os  -fno-common -DPIC -DPIC conftest.c >&5
500configure:9668: $? = 0
501configure:9681: result: yes
502configure:9705: checking if /opt/local/var/macports/build/_opt_local_var_macports_sources_rsync.macports.org_release_tarballs_ports_lang_gcc48/libgcc/work/build/./gcc/xgcc -B/opt/local/var/macports/build/_opt_local_var_macports_sources_rsync.macports.org_release_tarballs_ports_lang_gcc48/libgcc/work/build/./gcc/ -B/opt/local/x86_64-apple-darwin12/bin/ -B/opt/local/x86_64-apple-darwin12/lib/ -isystem /opt/local/x86_64-apple-darwin12/include -isystem /opt/local/x86_64-apple-darwin12/sys-include    static flag -static works
503configure:9733: result: no
504configure:9748: checking if /opt/local/var/macports/build/_opt_local_var_macports_sources_rsync.macports.org_release_tarballs_ports_lang_gcc48/libgcc/work/build/./gcc/xgcc -B/opt/local/var/macports/build/_opt_local_var_macports_sources_rsync.macports.org_release_tarballs_ports_lang_gcc48/libgcc/work/build/./gcc/ -B/opt/local/x86_64-apple-darwin12/bin/ -B/opt/local/x86_64-apple-darwin12/lib/ -isystem /opt/local/x86_64-apple-darwin12/include -isystem /opt/local/x86_64-apple-darwin12/sys-include    supports -c -o file.o
505configure:9769: /opt/local/var/macports/build/_opt_local_var_macports_sources_rsync.macports.org_release_tarballs_ports_lang_gcc48/libgcc/work/build/./gcc/xgcc -B/opt/local/var/macports/build/_opt_local_var_macports_sources_rsync.macports.org_release_tarballs_ports_lang_gcc48/libgcc/work/build/./gcc/ -B/opt/local/x86_64-apple-darwin12/bin/ -B/opt/local/x86_64-apple-darwin12/lib/ -isystem /opt/local/x86_64-apple-darwin12/include -isystem /opt/local/x86_64-apple-darwin12/sys-include    -c -std=gnu99 -g -O2 -pipe -Os  -o out/conftest2.o conftest.c >&5
506configure:9773: $? = 0
507configure:9795: result: yes
508configure:9803: checking if /opt/local/var/macports/build/_opt_local_var_macports_sources_rsync.macports.org_release_tarballs_ports_lang_gcc48/libgcc/work/build/./gcc/xgcc -B/opt/local/var/macports/build/_opt_local_var_macports_sources_rsync.macports.org_release_tarballs_ports_lang_gcc48/libgcc/work/build/./gcc/ -B/opt/local/x86_64-apple-darwin12/bin/ -B/opt/local/x86_64-apple-darwin12/lib/ -isystem /opt/local/x86_64-apple-darwin12/include -isystem /opt/local/x86_64-apple-darwin12/sys-include    supports -c -o file.o
509configure:9850: result: yes
510configure:9883: checking whether the /opt/local/var/macports/build/_opt_local_var_macports_sources_rsync.macports.org_release_tarballs_ports_lang_gcc48/libgcc/work/build/./gcc/xgcc -B/opt/local/var/macports/build/_opt_local_var_macports_sources_rsync.macports.org_release_tarballs_ports_lang_gcc48/libgcc/work/build/./gcc/ -B/opt/local/x86_64-apple-darwin12/bin/ -B/opt/local/x86_64-apple-darwin12/lib/ -isystem /opt/local/x86_64-apple-darwin12/include -isystem /opt/local/x86_64-apple-darwin12/sys-include    linker (/opt/local/var/macports/build/_opt_local_var_macports_sources_rsync.macports.org_release_tarballs_ports_lang_gcc48/libgcc/work/build/./gcc/collect-ld) supports shared libraries
511configure:10963: result: yes
512configure:11208: checking dynamic linker characteristics
513configure:11884: result: darwin12 dyld
514configure:11991: checking how to hardcode library paths into programs
515configure:12016: result: immediate
516configure:12061: checking for dlopen in -ldl
517configure:12089: /opt/local/var/macports/build/_opt_local_var_macports_sources_rsync.macports.org_release_tarballs_ports_lang_gcc48/libgcc/work/build/./gcc/xgcc -B/opt/local/var/macports/build/_opt_local_var_macports_sources_rsync.macports.org_release_tarballs_ports_lang_gcc48/libgcc/work/build/./gcc/ -B/opt/local/x86_64-apple-darwin12/bin/ -B/opt/local/x86_64-apple-darwin12/lib/ -isystem /opt/local/x86_64-apple-darwin12/include -isystem /opt/local/x86_64-apple-darwin12/sys-include    -o conftest -std=gnu99 -g -O2 -pipe -Os   conftest.c -ldl   >&5
518configure:12089: $? = 0
519configure:12098: result: yes
520configure:12325: checking whether a program can dlopen itself
521configure:12405: /opt/local/var/macports/build/_opt_local_var_macports_sources_rsync.macports.org_release_tarballs_ports_lang_gcc48/libgcc/work/build/./gcc/xgcc -B/opt/local/var/macports/build/_opt_local_var_macports_sources_rsync.macports.org_release_tarballs_ports_lang_gcc48/libgcc/work/build/./gcc/ -B/opt/local/x86_64-apple-darwin12/bin/ -B/opt/local/x86_64-apple-darwin12/lib/ -isystem /opt/local/x86_64-apple-darwin12/include -isystem /opt/local/x86_64-apple-darwin12/sys-include    -o conftest -std=gnu99 -g -O2 -pipe -Os  -DHAVE_DLFCN_H   conftest.c -ldl  >&5
522configure:12408: $? = 0
523configure:12426: result: yes
524configure:12431: checking whether a statically linked program can dlopen itself
525configure:12511: /opt/local/var/macports/build/_opt_local_var_macports_sources_rsync.macports.org_release_tarballs_ports_lang_gcc48/libgcc/work/build/./gcc/xgcc -B/opt/local/var/macports/build/_opt_local_var_macports_sources_rsync.macports.org_release_tarballs_ports_lang_gcc48/libgcc/work/build/./gcc/ -B/opt/local/x86_64-apple-darwin12/bin/ -B/opt/local/x86_64-apple-darwin12/lib/ -isystem /opt/local/x86_64-apple-darwin12/include -isystem /opt/local/x86_64-apple-darwin12/sys-include    -o conftest -std=gnu99 -g -O2 -pipe -Os  -DHAVE_DLFCN_H    conftest.c -ldl  >&5
526configure:12514: $? = 0
527configure:12532: result: yes
528configure:12571: checking whether stripping libraries is possible
529configure:12585: result: yes
530configure:12611: checking if libtool supports shared libraries
531configure:12613: result: yes
532configure:12616: checking whether to build shared libraries
533configure:12637: result: yes
534configure:12640: checking whether to build static libraries
535configure:12644: result: yes
536configure:12717: checking for x86_64-apple-darwin12-gfortran
537configure:12744: result: /opt/local/var/macports/build/_opt_local_var_macports_sources_rsync.macports.org_release_tarballs_ports_lang_gcc48/libgcc/work/build/./gcc/gfortran -B/opt/local/var/macports/build/_opt_local_var_macports_sources_rsync.macports.org_release_tarballs_ports_lang_gcc48/libgcc/work/build/./gcc/ -B/opt/local/x86_64-apple-darwin12/bin/ -B/opt/local/x86_64-apple-darwin12/lib/ -isystem /opt/local/x86_64-apple-darwin12/include -isystem /opt/local/x86_64-apple-darwin12/sys-include   
538configure:12814: checking for Fortran compiler version
539configure:12823: /opt/local/var/macports/build/_opt_local_var_macports_sources_rsync.macports.org_release_tarballs_ports_lang_gcc48/libgcc/work/build/./gcc/gfortran -B/opt/local/var/macports/build/_opt_local_var_macports_sources_rsync.macports.org_release_tarballs_ports_lang_gcc48/libgcc/work/build/./gcc/ -B/opt/local/x86_64-apple-darwin12/bin/ -B/opt/local/x86_64-apple-darwin12/lib/ -isystem /opt/local/x86_64-apple-darwin12/include -isystem /opt/local/x86_64-apple-darwin12/sys-include    --version >&5
540GNU Fortran (MacPorts gcc48 4.8.2_0) 4.8.2
541Copyright (C) 2013 Free Software Foundation, Inc.
542
543GNU Fortran comes with NO WARRANTY, to the extent permitted by law.
544You may redistribute copies of GNU Fortran
545under the terms of the GNU General Public License.
546For more information about these matters, see the file named COPYING
547
548configure:12834: $? = 0
549configure:12823: /opt/local/var/macports/build/_opt_local_var_macports_sources_rsync.macports.org_release_tarballs_ports_lang_gcc48/libgcc/work/build/./gcc/gfortran -B/opt/local/var/macports/build/_opt_local_var_macports_sources_rsync.macports.org_release_tarballs_ports_lang_gcc48/libgcc/work/build/./gcc/ -B/opt/local/x86_64-apple-darwin12/bin/ -B/opt/local/x86_64-apple-darwin12/lib/ -isystem /opt/local/x86_64-apple-darwin12/include -isystem /opt/local/x86_64-apple-darwin12/sys-include    -v >&5
550Reading specs from /opt/local/var/macports/build/_opt_local_var_macports_sources_rsync.macports.org_release_tarballs_ports_lang_gcc48/libgcc/work/build/./gcc/specs
551COLLECT_GCC=/opt/local/var/macports/build/_opt_local_var_macports_sources_rsync.macports.org_release_tarballs_ports_lang_gcc48/libgcc/work/build/./gcc/gfortran
552COLLECT_LTO_WRAPPER=/opt/local/var/macports/build/_opt_local_var_macports_sources_rsync.macports.org_release_tarballs_ports_lang_gcc48/libgcc/work/build/./gcc/lto-wrapper
553Target: x86_64-apple-darwin12
554Configured with: /opt/local/var/macports/build/_opt_local_var_macports_sources_rsync.macports.org_release_tarballs_ports_lang_gcc48/libgcc/work/gcc-4.8.2/configure --prefix=/opt/local --build=x86_64-apple-darwin12 --includedir=/opt/local/include/gcc48 --infodir=/opt/local/share/info --mandir=/opt/local/share/man --datarootdir=/opt/local/share/gcc-4.8 --with-local-prefix=/opt/local --with-system-zlib --disable-nls --program-suffix=-mp-4.8 --with-gxx-include-dir=/opt/local/include/gcc48/c++/ --with-gmp=/opt/local --with-mpfr=/opt/local --with-mpc=/opt/local --with-cloog=/opt/local --enable-cloog-backend=isl --disable-cloog-version-check --enable-stage1-checking --disable-multilib --enable-lto --enable-libstdcxx-time --with-as=/opt/local/bin/as --with-ld=/opt/local/bin/ld --with-ar=/opt/local/bin/ar --with-bugurl=https://trac.macports.org/newticket --libdir=/opt/local/lib/libgcc --enable-languages=c,c++,objc,obj-c++,lto,fortran --with-pkgversion='MacPorts gcc48 4.8.2_0'
555Thread model: posix
556gcc version 4.8.2 (MacPorts gcc48 4.8.2_0)
557configure:12834: $? = 0
558configure:12823: /opt/local/var/macports/build/_opt_local_var_macports_sources_rsync.macports.org_release_tarballs_ports_lang_gcc48/libgcc/work/build/./gcc/gfortran -B/opt/local/var/macports/build/_opt_local_var_macports_sources_rsync.macports.org_release_tarballs_ports_lang_gcc48/libgcc/work/build/./gcc/ -B/opt/local/x86_64-apple-darwin12/bin/ -B/opt/local/x86_64-apple-darwin12/lib/ -isystem /opt/local/x86_64-apple-darwin12/include -isystem /opt/local/x86_64-apple-darwin12/sys-include    -V >&5
559gfortran: error: unrecognized command line option '-V'
560gfortran: fatal error: no input files
561compilation terminated.
562configure:12834: $? = 1
563configure:12823: /opt/local/var/macports/build/_opt_local_var_macports_sources_rsync.macports.org_release_tarballs_ports_lang_gcc48/libgcc/work/build/./gcc/gfortran -B/opt/local/var/macports/build/_opt_local_var_macports_sources_rsync.macports.org_release_tarballs_ports_lang_gcc48/libgcc/work/build/./gcc/ -B/opt/local/x86_64-apple-darwin12/bin/ -B/opt/local/x86_64-apple-darwin12/lib/ -isystem /opt/local/x86_64-apple-darwin12/include -isystem /opt/local/x86_64-apple-darwin12/sys-include    -qversion >&5
564gfortran: error: unrecognized command line option '-qversion'
565gfortran: fatal error: no input files
566compilation terminated.
567configure:12834: $? = 1
568configure:12843: checking whether we are using the GNU Fortran compiler
569configure:12856: /opt/local/var/macports/build/_opt_local_var_macports_sources_rsync.macports.org_release_tarballs_ports_lang_gcc48/libgcc/work/build/./gcc/gfortran -B/opt/local/var/macports/build/_opt_local_var_macports_sources_rsync.macports.org_release_tarballs_ports_lang_gcc48/libgcc/work/build/./gcc/ -B/opt/local/x86_64-apple-darwin12/bin/ -B/opt/local/x86_64-apple-darwin12/lib/ -isystem /opt/local/x86_64-apple-darwin12/include -isystem /opt/local/x86_64-apple-darwin12/sys-include    -c   conftest.F >&5
570configure:12856: $? = 0
571configure:12865: result: yes
572configure:12871: checking whether /opt/local/var/macports/build/_opt_local_var_macports_sources_rsync.macports.org_release_tarballs_ports_lang_gcc48/libgcc/work/build/./gcc/gfortran -B/opt/local/var/macports/build/_opt_local_var_macports_sources_rsync.macports.org_release_tarballs_ports_lang_gcc48/libgcc/work/build/./gcc/ -B/opt/local/x86_64-apple-darwin12/bin/ -B/opt/local/x86_64-apple-darwin12/lib/ -isystem /opt/local/x86_64-apple-darwin12/include -isystem /opt/local/x86_64-apple-darwin12/sys-include    accepts -g
573configure:12882: /opt/local/var/macports/build/_opt_local_var_macports_sources_rsync.macports.org_release_tarballs_ports_lang_gcc48/libgcc/work/build/./gcc/gfortran -B/opt/local/var/macports/build/_opt_local_var_macports_sources_rsync.macports.org_release_tarballs_ports_lang_gcc48/libgcc/work/build/./gcc/ -B/opt/local/x86_64-apple-darwin12/bin/ -B/opt/local/x86_64-apple-darwin12/lib/ -isystem /opt/local/x86_64-apple-darwin12/include -isystem /opt/local/x86_64-apple-darwin12/sys-include    -c -g  conftest.f >&5
574configure:12882: $? = 0
575configure:12890: result: yes
576configure:13023: checking if libtool supports shared libraries
577configure:13025: result: yes
578configure:13028: checking whether to build shared libraries
579configure:13048: result: yes
580configure:13051: checking whether to build static libraries
581configure:13055: result: yes
582configure:13081: /opt/local/var/macports/build/_opt_local_var_macports_sources_rsync.macports.org_release_tarballs_ports_lang_gcc48/libgcc/work/build/./gcc/gfortran -B/opt/local/var/macports/build/_opt_local_var_macports_sources_rsync.macports.org_release_tarballs_ports_lang_gcc48/libgcc/work/build/./gcc/ -B/opt/local/x86_64-apple-darwin12/bin/ -B/opt/local/x86_64-apple-darwin12/lib/ -isystem /opt/local/x86_64-apple-darwin12/include -isystem /opt/local/x86_64-apple-darwin12/sys-include    -c -g -O2  conftest.f >&5
583configure:13084: $? = 0
584configure:13212: checking for /opt/local/var/macports/build/_opt_local_var_macports_sources_rsync.macports.org_release_tarballs_ports_lang_gcc48/libgcc/work/build/./gcc/gfortran -B/opt/local/var/macports/build/_opt_local_var_macports_sources_rsync.macports.org_release_tarballs_ports_lang_gcc48/libgcc/work/build/./gcc/ -B/opt/local/x86_64-apple-darwin12/bin/ -B/opt/local/x86_64-apple-darwin12/lib/ -isystem /opt/local/x86_64-apple-darwin12/include -isystem /opt/local/x86_64-apple-darwin12/sys-include    option to produce PIC
585configure:13498: result: -fno-common
586configure:13507: checking if /opt/local/var/macports/build/_opt_local_var_macports_sources_rsync.macports.org_release_tarballs_ports_lang_gcc48/libgcc/work/build/./gcc/gfortran -B/opt/local/var/macports/build/_opt_local_var_macports_sources_rsync.macports.org_release_tarballs_ports_lang_gcc48/libgcc/work/build/./gcc/ -B/opt/local/x86_64-apple-darwin12/bin/ -B/opt/local/x86_64-apple-darwin12/lib/ -isystem /opt/local/x86_64-apple-darwin12/include -isystem /opt/local/x86_64-apple-darwin12/sys-include    PIC flag -fno-common works
587configure:13525: /opt/local/var/macports/build/_opt_local_var_macports_sources_rsync.macports.org_release_tarballs_ports_lang_gcc48/libgcc/work/build/./gcc/gfortran -B/opt/local/var/macports/build/_opt_local_var_macports_sources_rsync.macports.org_release_tarballs_ports_lang_gcc48/libgcc/work/build/./gcc/ -B/opt/local/x86_64-apple-darwin12/bin/ -B/opt/local/x86_64-apple-darwin12/lib/ -isystem /opt/local/x86_64-apple-darwin12/include -isystem /opt/local/x86_64-apple-darwin12/sys-include    -c -g -O2 -fno-common  conftest.f >&5
588configure:13529: $? = 0
589configure:13542: result: yes
590configure:13563: checking if /opt/local/var/macports/build/_opt_local_var_macports_sources_rsync.macports.org_release_tarballs_ports_lang_gcc48/libgcc/work/build/./gcc/gfortran -B/opt/local/var/macports/build/_opt_local_var_macports_sources_rsync.macports.org_release_tarballs_ports_lang_gcc48/libgcc/work/build/./gcc/ -B/opt/local/x86_64-apple-darwin12/bin/ -B/opt/local/x86_64-apple-darwin12/lib/ -isystem /opt/local/x86_64-apple-darwin12/include -isystem /opt/local/x86_64-apple-darwin12/sys-include    static flag -static works
591configure:13591: result: no
592configure:13603: checking if /opt/local/var/macports/build/_opt_local_var_macports_sources_rsync.macports.org_release_tarballs_ports_lang_gcc48/libgcc/work/build/./gcc/gfortran -B/opt/local/var/macports/build/_opt_local_var_macports_sources_rsync.macports.org_release_tarballs_ports_lang_gcc48/libgcc/work/build/./gcc/ -B/opt/local/x86_64-apple-darwin12/bin/ -B/opt/local/x86_64-apple-darwin12/lib/ -isystem /opt/local/x86_64-apple-darwin12/include -isystem /opt/local/x86_64-apple-darwin12/sys-include    supports -c -o file.o
593configure:13624: /opt/local/var/macports/build/_opt_local_var_macports_sources_rsync.macports.org_release_tarballs_ports_lang_gcc48/libgcc/work/build/./gcc/gfortran -B/opt/local/var/macports/build/_opt_local_var_macports_sources_rsync.macports.org_release_tarballs_ports_lang_gcc48/libgcc/work/build/./gcc/ -B/opt/local/x86_64-apple-darwin12/bin/ -B/opt/local/x86_64-apple-darwin12/lib/ -isystem /opt/local/x86_64-apple-darwin12/include -isystem /opt/local/x86_64-apple-darwin12/sys-include    -c -g -O2 -o out/conftest2.o  conftest.f >&5
594configure:13628: $? = 0
595configure:13650: result: yes
596configure:13655: checking if /opt/local/var/macports/build/_opt_local_var_macports_sources_rsync.macports.org_release_tarballs_ports_lang_gcc48/libgcc/work/build/./gcc/gfortran -B/opt/local/var/macports/build/_opt_local_var_macports_sources_rsync.macports.org_release_tarballs_ports_lang_gcc48/libgcc/work/build/./gcc/ -B/opt/local/x86_64-apple-darwin12/bin/ -B/opt/local/x86_64-apple-darwin12/lib/ -isystem /opt/local/x86_64-apple-darwin12/include -isystem /opt/local/x86_64-apple-darwin12/sys-include    supports -c -o file.o
597configure:13702: result: yes
598configure:13732: checking whether the /opt/local/var/macports/build/_opt_local_var_macports_sources_rsync.macports.org_release_tarballs_ports_lang_gcc48/libgcc/work/build/./gcc/gfortran -B/opt/local/var/macports/build/_opt_local_var_macports_sources_rsync.macports.org_release_tarballs_ports_lang_gcc48/libgcc/work/build/./gcc/ -B/opt/local/x86_64-apple-darwin12/bin/ -B/opt/local/x86_64-apple-darwin12/lib/ -isystem /opt/local/x86_64-apple-darwin12/include -isystem /opt/local/x86_64-apple-darwin12/sys-include    linker (/opt/local/var/macports/build/_opt_local_var_macports_sources_rsync.macports.org_release_tarballs_ports_lang_gcc48/libgcc/work/build/./gcc/collect-ld) supports shared libraries
599configure:14760: result: yes
600configure:14903: checking dynamic linker characteristics
601configure:15507: result: darwin12 dyld
602configure:15560: checking how to hardcode library paths into programs
603configure:15585: result: immediate
604configure:15630: checking whether the GNU Fortran compiler is working
605configure:15643: /opt/local/var/macports/build/_opt_local_var_macports_sources_rsync.macports.org_release_tarballs_ports_lang_gcc48/libgcc/work/build/./gcc/gfortran -B/opt/local/var/macports/build/_opt_local_var_macports_sources_rsync.macports.org_release_tarballs_ports_lang_gcc48/libgcc/work/build/./gcc/ -B/opt/local/x86_64-apple-darwin12/bin/ -B/opt/local/x86_64-apple-darwin12/lib/ -isystem /opt/local/x86_64-apple-darwin12/include -isystem /opt/local/x86_64-apple-darwin12/sys-include    -c -g -O2  conftest.f >&5
606f951: internal compiler error: Illegal instruction: 4
607
608f951: internal compiler error: Abort trap: 6
609gfortran: internal compiler error: Abort trap: 6 (program f951)
610/opt/local/var/macports/build/_opt_local_var_macports_sources_rsync.macports.org_release_tarballs_ports_lang_gcc48/libgcc/work/gcc-4.8.2/libgfortran/configure: line 1893: 27042 Abort trap: 6           $FC -c $FCFLAGS $ac_fcflags_srcext conftest.$ac_ext 1>&5
611configure:15643: $? = 134
612configure: failed program was:
613|
614|       program foo
615|       real, parameter :: bar = sin (12.34 / 2.5)
616|       end program foo
617configure:15647: result: no
618configure:15649: error: GNU Fortran is not working; please report a bug in http://gcc.gnu.org/bugzilla, attaching /opt/local/var/macports/build/_opt_local_var_macports_sources_rsync.macports.org_release_tarballs_ports_lang_gcc48/libgcc/work/build/x86_64-apple-darwin12/libgfortran/config.log
619
620## ---------------- ##
621## Cache variables. ##
622## ---------------- ##
623
624ac_cv_build=x86_64-apple-darwin12
625ac_cv_c_compiler_gnu=yes
626ac_cv_env_CC_set=set
627ac_cv_env_CC_value='/opt/local/var/macports/build/_opt_local_var_macports_sources_rsync.macports.org_release_tarballs_ports_lang_gcc48/libgcc/work/build/./gcc/xgcc -B/opt/local/var/macports/build/_opt_local_var_macports_sources_rsync.macports.org_release_tarballs_ports_lang_gcc48/libgcc/work/build/./gcc/ -B/opt/local/x86_64-apple-darwin12/bin/ -B/opt/local/x86_64-apple-darwin12/lib/ -isystem /opt/local/x86_64-apple-darwin12/include -isystem /opt/local/x86_64-apple-darwin12/sys-include   '
628ac_cv_env_CFLAGS_set=set
629ac_cv_env_CFLAGS_value='-g -O2 -pipe -Os'
630ac_cv_env_CPPFLAGS_set=set
631ac_cv_env_CPPFLAGS_value=
632ac_cv_env_CPP_set=set
633ac_cv_env_CPP_value='/usr/bin/clang -E'
634ac_cv_env_FCFLAGS_set=
635ac_cv_env_FCFLAGS_value=
636ac_cv_env_FC_set=
637ac_cv_env_FC_value=
638ac_cv_env_LDFLAGS_set=set
639ac_cv_env_LDFLAGS_value=
640ac_cv_env_LIBS_set=
641ac_cv_env_LIBS_value=
642ac_cv_env_build_alias_set=set
643ac_cv_env_build_alias_value=x86_64-apple-darwin12
644ac_cv_env_host_alias_set=set
645ac_cv_env_host_alias_value=x86_64-apple-darwin12
646ac_cv_env_target_alias_set=set
647ac_cv_env_target_alias_value=x86_64-apple-darwin12
648ac_cv_fc_compiler_gnu=yes
649ac_cv_header_dlfcn_h=yes
650ac_cv_header_inttypes_h=yes
651ac_cv_header_memory_h=yes
652ac_cv_header_minix_config_h=no
653ac_cv_header_stdc=yes
654ac_cv_header_stdint_h=yes
655ac_cv_header_stdlib_h=yes
656ac_cv_header_string_h=yes
657ac_cv_header_strings_h=yes
658ac_cv_header_sys_stat_h=yes
659ac_cv_header_sys_types_h=yes
660ac_cv_header_unistd_h=yes
661ac_cv_host=x86_64-apple-darwin12
662ac_cv_lib_dl_dlopen=yes
663ac_cv_objext=o
664ac_cv_path_EGREP='/opt/local/bin/grep -E'
665ac_cv_path_FGREP='/opt/local/bin/grep -F'
666ac_cv_path_GREP=/opt/local/bin/grep
667ac_cv_path_SED=/opt/local/bin/gsed
668ac_cv_path_mkdir=/opt/local/bin/gmkdir
669ac_cv_prog_AR=/opt/local/bin/ar
670ac_cv_prog_AS=/opt/local/var/macports/build/_opt_local_var_macports_sources_rsync.macports.org_release_tarballs_ports_lang_gcc48/libgcc/work/build/./gcc/as
671ac_cv_prog_AWK=gawk
672ac_cv_prog_CC='/opt/local/var/macports/build/_opt_local_var_macports_sources_rsync.macports.org_release_tarballs_ports_lang_gcc48/libgcc/work/build/./gcc/xgcc -B/opt/local/var/macports/build/_opt_local_var_macports_sources_rsync.macports.org_release_tarballs_ports_lang_gcc48/libgcc/work/build/./gcc/ -B/opt/local/x86_64-apple-darwin12/bin/ -B/opt/local/x86_64-apple-darwin12/lib/ -isystem /opt/local/x86_64-apple-darwin12/include -isystem /opt/local/x86_64-apple-darwin12/sys-include   '
673ac_cv_prog_CPP='/usr/bin/clang -E'
674ac_cv_prog_FC='/opt/local/var/macports/build/_opt_local_var_macports_sources_rsync.macports.org_release_tarballs_ports_lang_gcc48/libgcc/work/build/./gcc/gfortran -B/opt/local/var/macports/build/_opt_local_var_macports_sources_rsync.macports.org_release_tarballs_ports_lang_gcc48/libgcc/work/build/./gcc/ -B/opt/local/x86_64-apple-darwin12/bin/ -B/opt/local/x86_64-apple-darwin12/lib/ -isystem /opt/local/x86_64-apple-darwin12/include -isystem /opt/local/x86_64-apple-darwin12/sys-include   '
675ac_cv_prog_LIPO=lipo
676ac_cv_prog_OBJDUMP=/opt/local/bin/objdump
677ac_cv_prog_RANLIB=/opt/local/bin/ranlib
678ac_cv_prog_STRIP=/opt/local/bin/strip
679ac_cv_prog_ac_ct_DSYMUTIL=dsymutil
680ac_cv_prog_ac_ct_NMEDIT=nmedit
681ac_cv_prog_ac_ct_OTOOL=otool
682ac_cv_prog_cc__opt_local_var_macports_build__opt_local_var_macports_sources_rsync_macports_org_release_tarballs_ports_lang_gcc48_libgcc_work_build___gcc_xgcc_c_o=yes
683ac_cv_prog_cc_c89=
684ac_cv_prog_cc_g=yes
685ac_cv_prog_fc_g=yes
686ac_cv_prog_make__usr_bin_make_set=yes
687ac_cv_safe_to_define___extensions__=yes
688ac_cv_target=x86_64-apple-darwin12
689am_cv_CC_dependencies_compiler_type=gcc3
690lt_cv_apple_cc_single_mod=yes
691lt_cv_deplibs_check_method=pass_all
692lt_cv_dlopen=dlopen
693lt_cv_dlopen_libs=-ldl
694lt_cv_dlopen_self=yes
695lt_cv_dlopen_self_static=yes
696lt_cv_file_magic_cmd='$MAGIC_CMD'
697lt_cv_file_magic_test_file=
698lt_cv_ld_exported_symbols_list=yes
699lt_cv_ld_force_load=yes
700lt_cv_ld_reload_flag=-r
701lt_cv_nm_interface='BSD nm'
702lt_cv_objdir=.libs
703lt_cv_path_LD=/opt/local/var/macports/build/_opt_local_var_macports_sources_rsync.macports.org_release_tarballs_ports_lang_gcc48/libgcc/work/build/./gcc/collect-ld
704lt_cv_path_NM=/opt/local/var/macports/build/_opt_local_var_macports_sources_rsync.macports.org_release_tarballs_ports_lang_gcc48/libgcc/work/build/./gcc/nm
705lt_cv_prog_compiler_c_o=yes
706lt_cv_prog_compiler_c_o_FC=yes
707lt_cv_prog_compiler_pic_works=yes
708lt_cv_prog_compiler_pic_works_FC=yes
709lt_cv_prog_compiler_rtti_exceptions=no
710lt_cv_prog_compiler_static_works=no
711lt_cv_prog_compiler_static_works_FC=no
712lt_cv_prog_gnu_ld=no
713lt_cv_sys_global_symbol_pipe='sed -n -e '\''s/^.*[       ]\([BCDEGRST][BCDEGRST]*\)[     ][      ]*_\([_A-Za-z][_A-Za-z0-9]*\)$/\1 _\2 \2/p'\'''
714lt_cv_sys_global_symbol_to_c_name_address='sed -n -e '\''s/^: \([^ ]*\) $/  {\"\1\", (void *) 0},/p'\'' -e '\''s/^[BCDEGRST]* \([^ ]*\) \([^ ]*\)$/  {"\2", (void *) \&\2},/p'\'''
715lt_cv_sys_global_symbol_to_c_name_address_lib_prefix='sed -n -e '\''s/^: \([^ ]*\) $/  {\"\1\", (void *) 0},/p'\'' -e '\''s/^[BCDEGRST]* \([^ ]*\) \(lib[^ ]*\)$/  {"\2", (void *) \&\2},/p'\'' -e '\''s/^[BCDEGRST]* \([^ ]*\) \([^ ]*\)$/  {"lib\2", (void *) \&\2},/p'\'''
716lt_cv_sys_global_symbol_to_cdecl='sed -n -e '\''s/^T .* \(.*\)$/extern int \1();/p'\'' -e '\''s/^[BCDEGRST]* .* \(.*\)$/extern char \1;/p'\'''
717lt_cv_sys_max_cmd_len=196608
718
719## ----------------- ##
720## Output variables. ##
721## ----------------- ##
722
723ACLOCAL='${SHELL} /opt/local/var/macports/build/_opt_local_var_macports_sources_rsync.macports.org_release_tarballs_ports_lang_gcc48/libgcc/work/gcc-4.8.2/missing --run aclocal-1.11'
724AMDEPBACKSLASH='\'
725AMDEP_FALSE='#'
726AMDEP_TRUE=''
727AMTAR='$${TAR-tar}'
728AM_CFLAGS='-std=gnu99 -Wall -Wstrict-prototypes -Wmissing-prototypes -Wold-style-definition -Wextra -Wwrite-strings'
729AM_FCFLAGS='-I . -Wall -Werror -fimplicit-none -fno-repack-arrays -fno-underscoring'
730AR='/opt/local/bin/ar'
731AS='/opt/local/var/macports/build/_opt_local_var_macports_sources_rsync.macports.org_release_tarballs_ports_lang_gcc48/libgcc/work/build/./gcc/as'
732AUTOCONF='${SHELL} /opt/local/var/macports/build/_opt_local_var_macports_sources_rsync.macports.org_release_tarballs_ports_lang_gcc48/libgcc/work/gcc-4.8.2/missing --run autoconf'
733AUTOHEADER='${SHELL} /opt/local/var/macports/build/_opt_local_var_macports_sources_rsync.macports.org_release_tarballs_ports_lang_gcc48/libgcc/work/gcc-4.8.2/missing --run autoheader'
734AUTOMAKE='${SHELL} /opt/local/var/macports/build/_opt_local_var_macports_sources_rsync.macports.org_release_tarballs_ports_lang_gcc48/libgcc/work/gcc-4.8.2/missing --run automake-1.11'
735AWK='gawk'
736CC='/opt/local/var/macports/build/_opt_local_var_macports_sources_rsync.macports.org_release_tarballs_ports_lang_gcc48/libgcc/work/build/./gcc/xgcc -B/opt/local/var/macports/build/_opt_local_var_macports_sources_rsync.macports.org_release_tarballs_ports_lang_gcc48/libgcc/work/build/./gcc/ -B/opt/local/x86_64-apple-darwin12/bin/ -B/opt/local/x86_64-apple-darwin12/lib/ -isystem /opt/local/x86_64-apple-darwin12/include -isystem /opt/local/x86_64-apple-darwin12/sys-include   '
737CCDEPMODE='depmode=gcc3'
738CFLAGS='-std=gnu99 -g -O2 -pipe -Os'
739CPP='/usr/bin/clang -E'
740CPPFLAGS=''
741CYGPATH_W='echo'
742DEFS=''
743DEPDIR='.deps'
744DSYMUTIL='dsymutil'
745DUMPBIN=''
746ECHO_C='\c'
747ECHO_N=''
748ECHO_T=''
749EGREP='/opt/local/bin/grep -E'
750EXEEXT=''
751FC='/opt/local/var/macports/build/_opt_local_var_macports_sources_rsync.macports.org_release_tarballs_ports_lang_gcc48/libgcc/work/build/./gcc/gfortran -B/opt/local/var/macports/build/_opt_local_var_macports_sources_rsync.macports.org_release_tarballs_ports_lang_gcc48/libgcc/work/build/./gcc/ -B/opt/local/x86_64-apple-darwin12/bin/ -B/opt/local/x86_64-apple-darwin12/lib/ -isystem /opt/local/x86_64-apple-darwin12/include -isystem /opt/local/x86_64-apple-darwin12/sys-include   '
752FCFLAGS='-g -O2'
753FGREP='/opt/local/bin/grep -F'
754FPU_HOST_HEADER=''
755GREP='/opt/local/bin/grep'
756IEEE_FLAGS=''
757INSTALL_DATA='/usr/bin/install -c -m 644'
758INSTALL_PROGRAM='/usr/bin/install -c'
759INSTALL_SCRIPT='/usr/bin/install -c'
760INSTALL_STRIP_PROGRAM='$(install_sh) -c -s'
761LD='/opt/local/var/macports/build/_opt_local_var_macports_sources_rsync.macports.org_release_tarballs_ports_lang_gcc48/libgcc/work/build/./gcc/collect-ld'
762LDFLAGS=''
763LIBGFOR_BUILD_QUAD_FALSE=''
764LIBGFOR_BUILD_QUAD_TRUE=''
765LIBGFOR_USE_SYMVER_FALSE=''
766LIBGFOR_USE_SYMVER_GNU_FALSE=''
767LIBGFOR_USE_SYMVER_GNU_TRUE='#'
768LIBGFOR_USE_SYMVER_SUN_FALSE=''
769LIBGFOR_USE_SYMVER_SUN_TRUE='#'
770LIBGFOR_USE_SYMVER_TRUE='#'
771LIBOBJS=''
772LIBQUADINCLUDE=''
773LIBQUADLIB=''
774LIBQUADLIB_DEP=''
775LIBQUADSPEC=''
776LIBS=''
777LIBTOOL='$(SHELL) $(top_builddir)/libtool'
778LIPO='lipo'
779LN_S='ln -s'
780LTLIBOBJS=''
781MAINT='#'
782MAINTAINER_MODE_FALSE=''
783MAINTAINER_MODE_TRUE='#'
784MAKEINFO='makeinfo --split-size=5000000'
785MKDIR_P='/opt/local/bin/gmkdir -p'
786NM='/opt/local/var/macports/build/_opt_local_var_macports_sources_rsync.macports.org_release_tarballs_ports_lang_gcc48/libgcc/work/build/./gcc/nm'
787NMEDIT='nmedit'
788OBJDUMP='/opt/local/bin/objdump'
789OBJEXT='o'
790OTOOL64=':'
791OTOOL='otool'
792PACKAGE='libgfortran'
793PACKAGE_BUGREPORT=''
794PACKAGE_NAME='GNU Fortran Runtime Library'
795PACKAGE_STRING='GNU Fortran Runtime Library 0.3'
796PACKAGE_TARNAME='libgfortran'
797PACKAGE_URL='http://www.gnu.org/software/libgfortran/'
798PACKAGE_VERSION='0.3'
799PATH_SEPARATOR=':'
800RANLIB='/opt/local/bin/ranlib'
801SECTION_FLAGS='-ffunction-sections -fdata-sections'
802SED='/opt/local/bin/gsed'
803SET_MAKE=''
804SHELL='/bin/sh'
805STRIP='/opt/local/bin/strip'
806VERSION='0.3'
807ac_ct_CC=''
808ac_ct_DUMPBIN=''
809ac_ct_FC=''
810am__EXEEXT_FALSE=''
811am__EXEEXT_TRUE=''
812am__fastdepCC_FALSE='#'
813am__fastdepCC_TRUE=''
814am__include='include'
815am__isrc=' -I$(srcdir)'
816am__leading_dot='.'
817am__nodep='_no'
818am__quote=''
819am__tar='$${TAR-tar} chof - "$$tardir"'
820am__untar='$${TAR-tar} xf -'
821bindir='${exec_prefix}/bin'
822build='x86_64-apple-darwin12'
823build_alias='x86_64-apple-darwin12'
824build_cpu='x86_64'
825build_libsubdir='build-x86_64-apple-darwin12'
826build_os='darwin12'
827build_subdir='build-x86_64-apple-darwin12'
828build_vendor='apple'
829datadir='${datarootdir}'
830datarootdir='/opt/local/share/gcc-4.8'
831docdir='${datarootdir}/doc/${PACKAGE_TARNAME}'
832dvidir='${docdir}'
833enable_shared='yes'
834enable_static='yes'
835exec_prefix='NONE'
836extra_ldflags_libgfortran='-Wl,-single_module'
837host='x86_64-apple-darwin12'
838host_alias='x86_64-apple-darwin12'
839host_cpu='x86_64'
840host_os='darwin12'
841host_subdir='.'
842host_vendor='apple'
843htmldir='${docdir}'
844includedir='/opt/local/include/gcc48'
845infodir='/opt/local/share/info'
846install_sh='${SHELL} /opt/local/var/macports/build/_opt_local_var_macports_sources_rsync.macports.org_release_tarballs_ports_lang_gcc48/libgcc/work/gcc-4.8.2/install-sh'
847libdir='/opt/local/lib/libgcc'
848libexecdir='${exec_prefix}/libexec'
849localedir='${datarootdir}/locale'
850localstatedir='${prefix}/var'
851lt_host_flags=''
852mandir='/opt/local/share/man'
853mkdir_p='/opt/local/bin/gmkdir -p'
854multi_basedir='/opt/local/var/macports/build/_opt_local_var_macports_sources_rsync.macports.org_release_tarballs_ports_lang_gcc48/libgcc/work/gcc-4.8.2/libgfortran/..'
855oldincludedir='/usr/include'
856onestep=''
857onestep_FALSE=''
858onestep_TRUE='#'
859pdfdir='${docdir}'
860prefix='/opt/local'
861program_transform_name='s&$$&-mp-4.8&'
862psdir='${docdir}'
863sbindir='${exec_prefix}/sbin'
864sharedstatedir='${prefix}/com'
865sysconfdir='${prefix}/etc'
866target='x86_64-apple-darwin12'
867target_alias='x86_64-apple-darwin12'
868target_cpu='x86_64'
869target_noncanonical='x86_64-apple-darwin12'
870target_os='darwin12'
871target_subdir='x86_64-apple-darwin12'
872target_vendor='apple'
873toolexecdir='$(libdir)/gcc-lib/$(target_alias)'
874toolexeclibdir='$(libdir)'
875
876## ----------- ##
877## confdefs.h. ##
878## ----------- ##
879
880/* confdefs.h */
881#define PACKAGE_NAME "GNU Fortran Runtime Library"
882#define PACKAGE_TARNAME "libgfortran"
883#define PACKAGE_VERSION "0.3"
884#define PACKAGE_STRING "GNU Fortran Runtime Library 0.3"
885#define PACKAGE_BUGREPORT ""
886#define PACKAGE_URL "http://www.gnu.org/software/libgfortran/"
887#define STDC_HEADERS 1
888#define HAVE_SYS_TYPES_H 1
889#define HAVE_SYS_STAT_H 1
890#define HAVE_STDLIB_H 1
891#define HAVE_STRING_H 1
892#define HAVE_MEMORY_H 1
893#define HAVE_STRINGS_H 1
894#define HAVE_INTTYPES_H 1
895#define HAVE_STDINT_H 1
896#define HAVE_UNISTD_H 1
897#define __EXTENSIONS__ 1
898#define _ALL_SOURCE 1
899#define _GNU_SOURCE 1
900#define _POSIX_PTHREAD_SEMANTICS 1
901#define _TANDEM_SOURCE 1
902#define HAVE_DLFCN_H 1
903#define LT_OBJDIR ".libs/"
904
905configure: exit 1